This week only. Pastebin PRO Accounts Christmas Special! Don't miss out!Want more features on Pastebin? Sign Up, it's FREE!
Guest

Untitled

By: a guest on Mar 8th, 2011  |  syntax: None  |  size: 3.43 KB  |  views: 143  |  expires: Never
download  |  raw  |  embed  |  report abuse  |  print
Text below is selected. Please press Ctrl+C to copy to your clipboard. (⌘+C on Mac)
  1. Scanning dependencies of target rstudio-core
  2. [  0%] Building CXX object src/cpp/core/CMakeFiles/rstudio-core.dir/BoostErrors.cpp.o
  3. [  1%] Building CXX object src/cpp/core/CMakeFiles/rstudio-core.dir/DateTime.cpp.o
  4. [  2%] Building CXX object src/cpp/core/CMakeFiles/rstudio-core.dir/Error.cpp.o
  5. [  2%] Building CXX object src/cpp/core/CMakeFiles/rstudio-core.dir/Exec.cpp.o
  6. [  3%] Building CXX object src/cpp/core/CMakeFiles/rstudio-core.dir/FileInfo.cpp.o
  7. [  3%] Building CXX object src/cpp/core/CMakeFiles/rstudio-core.dir/FileLogWriter.cpp.o
  8. [  4%] Building CXX object src/cpp/core/CMakeFiles/rstudio-core.dir/FilePath.cpp.o
  9. /home/jowilkin/src/arch-linux/rstudio/src/rstudio-build/src/cpp/core/FilePath.cpp: In member function ‘std::string core::FilePath::filename() const’:
  10. /home/jowilkin/src/arch-linux/rstudio/src/rstudio-build/src/cpp/core/FilePath.cpp:172:33: error: conversion from ‘boost::filesystem3::path’ to non-scalar type ‘std::string’ requested
  11. /home/jowilkin/src/arch-linux/rstudio/src/rstudio-build/src/cpp/core/FilePath.cpp: In member function ‘std::string core::FilePath::stem() const’:
  12. /home/jowilkin/src/arch-linux/rstudio/src/rstudio-build/src/cpp/core/FilePath.cpp:177:29: error: conversion from ‘boost::filesystem3::path’ to non-scalar type ‘std::string’ requested
  13. /home/jowilkin/src/arch-linux/rstudio/src/rstudio-build/src/cpp/core/FilePath.cpp: In member function ‘std::string core::FilePath::extension() const’:
  14. /home/jowilkin/src/arch-linux/rstudio/src/rstudio-build/src/cpp/core/FilePath.cpp:182:34: error: conversion from ‘boost::filesystem3::path’ to non-scalar type ‘std::string’ requested
  15. /home/jowilkin/src/arch-linux/rstudio/src/rstudio-build/src/cpp/core/FilePath.cpp: In member function ‘core::Error core::FilePath::createDirectory(const std::string&) const’:
  16. /home/jowilkin/src/arch-linux/rstudio/src/rstudio-build/src/cpp/core/FilePath.cpp:446:28: error: ‘complete’ is not a member of ‘boost::filesystem’
  17. /home/jowilkin/src/arch-linux/rstudio/src/rstudio-build/src/cpp/core/FilePath.cpp: In member function ‘core::FilePath core::FilePath::complete(const std::string&) const’:
  18. /home/jowilkin/src/arch-linux/rstudio/src/rstudio-build/src/cpp/core/FilePath.cpp:478:23: error: ‘complete’ is not a member of ‘boost::filesystem’
  19. /home/jowilkin/src/arch-linux/rstudio/src/rstudio-build/src/cpp/core/FilePath.cpp:489:1: warning: control reaches end of non-void function
  20. /home/jowilkin/src/arch-linux/rstudio/src/rstudio-build/src/cpp/core/FilePath.cpp: In member function ‘std::string core::FilePath::extension() const’:
  21. /home/jowilkin/src/arch-linux/rstudio/src/rstudio-build/src/cpp/core/FilePath.cpp:183:1: warning: control reaches end of non-void function
  22. /home/jowilkin/src/arch-linux/rstudio/src/rstudio-build/src/cpp/core/FilePath.cpp: In member function ‘std::string core::FilePath::stem() const’:
  23. /home/jowilkin/src/arch-linux/rstudio/src/rstudio-build/src/cpp/core/FilePath.cpp:178:1: warning: control reaches end of non-void function
  24. /home/jowilkin/src/arch-linux/rstudio/src/rstudio-build/src/cpp/core/FilePath.cpp: In member function ‘std::string core::FilePath::filename() const’:
  25. /home/jowilkin/src/arch-linux/rstudio/src/rstudio-build/src/cpp/core/FilePath.cpp:173:1: warning: control reaches end of non-void function
  26. make[2]: *** [src/cpp/core/CMakeFiles/rstudio-core.dir/FilePath.cpp.o] Error 1
  27. make[1]: *** [src/cpp/core/CMakeFiles/rstudio-core.dir/all] Error 2
  28. make: *** [all] Error 2
clone this paste RAW Paste Data