Pastebin launched a little side project called VERYVIRAL.com, check it out ;-) Want more features on Pastebin? Sign Up, it's FREE!
Guest

Untitled

By: a guest on Aug 24th, 2012  |  syntax: None  |  size: 1.31 KB  |  views: 26  |  expires: Never
download  |  raw  |  embed  |  report abuse  |  print
Text below is selected. Please press Ctrl+C to copy to your clipboard. (⌘+C on Mac)
  1. make
  2. g++ -DVERSION="\"gr-scan 2012082301\"" -std=c++0x -Wall -I/usr/local/include/gnuradio -I/usr/local/include/osmosdr -lgnuradio-core -lgnuradio-osmosdr -lboost_system -O2 -s -Wno-unused-function -o gr-scan main.cpp
  3. In file included from topblock.hpp:30,
  4.                  from main.cpp:23:
  5. scanner_sink.hpp: In member function ‘bool scanner_sink::TrySignal(double, double)’:
  6. scanner_sink.hpp:185: error: expected initializer before ‘:’ token
  7. scanner_sink.hpp:194: error: expected primary-expression at end of input
  8. scanner_sink.hpp:194: error: expected ‘;’ at end of input
  9. scanner_sink.hpp:194: error: expected primary-expression at end of input
  10. scanner_sink.hpp:194: error: expected ‘)’ at end of input
  11. scanner_sink.hpp:194: error: expected statement at end of input
  12. scanner_sink.hpp:194: error: expected ‘}’ at end of input
  13. In file included from main.cpp:23:
  14. topblock.hpp: In member function ‘double TopBlock::GetWindowPower()’:
  15. topblock.hpp:88: error: expected initializer before ‘:’ token
  16. topblock.hpp:91: error: expected primary-expression before ‘return’
  17. topblock.hpp:91: error: expected ‘;’ before ‘return’
  18. topblock.hpp:91: error: expected primary-expression before ‘return’
  19. topblock.hpp:91: error: expected ‘)’ before ‘return’
  20. make: *** [gr-scan] Error 1