Pastebin launched a little side project called HostCabi.net, check it out ;-)Don't like ads? PRO users don't see any ads ;-)
Guest

Untitled

By: a guest on Jun 22nd, 2010  |  syntax: None  |  size: 1.26 KB  |  hits: 172  |  expires: Never
download  |  raw  |  embed  |  report abuse  |  print
Text below is selected. Please press Ctrl+C to copy to your clipboard. (⌘+C on Mac)
  1. [ 33%] Built target default.set
  2. Scanning dependencies of target bongocal
  3. [ 33%] Built target bootstrap
  4. [ 34%] [ 35%] Building C object src/libs/cal/CMakeFiles/bongocal.dir/bongo-cal-object.c.o
  5. Building C object src/libs/cal/CMakeFiles/bongocal.dir/bongo-cal-instance.c.o
  6. [ 36%] Building C object src/libs/cal/CMakeFiles/bongocal.dir/bongo-cal-recur.c.o
  7. [ 37%] Building C object src/libs/cal/CMakeFiles/bongocal.dir/bongo-cal-time.c.o
  8. cc1: warnings being treated as errors
  9. /tmp/yaourt-tmp-root/aur-bongo/src/bongo-0.6.1/src/libs/cal/bongo-cal-recur.c: В функции ‘GenerateInstancesForChunk’:
  10. /tmp/yaourt-tmp-root/aur-bongo/src/bongo-0.6.1/src/libs/cal/bongo-cal-recur.c:1031:21: ошибка: comparison between ‘BongoCalRDateType’ and ‘enum <anonymous>’
  11. make[2]: *** [src/libs/cal/CMakeFiles/bongocal.dir/bongo-cal-recur.c.o] Ошибка 1
  12. make[2]: *** Ожидание завершения заданий...
  13. make[1]: *** [src/libs/cal/CMakeFiles/bongocal.dir/all] Ошибка 2
  14. make[1]: *** Ожидание завершения заданий...
  15. Linking C shared library libbongostreamio.so
  16. [ 37%] Built target bongostreamio
  17. make: *** [all] Ошибка 2
  18.     Преждевременный выход...
  19. ==> ERROR: Makepkg was unable to build bongo.