Want more features on Pastebin? Sign Up, it's FREE!
Guest

Untitled

By: a guest on Jan 30th, 2014  |  syntax: None  |  size: 1.93 KB  |  views: 95  |  expires: Never
download  |  raw  |  embed  |  report abuse  |  print
Text below is selected. Please press Ctrl+C to copy to your clipboard. (⌘+C on Mac)
  1. s.o .libs/math_Uzawa.o .libs/math_ValueAndWeight.o .libs/math_Vector.o   -Wl,-rpath -Wl,/home/alex/New -Wl,-rpath -Wl,Folder/aur-opencascade/src/opencascade-6.7.0/adm/lin/amk/TKernel/.libs -Wl,-rpath -Wl,/home/alex/New ../TKernel/.libs/libTKernel.so -lrt -ldl -lpthread -L/usr/lib/gcc/x86_64-unknown-linux-gnu/4.8.2 -L/usr/lib/gcc/x86_64-unknown-linux-gnu/4.8.2/../../../../lib -L/lib/../lib -L/usr/lib/../lib -L/usr/lib/gcc/x86_64-unknown-linux-gnu/4.8.2/../../.. -lstdc++ -lm -lc -lgcc_s /usr/lib/gcc/x86_64-unknown-linux-gnu/4.8.2/crtendS.o /usr/lib/gcc/x86_64-unknown-linux-gnu/4.8.2/../../../../lib/crtn.o  -march=x86-64 -mtune=generic -O2 -mmmx -msse -msse2 -mfpmath=sse -O2 -Wl,-O1 -Wl,--sort-common -Wl,--as-needed -Wl,-z -Wl,relro   -Wl,-soname -Wl,libTKMath.so.0 -o .libs/libTKMath.so.0.0.0
  2. libtool: link: (cd ".libs" && rm -f "libTKMath.so.0" && ln -s "libTKMath.so.0.0.0" "libTKMath.so.0")
  3. libtool: link: (cd ".libs" && rm -f "libTKMath.so" && ln -s "libTKMath.so.0.0.0" "libTKMath.so")
  4. /usr/bin/sed: can't read Folder/aur-opencascade/src/opencascade-6.7.0/adm/lin/amk/TKernel/libTKernel.la: No such file or directory
  5. libtool: link: `Folder/aur-opencascade/src/opencascade-6.7.0/adm/lin/amk/TKernel/libTKernel.la' is not a valid libtool archive
  6. Makefile:838: recipe for target 'libTKMath.la' failed
  7. make[3]: *** [libTKMath.la] Error 1
  8. make[3]: Leaving directory '/home/alex/New Folder/aur-opencascade/src/opencascade-6.7.0/adm/lin/amk/TKMath'
  9. Makefile:431: recipe for target 'all-recursive' failed
  10. make[2]: *** [all-recursive] Error 1
  11. make[2]: Leaving directory '/home/alex/New Folder/aur-opencascade/src/opencascade-6.7.0/adm/lin/amk'
  12. Makefile:465: recipe for target 'all-recursive' failed
  13. make[1]: *** [all-recursive] Error 1
  14. make[1]: Leaving directory '/home/alex/New Folder/aur-opencascade/src/opencascade-6.7.0'
  15. Makefile:394: recipe for target 'all' failed
  16. make: *** [all] Error 2
  17. ==> ERROR: A failure occurred in build().
  18.     Aborting...
clone this paste RAW Paste Data