Advertisement
Guest User

Untitled

a guest
Aug 17th, 2015
228
0
Never
Not a member of Pastebin yet? Sign Up, it unlocks many cool features!
text 3.00 KB | None | 0 0
  1. /tmp/ccmC75TI.s: Assembler messages:
  2. /tmp/ccmC75TI.s:518: Error: selected processor does not support ARM mode `cpsid i'
  3. /devel/v4l/linux-next/scripts/Makefile.build:264: recipe for target 'drivers/staging/media/lirc/lirc_sir.o' failed
  4. make[3]: *** [drivers/staging/media/lirc/lirc_sir.o] Error 1
  5. make[3]: ** Esperando que outros processos terminem.
  6. /tmp/ccHCMYRF.s: Assembler messages:
  7. /tmp/ccHCMYRF.s:2444: Error: selected processor does not support ARM mode `cpsid i'
  8. /devel/v4l/linux-next/scripts/Makefile.build:264: recipe for target 'drivers/staging/media/lirc/lirc_parallel.o' failed
  9. make[3]: *** [drivers/staging/media/lirc/lirc_parallel.o] Error 1
  10. /tmp/ccYfo4PI.s: Assembler messages:
  11. /tmp/ccYfo4PI.s:271: Error: selected processor does not support ARM mode `ldrex r0,[r5]'
  12. /tmp/ccYfo4PI.s:273: Error: selected processor does not support ARM mode `strex r3,r0,[r5]'
  13. /tmp/ccYfo4PI.s:416: Error: selected processor does not support ARM mode `ldrex r0,[r5]'
  14. /tmp/ccYfo4PI.s:418: Error: selected processor does not support ARM mode `strex r3,r0,[r5]'
  15. /tmp/ccYfo4PI.s:628: Error: selected processor does not support ARM mode `ldrex ip,[r0]'
  16. /tmp/ccYfo4PI.s:630: Error: selected processor does not support ARM mode `strex r3,ip,[r0]'
  17. /tmp/ccYfo4PI.s:709: Error: selected processor does not support ARM mode `ldrex r1,[r5]'
  18. /tmp/ccYfo4PI.s:711: Error: selected processor does not support ARM mode `strex r3,r1,[r5]'
  19. /tmp/ccYfo4PI.s:824: Error: selected processor does not support ARM mode `ldrex r3,[r1]'
  20. /tmp/ccYfo4PI.s:826: Error: selected processor does not support ARM mode `strex r2,r3,[r1]'
  21. /tmp/ccYfo4PI.s:911: Error: selected processor does not support ARM mode `ldrex r1,[r5]'
  22. /tmp/ccYfo4PI.s:913: Error: selected processor does not support ARM mode `strex r3,r1,[r5]'
  23. /tmp/ccYfo4PI.s:1064: Error: selected processor does not support ARM mode `ldrex r1,[r5]'
  24. /tmp/ccYfo4PI.s:1066: Error: selected processor does not support ARM mode `strex r3,r1,[r5]'
  25. /tmp/ccYfo4PI.s:5813: Error: selected processor does not support ARM mode `ldrex r0,[r5]'
  26. /tmp/ccYfo4PI.s:5815: Error: selected processor does not support ARM mode `strex r3,r0,[r5]'
  27. /tmp/ccYfo4PI.s:6032: Error: selected processor does not support ARM mode `ldrex r3,[r1]'
  28. /tmp/ccYfo4PI.s:6034: Error: selected processor does not support ARM mode `strex r2,r3,[r1]'
  29. /devel/v4l/linux-next/scripts/Makefile.build:264: recipe for target 'drivers/staging/media/lirc/lirc_zilog.o' failed
  30. make[3]: *** [drivers/staging/media/lirc/lirc_zilog.o] Error 1
  31. /devel/v4l/linux-next/scripts/Makefile.build:403: recipe for target 'drivers/staging/media/lirc' failed
  32. make[2]: *** [drivers/staging/media/lirc] Error 2
  33. make[2]: ** Esperando que outros processos terminem.
  34. /devel/v4l/linux-next/Makefile:1404: recipe for target '_module_drivers/staging/media' failed
  35. make[1]: *** [_module_drivers/staging/media] Error 2
  36. make[1]: Leaving directory '/devel/v4l/ktests/ktest-cross-compile'
  37. Makefile:146: recipe for target 'sub-make' failed
  38. make: *** [sub-make] Error 2
  39. [2 seconds] FAILED!
  40. FAILED
Advertisement
Add Comment
Please, Sign In to add comment
Advertisement