Pastebin launched a little side project called VERYVIRAL.com, check it out ;-) Want more features on Pastebin? Sign Up, it's FREE!
Guest

Untitled

By: a guest on Nov 6th, 2012  |  syntax: None  |  size: 1.56 KB  |  views: 74  |  expires: Never
download  |  raw  |  embed  |  report abuse  |  print
Text below is selected. Please press Ctrl+C to copy to your clipboard. (⌘+C on Mac)
  1. $ LC_ALL=C makepkg -csi
  2. [...]
  3. Making all in src
  4. make[2]: Entering directory `/home/dennis/Hämtningar/AUR/cinnamon/src/linuxmint-Cinnamon-e84a25b/src'
  5.   GEN      st-enum-types.c
  6.   GEN      stamp-st-marshal.h
  7.   GEN      st-marshal.c
  8.   GEN      stamp-st.h
  9.   GEN      stamp-na-marshal.h
  10.   GEN      na-marshal.c
  11.   GEN      stamp-cinnamon-marshal.h
  12.   GEN      cinnamon-marshal.c
  13.   GEN      cinnamon-enum-types.c
  14. make  all-am
  15. make[3]: Entering directory `/home/dennis/Hämtningar/AUR/cinnamon/src/linuxmint-Cinnamon-e84a25b/src'
  16.   CC       libst_1_0_la-st-bin.lo
  17. st/st-bin.c: In function 'st_bin_set_child':
  18. st/st-bin.c:465:7: error: 'clutter_actor_unparent' is deprecated (declared at /usr/include/clutter-1.0/clutter/deprecated/clutter-actor.h:58): Use 'clutter_actor_remove_child' instead [-Werror=deprecated-declarations]
  19. st/st-bin.c:475:7: error: 'clutter_actor_set_parent' is deprecated (declared at /usr/include/clutter-1.0/clutter/deprecated/clutter-actor.h:54): Use 'clutter_actor_add_child' instead [-Werror=deprecated-declarations]
  20. cc1: all warnings being treated as errors
  21. make[3]: *** [libst_1_0_la-st-bin.lo] Error 1
  22. make[3]: Leaving directory `/home/dennis/Hämtningar/AUR/cinnamon/src/linuxmint-Cinnamon-e84a25b/src'
  23. make[2]: *** [all] Error 2
  24. make[2]: Leaving directory `/home/dennis/Hämtningar/AUR/cinnamon/src/linuxmint-Cinnamon-e84a25b/src'
  25. make[1]: *** [all-recursive] Error 1
  26. make[1]: Leaving directory `/home/dennis/Hämtningar/AUR/cinnamon/src/linuxmint-Cinnamon-e84a25b'
  27. make: *** [all] Error 2
  28. ==> ERROR: A failure occurred in build().
  29.     Aborting...
clone this paste RAW Paste Data