Pastebin launched a little side project called VERYVIRAL.com, check it out ;-) Want more features on Pastebin? Sign Up, it's FREE!
Guest

Untitled

By: a guest on Dec 7th, 2013  |  syntax: None  |  size: 1.67 KB  |  views: 33  |  expires: Never
download  |  raw  |  embed  |  report abuse  |  print
Text below is selected. Please press Ctrl+C to copy to your clipboard. (⌘+C on Mac)
  1. ==> Starting package()...
  2. Making install in contrib
  3. make[2]: Nothing to be done for 'install-exec-am'.
  4. make[2]: Nothing to be done for 'install-data-am'.
  5. Making install in tests
  6. make[2]: Nothing to be done for 'install-exec-am'.
  7. make[2]: Nothing to be done for 'install-data-am'.
  8.  /usr/bin/mkdir -p '/tmp/yaourt-tmp-onny/aur-libsigrokdecode-git/pkg/libsigrokdecode-git/usr/lib'
  9.  /bin/sh ./libtool --silent  --mode=install /usr/bin/install -c   libsigrokdecode.la '/tmp/yaourt-tmp-onny/aur-libsigrokdecode-git/pkg/libsigrokdecode-git/usr/lib'
  10. libtool: install: warning: remember to run `libtool --finish /usr/lib'
  11.  /usr/bin/mkdir -p '/tmp/yaourt-tmp-onny/aur-libsigrokdecode-git/pkg/libsigrokdecode-git/usr/include/libsigrokdecode'
  12.  /usr/bin/install -c -m 644 libsigrokdecode.h version.h '/tmp/yaourt-tmp-onny/aur-libsigrokdecode-git/pkg/libsigrokdecode-git/usr/include/libsigrokdecode'
  13.  /usr/bin/mkdir -p '/tmp/yaourt-tmp-onny/aur-libsigrokdecode-git/pkg/libsigrokdecode-git/usr/lib/pkgconfig'
  14.  /usr/bin/install -c -m 644 libsigrokdecode.pc '/tmp/yaourt-tmp-onny/aur-libsigrokdecode-git/pkg/libsigrokdecode-git/usr/lib/pkgconfig'
  15. make  install-data-hook
  16. /usr/bin/mkdir -p /usr/share/libsigrokdecode/decoders
  17. /usr/bin/mkdir: cannot create directory ‘/usr/share/libsigrokdecode’: Permission denied
  18. Makefile:1174: recipe for target 'install-decoders' failed
  19. make[3]: *** [install-decoders] Error 1
  20. Makefile:1091: recipe for target 'install-data-am' failed
  21. make[2]: *** [install-data-am] Error 2
  22. Makefile:1041: recipe for target 'install-am' failed
  23. make[1]: *** [install-am] Error 2
  24. Makefile:732: recipe for target 'install-recursive' failed
  25. make: *** [install-recursive] Error 1