SHARE
TWEET

Untitled

a guest Aug 26th, 2010 271 Never
  1. ==> Starting make...
  2. patching file src/lib/ffmpeg/avcodec.pas
  3. Hunk #1 FAILED at 82.
  4. 1 out of 1 hunk FAILED -- saving rejects to file src/lib/ffmpeg/avcodec.pas.rej
  5. patching file src/lib/ffmpeg/avformat.pas
  6. Hunk #1 FAILED at 81.
  7. 1 out of 1 hunk FAILED -- saving rejects to file src/lib/ffmpeg/avformat.pas.rej
  8. patching file src/lib/ffmpeg/avutil.pas
  9. Hunk #1 FAILED at 92.
  10. 1 out of 1 hunk FAILED -- saving rejects to file src/lib/ffmpeg/avutil.pas.rej
  11. patching file src/lib/ffmpeg/swscale.pas
  12. Hunk #1 succeeded at 72 with fuzz 1.
  13.     Breche ab ...
  14. ==> ERROR: Makepkg was unable to build ultrastardx-svn.
RAW Paste Data
Top