Guest User

Untitled

a guest
Nov 10th, 2013
257
0
Never
Not a member of Pastebin yet? Sign Up, it unlocks many cool features!
text 83.38 KB | None | 0 0
  1. This file contains any messages produced by compilers while
  2. running configure, to aid debugging if configure makes a mistake.
  3.  
  4. It was created by Bitcoin configure 0.8.99, which was
  5. generated by GNU Autoconf 2.69. Invocation command line was
  6.  
  7. $ ./configure
  8.  
  9. ## --------- ##
  10. ## Platform. ##
  11. ## --------- ##
  12.  
  13. hostname = waterford.local
  14. uname -m = x86_64
  15. uname -r = 13.0.0
  16. uname -s = Darwin
  17. uname -v = Darwin Kernel Version 13.0.0: Thu Sep 19 22:22:27 PDT 2013; root:xnu-2422.1.72~6/RELEASE_X86_64
  18.  
  19. /usr/bin/uname -p = i386
  20. /bin/uname -X = unknown
  21.  
  22. /bin/arch = unknown
  23. /usr/bin/arch -k = unknown
  24. /usr/convex/getsysinfo = unknown
  25. /usr/bin/hostinfo = Mach kernel version:
  26. Darwin Kernel Version 13.0.0: Thu Sep 19 22:22:27 PDT 2013; root:xnu-2422.1.72~6/RELEASE_X86_64
  27. Kernel configured for up to 4 processors.
  28. 2 processors are physically available.
  29. 4 processors are logically available.
  30. Processor type: i486 (Intel 80486)
  31. Processors active: 0 1 2 3
  32. Primary memory available: 8.00 gigabytes
  33. Default processor set: 201 tasks, 1451 threads, 4 processors
  34. Load average: 2.01, Mach factor: 2.02
  35. /bin/machine = unknown
  36. /usr/bin/oslevel = unknown
  37. /bin/universe = unknown
  38.  
  39. PATH: /opt/local/bin
  40. PATH: /opt/local/sbin
  41. PATH: /usr/bin
  42. PATH: /bin
  43. PATH: /usr/sbin
  44. PATH: /sbin
  45. PATH: /usr/local/bin
  46. PATH: /opt/X11/bin
  47. PATH: /usr/local/git/bin
  48. PATH: /usr/local/MacGPG2/bin
  49.  
  50.  
  51. ## ----------- ##
  52. ## Core tests. ##
  53. ## ----------- ##
  54.  
  55. configure:2588: checking build system type
  56. configure:2602: result: x86_64-apple-darwin13.0.0
  57. configure:2622: checking host system type
  58. configure:2635: result: x86_64-apple-darwin13.0.0
  59. configure:2770: checking for a BSD-compatible install
  60. configure:2838: result: /usr/bin/install -c
  61. configure:2849: checking whether build environment is sane
  62. configure:2904: result: yes
  63. configure:3055: checking for a thread-safe mkdir -p
  64. configure:3094: result: src/build-aux/install-sh -c -d
  65. configure:3101: checking for gawk
  66. configure:3131: result: no
  67. configure:3101: checking for mawk
  68. configure:3131: result: no
  69. configure:3101: checking for nawk
  70. configure:3131: result: no
  71. configure:3101: checking for awk
  72. configure:3117: found /usr/bin/awk
  73. configure:3128: result: awk
  74. configure:3139: checking whether make sets $(MAKE)
  75. configure:3161: result: yes
  76. configure:3190: checking whether make supports nested variables
  77. configure:3207: result: yes
  78. configure:3325: checking whether to enable maintainer-specific portions of Makefiles
  79. configure:3334: result: yes
  80. configure:3359: checking whether make supports nested variables
  81. configure:3376: result: yes
  82. configure:3583: checking for g++
  83. configure:3599: found /usr/bin/g++
  84. configure:3610: result: g++
  85. configure:3637: checking for C++ compiler version
  86. configure:3646: g++ --version >&5
  87. Apple LLVM version 5.0 (clang-500.2.79) (based on LLVM 3.3svn)
  88. Target: x86_64-apple-darwin13.0.0
  89. Thread model: posix
  90. Configured with: --prefix=/Applications/Xcode.app/Contents/Developer/usr --with-gxx-include-dir=/Applications/Xcode.app/Contents/Developer/Platforms/MacOSX.platform/Developer/SDKs/MacOSX10.9.sdk/usr/include/c++/4.2.1
  91. configure:3657: $? = 0
  92. configure:3646: g++ -v >&5
  93. Configured with: --prefix=/Applications/Xcode.app/Contents/Developer/usr --with-gxx-include-dir=/Applications/Xcode.app/Contents/Developer/Platforms/MacOSX.platform/Developer/SDKs/MacOSX10.9.sdk/usr/include/c++/4.2.1
  94. Apple LLVM version 5.0 (clang-500.2.79) (based on LLVM 3.3svn)
  95. Target: x86_64-apple-darwin13.0.0
  96. Thread model: posix
  97. configure:3657: $? = 0
  98. configure:3646: g++ -V >&5
  99. clang: error: argument to '-V' is missing (expected 1 value)
  100. clang: error: no input files
  101. configure:3657: $? = 1
  102. configure:3646: g++ -qversion >&5
  103. clang: error: no input files
  104. configure:3657: $? = 1
  105. configure:3677: checking whether the C++ compiler works
  106. configure:3699: g++ conftest.cpp >&5
  107. configure:3703: $? = 0
  108. configure:3751: result: yes
  109. configure:3754: checking for C++ compiler default output file name
  110. configure:3756: result: a.out
  111. configure:3762: checking for suffix of executables
  112. configure:3769: g++ -o conftest conftest.cpp >&5
  113. configure:3773: $? = 0
  114. configure:3795: result:
  115. configure:3817: checking whether we are cross compiling
  116. configure:3825: g++ -o conftest conftest.cpp >&5
  117. configure:3829: $? = 0
  118. configure:3836: ./conftest
  119. configure:3840: $? = 0
  120. configure:3855: result: no
  121. configure:3860: checking for suffix of object files
  122. configure:3882: g++ -c conftest.cpp >&5
  123. configure:3886: $? = 0
  124. configure:3907: result: o
  125. configure:3911: checking whether we are using the GNU C++ compiler
  126. configure:3930: g++ -c conftest.cpp >&5
  127. configure:3930: $? = 0
  128. configure:3939: result: yes
  129. configure:3948: checking whether g++ accepts -g
  130. configure:3968: g++ -c -g conftest.cpp >&5
  131. configure:3968: $? = 0
  132. configure:4009: result: yes
  133. configure:4043: checking for style of include used by make
  134. configure:4071: result: GNU
  135. configure:4097: checking dependency style of g++
  136. configure:4208: result: gcc3
  137. configure:4271: checking for gcc
  138. configure:4287: found /usr/bin/gcc
  139. configure:4298: result: gcc
  140. configure:4527: checking for C compiler version
  141. configure:4536: gcc --version >&5
  142. Apple LLVM version 5.0 (clang-500.2.79) (based on LLVM 3.3svn)
  143. Target: x86_64-apple-darwin13.0.0
  144. Thread model: posix
  145. Configured with: --prefix=/Applications/Xcode.app/Contents/Developer/usr --with-gxx-include-dir=/Applications/Xcode.app/Contents/Developer/Platforms/MacOSX.platform/Developer/SDKs/MacOSX10.9.sdk/usr/include/c++/4.2.1
  146. configure:4547: $? = 0
  147. configure:4536: gcc -v >&5
  148. Configured with: --prefix=/Applications/Xcode.app/Contents/Developer/usr --with-gxx-include-dir=/Applications/Xcode.app/Contents/Developer/Platforms/MacOSX.platform/Developer/SDKs/MacOSX10.9.sdk/usr/include/c++/4.2.1
  149. Apple LLVM version 5.0 (clang-500.2.79) (based on LLVM 3.3svn)
  150. Target: x86_64-apple-darwin13.0.0
  151. Thread model: posix
  152. configure:4547: $? = 0
  153. configure:4536: gcc -V >&5
  154. clang: error: argument to '-V' is missing (expected 1 value)
  155. clang: error: no input files
  156. configure:4547: $? = 1
  157. configure:4536: gcc -qversion >&5
  158. clang: error: no input files
  159. configure:4547: $? = 1
  160. configure:4551: checking whether we are using the GNU C compiler
  161. configure:4570: gcc -c conftest.c >&5
  162. configure:4570: $? = 0
  163. configure:4579: result: yes
  164. configure:4588: checking whether gcc accepts -g
  165. configure:4608: gcc -c -g conftest.c >&5
  166. configure:4608: $? = 0
  167. configure:4649: result: yes
  168. configure:4666: checking for gcc option to accept ISO C89
  169. configure:4729: gcc -c -g -O2 conftest.c >&5
  170. configure:4729: $? = 0
  171. configure:4742: result: none needed
  172. configure:4767: checking whether gcc understands -c and -o together
  173. configure:4789: gcc -c conftest.c -o conftest2.o
  174. configure:4792: $? = 0
  175. configure:4789: gcc -c conftest.c -o conftest2.o
  176. configure:4792: $? = 0
  177. configure:4804: result: yes
  178. configure:4823: checking dependency style of gcc
  179. configure:4934: result: gcc3
  180. configure:4954: checking how to run the C preprocessor
  181. configure:4985: gcc -E conftest.c
  182. configure:4985: $? = 0
  183. configure:4999: gcc -E conftest.c
  184. conftest.c:9:10: fatal error: 'ac_nonexistent.h' file not found
  185. #include <ac_nonexistent.h>
  186. ^
  187. 1 error generated.
  188. configure:4999: $? = 1
  189. configure: failed program was:
  190. | /* confdefs.h */
  191. | #define PACKAGE_NAME "Bitcoin"
  192. | #define PACKAGE_TARNAME "bitcoin"
  193. | #define PACKAGE_VERSION "0.8.99"
  194. | #define PACKAGE_STRING "Bitcoin 0.8.99"
  195. | #define PACKAGE_BUGREPORT "[email protected]"
  196. | #define PACKAGE_URL ""
  197. | /* end confdefs.h. */
  198. | #include <ac_nonexistent.h>
  199. configure:5024: result: gcc -E
  200. configure:5044: gcc -E conftest.c
  201. configure:5044: $? = 0
  202. configure:5058: gcc -E conftest.c
  203. conftest.c:9:10: fatal error: 'ac_nonexistent.h' file not found
  204. #include <ac_nonexistent.h>
  205. ^
  206. 1 error generated.
  207. configure:5058: $? = 1
  208. configure: failed program was:
  209. | /* confdefs.h */
  210. | #define PACKAGE_NAME "Bitcoin"
  211. | #define PACKAGE_TARNAME "bitcoin"
  212. | #define PACKAGE_VERSION "0.8.99"
  213. | #define PACKAGE_STRING "Bitcoin 0.8.99"
  214. | #define PACKAGE_BUGREPORT "[email protected]"
  215. | #define PACKAGE_URL ""
  216. | /* end confdefs.h. */
  217. | #include <ac_nonexistent.h>
  218. configure:5091: checking how to run the C++ preprocessor
  219. configure:5118: g++ -E conftest.cpp
  220. configure:5118: $? = 0
  221. configure:5132: g++ -E conftest.cpp
  222. conftest.cpp:9:10: fatal error: 'ac_nonexistent.h' file not found
  223. #include <ac_nonexistent.h>
  224. ^
  225. 1 error generated.
  226. configure:5132: $? = 1
  227. configure: failed program was:
  228. | /* confdefs.h */
  229. | #define PACKAGE_NAME "Bitcoin"
  230. | #define PACKAGE_TARNAME "bitcoin"
  231. | #define PACKAGE_VERSION "0.8.99"
  232. | #define PACKAGE_STRING "Bitcoin 0.8.99"
  233. | #define PACKAGE_BUGREPORT "[email protected]"
  234. | #define PACKAGE_URL ""
  235. | /* end confdefs.h. */
  236. | #include <ac_nonexistent.h>
  237. configure:5157: result: g++ -E
  238. configure:5177: g++ -E conftest.cpp
  239. configure:5177: $? = 0
  240. configure:5191: g++ -E conftest.cpp
  241. conftest.cpp:9:10: fatal error: 'ac_nonexistent.h' file not found
  242. #include <ac_nonexistent.h>
  243. ^
  244. 1 error generated.
  245. configure:5191: $? = 1
  246. configure: failed program was:
  247. | /* confdefs.h */
  248. | #define PACKAGE_NAME "Bitcoin"
  249. | #define PACKAGE_TARNAME "bitcoin"
  250. | #define PACKAGE_VERSION "0.8.99"
  251. | #define PACKAGE_STRING "Bitcoin 0.8.99"
  252. | #define PACKAGE_BUGREPORT "[email protected]"
  253. | #define PACKAGE_URL ""
  254. | /* end confdefs.h. */
  255. | #include <ac_nonexistent.h>
  256. configure:5274: checking for gcc
  257. configure:5290: found /usr/bin/gcc
  258. configure:5301: result: gcc
  259. configure:5326: checking for Objective C compiler version
  260. configure:5335: gcc --version >&5
  261. Apple LLVM version 5.0 (clang-500.2.79) (based on LLVM 3.3svn)
  262. Target: x86_64-apple-darwin13.0.0
  263. Thread model: posix
  264. Configured with: --prefix=/Applications/Xcode.app/Contents/Developer/usr --with-gxx-include-dir=/Applications/Xcode.app/Contents/Developer/Platforms/MacOSX.platform/Developer/SDKs/MacOSX10.9.sdk/usr/include/c++/4.2.1
  265. configure:5346: $? = 0
  266. configure:5335: gcc -v >&5
  267. Configured with: --prefix=/Applications/Xcode.app/Contents/Developer/usr --with-gxx-include-dir=/Applications/Xcode.app/Contents/Developer/Platforms/MacOSX.platform/Developer/SDKs/MacOSX10.9.sdk/usr/include/c++/4.2.1
  268. Apple LLVM version 5.0 (clang-500.2.79) (based on LLVM 3.3svn)
  269. Target: x86_64-apple-darwin13.0.0
  270. Thread model: posix
  271. configure:5346: $? = 0
  272. configure:5335: gcc -V >&5
  273. clang: error: argument to '-V' is missing (expected 1 value)
  274. clang: error: no input files
  275. configure:5346: $? = 1
  276. configure:5335: gcc -qversion >&5
  277. clang: error: no input files
  278. configure:5346: $? = 1
  279. configure:5350: checking whether we are using the GNU Objective C compiler
  280. configure:5369: gcc -c conftest.m >&5
  281. configure:5369: $? = 0
  282. configure:5378: result: yes
  283. configure:5387: checking whether gcc accepts -g
  284. configure:5407: gcc -c -g conftest.m >&5
  285. configure:5407: $? = 0
  286. configure:5448: result: yes
  287. configure:5473: checking dependency style of gcc
  288. configure:5582: result: gcc3
  289. configure:5651: checking for g++
  290. configure:5667: found /usr/bin/g++
  291. configure:5678: result: g++
  292. configure:5703: checking for Objective C++ compiler version
  293. configure:5712: g++ --version >&5
  294. Apple LLVM version 5.0 (clang-500.2.79) (based on LLVM 3.3svn)
  295. Target: x86_64-apple-darwin13.0.0
  296. Thread model: posix
  297. Configured with: --prefix=/Applications/Xcode.app/Contents/Developer/usr --with-gxx-include-dir=/Applications/Xcode.app/Contents/Developer/Platforms/MacOSX.platform/Developer/SDKs/MacOSX10.9.sdk/usr/include/c++/4.2.1
  298. configure:5723: $? = 0
  299. configure:5712: g++ -v >&5
  300. Configured with: --prefix=/Applications/Xcode.app/Contents/Developer/usr --with-gxx-include-dir=/Applications/Xcode.app/Contents/Developer/Platforms/MacOSX.platform/Developer/SDKs/MacOSX10.9.sdk/usr/include/c++/4.2.1
  301. Apple LLVM version 5.0 (clang-500.2.79) (based on LLVM 3.3svn)
  302. Target: x86_64-apple-darwin13.0.0
  303. Thread model: posix
  304. configure:5723: $? = 0
  305. configure:5712: g++ -V >&5
  306. clang: error: argument to '-V' is missing (expected 1 value)
  307. clang: error: no input files
  308. configure:5723: $? = 1
  309. configure:5712: g++ -qversion >&5
  310. clang: error: no input files
  311. configure:5723: $? = 1
  312. configure:5727: checking whether we are using the GNU Objective C++ compiler
  313. configure:5746: g++ -c conftest.mm >&5
  314. configure:5746: $? = 0
  315. configure:5755: result: yes
  316. configure:5764: checking whether g++ accepts -g
  317. configure:5784: g++ -c -g conftest.mm >&5
  318. configure:5784: $? = 0
  319. configure:5825: result: yes
  320. configure:5850: checking dependency style of g++
  321. configure:5959: result: gcc3
  322. configure:5975: checking for a sed that does not truncate output
  323. configure:6039: result: /usr/bin/sed
  324. configure:6090: checking for ar
  325. configure:6108: found /usr/bin/ar
  326. configure:6120: result: /usr/bin/ar
  327. configure:6188: checking for ranlib
  328. configure:6206: found /usr/bin/ranlib
  329. configure:6218: result: /usr/bin/ranlib
  330. configure:6286: checking for strip
  331. configure:6304: found /usr/bin/strip
  332. configure:6316: result: /usr/bin/strip
  333. configure:6384: checking for gcov
  334. configure:6402: found /usr/bin/gcov
  335. configure:6414: result: /usr/bin/gcov
  336. configure:6438: checking for lcov
  337. configure:6471: result: no
  338. configure:6478: checking for java
  339. configure:6496: found /usr/bin/java
  340. configure:6508: result: /usr/bin/java
  341. configure:6518: checking for genhtml
  342. configure:6551: result: no
  343. configure:6558: checking for git
  344. configure:6576: found /usr/bin/git
  345. configure:6588: result: /usr/bin/git
  346. configure:6600: checking for moc-qt4
  347. configure:6634: result: no
  348. configure:6600: checking for moc4
  349. configure:6634: result: no
  350. configure:6600: checking for moc
  351. configure:6619: found /usr/local/bin/moc
  352. configure:6631: result: /usr/local/bin/moc
  353. configure:6646: checking for uic-qt4
  354. configure:6680: result: no
  355. configure:6646: checking for uic4
  356. configure:6680: result: no
  357. configure:6646: checking for uic
  358. configure:6665: found /usr/local/bin/uic
  359. configure:6677: result: /usr/local/bin/uic
  360. configure:6692: checking for rcc-qt4
  361. configure:6726: result: no
  362. configure:6692: checking for rcc4
  363. configure:6726: result: no
  364. configure:6692: checking for rcc
  365. configure:6711: found /usr/local/bin/rcc
  366. configure:6723: result: /usr/local/bin/rcc
  367. configure:6738: checking for lrelease-qt4
  368. configure:6772: result: no
  369. configure:6738: checking for lrelease4
  370. configure:6772: result: no
  371. configure:6738: checking for lrelease
  372. configure:6757: found /usr/local/bin/lrelease
  373. configure:6769: result: /usr/local/bin/lrelease
  374. configure:6784: checking for lupdate-qt4
  375. configure:6818: result: no
  376. configure:6784: checking for lupdate4
  377. configure:6818: result: no
  378. configure:6784: checking for lupdate
  379. configure:6803: found /usr/local/bin/lupdate
  380. configure:6815: result: /usr/local/bin/lupdate
  381. configure:6828: checking for protoc
  382. configure:6847: found /usr/local/bin/protoc
  383. configure:6859: result: /usr/local/bin/protoc
  384. configure:6869: checking for ccache
  385. configure:6902: result: no
  386. configure:6909: checking for xgettext
  387. configure:6942: result: no
  388. configure:6949: checking for hexdump
  389. configure:6967: found /usr/bin/hexdump
  390. configure:6979: result: /usr/bin/hexdump
  391. configure:7041: checking for pkg-config
  392. configure:7059: found /usr/local/bin/pkg-config
  393. configure:7071: result: /usr/local/bin/pkg-config
  394. configure:7096: checking pkg-config is at least version 0.9.0
  395. configure:7099: result: yes
  396. configure:8141: checking for port
  397. configure:8171: result: no
  398. configure:8183: checking for brew
  399. configure:8199: found /usr/local/bin/brew
  400. configure:8210: result: brew
  401. configure:8231: checking whether the linker accepts -framework Foundation -framework ApplicationServices -framework AppKit
  402. configure:8250: g++ -o conftest -g -O2 -Wall -Wextra -Wformat -Wformat-security -Wno-unused-parameter -DBOOST_SPIRIT_THREADSAFE -DHAVE_BUILD_INFO -D__STDC_FORMAT_MACROS -I/usr/local/opt/berkeley-db4/include -framework Foundation -framework ApplicationServices -framework AppKit conftest.cpp -L//usr/local/opt/berkeley-db4/lib >&5
  403. configure:8250: $? = 0
  404. configure:8260: result: yes
  405. configure:8349: checking for grep that handles long lines and -e
  406. configure:8407: result: /usr/bin/grep
  407. configure:8412: checking for egrep
  408. configure:8474: result: /usr/bin/grep -E
  409. configure:8479: checking for ANSI C header files
  410. configure:8499: g++ -c -g -O2 -Wall -Wextra -Wformat -Wformat-security -Wno-unused-parameter -DBOOST_SPIRIT_THREADSAFE -DHAVE_BUILD_INFO -D__STDC_FORMAT_MACROS -I/usr/local/opt/berkeley-db4/include -DMAC_OSX conftest.cpp >&5
  411. configure:8499: $? = 0
  412. configure:8572: g++ -o conftest -g -O2 -Wall -Wextra -Wformat -Wformat-security -Wno-unused-parameter -DBOOST_SPIRIT_THREADSAFE -DHAVE_BUILD_INFO -D__STDC_FORMAT_MACROS -I/usr/local/opt/berkeley-db4/include -DMAC_OSX conftest.cpp -L//usr/local/opt/berkeley-db4/lib -framework Foundation -framework ApplicationServices -framework AppKit >&5
  413. configure:8572: $? = 0
  414. configure:8572: ./conftest
  415. configure:8572: $? = 0
  416. configure:8583: result: yes
  417. configure:8596: checking for sys/types.h
  418. configure:8596: g++ -c -g -O2 -Wall -Wextra -Wformat -Wformat-security -Wno-unused-parameter -DBOOST_SPIRIT_THREADSAFE -DHAVE_BUILD_INFO -D__STDC_FORMAT_MACROS -I/usr/local/opt/berkeley-db4/include -DMAC_OSX conftest.cpp >&5
  419. configure:8596: $? = 0
  420. configure:8596: result: yes
  421. configure:8596: checking for sys/stat.h
  422. configure:8596: g++ -c -g -O2 -Wall -Wextra -Wformat -Wformat-security -Wno-unused-parameter -DBOOST_SPIRIT_THREADSAFE -DHAVE_BUILD_INFO -D__STDC_FORMAT_MACROS -I/usr/local/opt/berkeley-db4/include -DMAC_OSX conftest.cpp >&5
  423. configure:8596: $? = 0
  424. configure:8596: result: yes
  425. configure:8596: checking for stdlib.h
  426. configure:8596: g++ -c -g -O2 -Wall -Wextra -Wformat -Wformat-security -Wno-unused-parameter -DBOOST_SPIRIT_THREADSAFE -DHAVE_BUILD_INFO -D__STDC_FORMAT_MACROS -I/usr/local/opt/berkeley-db4/include -DMAC_OSX conftest.cpp >&5
  427. configure:8596: $? = 0
  428. configure:8596: result: yes
  429. configure:8596: checking for string.h
  430. configure:8596: g++ -c -g -O2 -Wall -Wextra -Wformat -Wformat-security -Wno-unused-parameter -DBOOST_SPIRIT_THREADSAFE -DHAVE_BUILD_INFO -D__STDC_FORMAT_MACROS -I/usr/local/opt/berkeley-db4/include -DMAC_OSX conftest.cpp >&5
  431. configure:8596: $? = 0
  432. configure:8596: result: yes
  433. configure:8596: checking for memory.h
  434. configure:8596: g++ -c -g -O2 -Wall -Wextra -Wformat -Wformat-security -Wno-unused-parameter -DBOOST_SPIRIT_THREADSAFE -DHAVE_BUILD_INFO -D__STDC_FORMAT_MACROS -I/usr/local/opt/berkeley-db4/include -DMAC_OSX conftest.cpp >&5
  435. configure:8596: $? = 0
  436. configure:8596: result: yes
  437. configure:8596: checking for strings.h
  438. configure:8596: g++ -c -g -O2 -Wall -Wextra -Wformat -Wformat-security -Wno-unused-parameter -DBOOST_SPIRIT_THREADSAFE -DHAVE_BUILD_INFO -D__STDC_FORMAT_MACROS -I/usr/local/opt/berkeley-db4/include -DMAC_OSX conftest.cpp >&5
  439. configure:8596: $? = 0
  440. configure:8596: result: yes
  441. configure:8596: checking for inttypes.h
  442. configure:8596: g++ -c -g -O2 -Wall -Wextra -Wformat -Wformat-security -Wno-unused-parameter -DBOOST_SPIRIT_THREADSAFE -DHAVE_BUILD_INFO -D__STDC_FORMAT_MACROS -I/usr/local/opt/berkeley-db4/include -DMAC_OSX conftest.cpp >&5
  443. configure:8596: $? = 0
  444. configure:8596: result: yes
  445. configure:8596: checking for stdint.h
  446. configure:8596: g++ -c -g -O2 -Wall -Wextra -Wformat -Wformat-security -Wno-unused-parameter -DBOOST_SPIRIT_THREADSAFE -DHAVE_BUILD_INFO -D__STDC_FORMAT_MACROS -I/usr/local/opt/berkeley-db4/include -DMAC_OSX conftest.cpp >&5
  447. configure:8596: $? = 0
  448. configure:8596: result: yes
  449. configure:8596: checking for unistd.h
  450. configure:8596: g++ -c -g -O2 -Wall -Wextra -Wformat -Wformat-security -Wno-unused-parameter -DBOOST_SPIRIT_THREADSAFE -DHAVE_BUILD_INFO -D__STDC_FORMAT_MACROS -I/usr/local/opt/berkeley-db4/include -DMAC_OSX conftest.cpp >&5
  451. configure:8596: $? = 0
  452. configure:8596: result: yes
  453. configure:8608: checking whether byte ordering is bigendian
  454. configure:8623: g++ -c -g -O2 -Wall -Wextra -Wformat -Wformat-security -Wno-unused-parameter -DBOOST_SPIRIT_THREADSAFE -DHAVE_BUILD_INFO -D__STDC_FORMAT_MACROS -I/usr/local/opt/berkeley-db4/include -DMAC_OSX conftest.cpp >&5
  455. configure:8623: $? = 0
  456. configure:8668: g++ -c -g -O2 -Wall -Wextra -Wformat -Wformat-security -Wno-unused-parameter -DBOOST_SPIRIT_THREADSAFE -DHAVE_BUILD_INFO -D__STDC_FORMAT_MACROS -I/usr/local/opt/berkeley-db4/include -DMAC_OSX conftest.cpp >&5
  457. configure:8668: $? = 0
  458. configure:8686: g++ -c -g -O2 -Wall -Wextra -Wformat -Wformat-security -Wno-unused-parameter -DBOOST_SPIRIT_THREADSAFE -DHAVE_BUILD_INFO -D__STDC_FORMAT_MACROS -I/usr/local/opt/berkeley-db4/include -DMAC_OSX conftest.cpp >&5
  459. conftest.cpp:26:8: error: use of undeclared identifier 'big'
  460. not big endian
  461. ^
  462. 1 error generated.
  463. configure:8686: $? = 1
  464. configure: failed program was:
  465. | /* confdefs.h */
  466. | #define PACKAGE_NAME "Bitcoin"
  467. | #define PACKAGE_TARNAME "bitcoin"
  468. | #define PACKAGE_VERSION "0.8.99"
  469. | #define PACKAGE_STRING "Bitcoin 0.8.99"
  470. | #define PACKAGE_BUGREPORT "[email protected]"
  471. | #define PACKAGE_URL ""
  472. | #define STDC_HEADERS 1
  473. | #define HAVE_SYS_TYPES_H 1
  474. | #define HAVE_SYS_STAT_H 1
  475. | #define HAVE_STDLIB_H 1
  476. | #define HAVE_STRING_H 1
  477. | #define HAVE_MEMORY_H 1
  478. | #define HAVE_STRINGS_H 1
  479. | #define HAVE_INTTYPES_H 1
  480. | #define HAVE_STDINT_H 1
  481. | #define HAVE_UNISTD_H 1
  482. | /* end confdefs.h. */
  483. | #include <sys/types.h>
  484. | #include <sys/param.h>
  485. |
  486. | int
  487. | main ()
  488. | {
  489. | #if BYTE_ORDER != BIG_ENDIAN
  490. | not big endian
  491. | #endif
  492. |
  493. | ;
  494. | return 0;
  495. | }
  496. configure:8814: result: no
  497. configure:8951: checking whether pthreads work with -pthread
  498. configure:9039: gcc -o conftest -g -O2 -pthread -DBOOST_SPIRIT_THREADSAFE -DHAVE_BUILD_INFO -D__STDC_FORMAT_MACROS -I/usr/local/opt/berkeley-db4/include -DMAC_OSX conftest.c -L//usr/local/opt/berkeley-db4/lib -framework Foundation -framework ApplicationServices -framework AppKit >&5
  499. configure:9039: $? = 0
  500. configure:9048: result: yes
  501. configure:9067: checking for joinable pthread attribute
  502. configure:9082: gcc -o conftest -g -O2 -pthread -DBOOST_SPIRIT_THREADSAFE -DHAVE_BUILD_INFO -D__STDC_FORMAT_MACROS -I/usr/local/opt/berkeley-db4/include -DMAC_OSX conftest.c -L//usr/local/opt/berkeley-db4/lib -framework Foundation -framework ApplicationServices -framework AppKit >&5
  503. configure:9082: $? = 0
  504. configure:9088: result: PTHREAD_CREATE_JOINABLE
  505. configure:9098: checking if more special flags are required for pthreads
  506. configure:9112: result: -D_THREAD_SAFE
  507. configure:9118: checking for PTHREAD_PRIO_INHERIT
  508. configure:9136: gcc -o conftest -g -O2 -pthread -DBOOST_SPIRIT_THREADSAFE -DHAVE_BUILD_INFO -D__STDC_FORMAT_MACROS -I/usr/local/opt/berkeley-db4/include -DMAC_OSX conftest.c -L//usr/local/opt/berkeley-db4/lib -framework Foundation -framework ApplicationServices -framework AppKit >&5
  509. configure:9136: $? = 0
  510. configure:9145: result: yes
  511. configure:9256: checking for special C compiler options needed for large files
  512. configure:9301: result: no
  513. configure:9307: checking for _FILE_OFFSET_BITS value needed for large files
  514. configure:9332: g++ -c -g -O2 -Wall -Wextra -Wformat -Wformat-security -Wno-unused-parameter -DBOOST_SPIRIT_THREADSAFE -DHAVE_BUILD_INFO -D__STDC_FORMAT_MACROS -I/usr/local/opt/berkeley-db4/include -DMAC_OSX conftest.cpp >&5
  515. configure:9332: $? = 0
  516. configure:9364: result: no
  517. configure:9462: checking whether the linker accepts -Wl,--large-address-aware
  518. configure:9481: g++ -o conftest -g -O2 -Wall -Wextra -Wformat -Wformat-security -Wno-unused-parameter -DBOOST_SPIRIT_THREADSAFE -DHAVE_BUILD_INFO -D__STDC_FORMAT_MACROS -I/usr/local/opt/berkeley-db4/include -DMAC_OSX -Wl,--large-address-aware conftest.cpp -L//usr/local/opt/berkeley-db4/lib -framework Foundation -framework ApplicationServices -framework AppKit >&5
  519. ld: unknown option: --large-address-aware
  520. clang: error: linker command failed with exit code 1 (use -v to see invocation)
  521. configure:9481: $? = 1
  522. configure: failed program was:
  523. | /* confdefs.h */
  524. | #define PACKAGE_NAME "Bitcoin"
  525. | #define PACKAGE_TARNAME "bitcoin"
  526. | #define PACKAGE_VERSION "0.8.99"
  527. | #define PACKAGE_STRING "Bitcoin 0.8.99"
  528. | #define PACKAGE_BUGREPORT "[email protected]"
  529. | #define PACKAGE_URL ""
  530. | #define STDC_HEADERS 1
  531. | #define HAVE_SYS_TYPES_H 1
  532. | #define HAVE_SYS_STAT_H 1
  533. | #define HAVE_STDLIB_H 1
  534. | #define HAVE_STRING_H 1
  535. | #define HAVE_MEMORY_H 1
  536. | #define HAVE_STRINGS_H 1
  537. | #define HAVE_INTTYPES_H 1
  538. | #define HAVE_STDINT_H 1
  539. | #define HAVE_UNISTD_H 1
  540. | #define HAVE_PTHREAD_PRIO_INHERIT 1
  541. | #define HAVE_PTHREAD 1
  542. | /* end confdefs.h. */
  543. |
  544. | int
  545. | main ()
  546. | {
  547. |
  548. | ;
  549. | return 0;
  550. | }
  551. configure:9490: result: no
  552. configure:9500: checking whether C++ compiler accepts -Wstack-protector
  553. configure:9519: g++ -c -g -O2 -Wall -Wextra -Wformat -Wformat-security -Wno-unused-parameter -Wstack-protector -DBOOST_SPIRIT_THREADSAFE -DHAVE_BUILD_INFO -D__STDC_FORMAT_MACROS -I/usr/local/opt/berkeley-db4/include -DMAC_OSX conftest.cpp >&5
  554. configure:9519: $? = 0
  555. configure:9527: result: yes
  556. configure:9535: checking whether C++ compiler accepts -fPIE
  557. configure:9554: g++ -c -g -O2 -Wall -Wextra -Wformat -Wformat-security -Wno-unused-parameter -fPIE -DBOOST_SPIRIT_THREADSAFE -DHAVE_BUILD_INFO -D__STDC_FORMAT_MACROS -I/usr/local/opt/berkeley-db4/include -DMAC_OSX conftest.cpp >&5
  558. configure:9554: $? = 0
  559. configure:9562: result: yes
  560. configure:9571: checking whether C++ preprocessor accepts -D_FORTIFY_SOURCE=2
  561. configure:9590: g++ -E -DBOOST_SPIRIT_THREADSAFE -DHAVE_BUILD_INFO -D__STDC_FORMAT_MACROS -I/usr/local/opt/berkeley-db4/include -DMAC_OSX -D_FORTIFY_SOURCE=2 conftest.cpp
  562. configure:9590: $? = 0
  563. configure:9598: result: yes
  564. configure:9607: checking whether the linker accepts -Wl,--dynamicbase
  565. configure:9626: g++ -o conftest -g -O2 -Wall -Wextra -Wformat -Wformat-security -Wno-unused-parameter -DBOOST_SPIRIT_THREADSAFE -DHAVE_BUILD_INFO -D__STDC_FORMAT_MACROS -I/usr/local/opt/berkeley-db4/include -DMAC_OSX -Wl,--dynamicbase conftest.cpp -L//usr/local/opt/berkeley-db4/lib -framework Foundation -framework ApplicationServices -framework AppKit >&5
  566. ld: unknown option: --dynamicbase
  567. clang: error: linker command failed with exit code 1 (use -v to see invocation)
  568. configure:9626: $? = 1
  569. configure: failed program was:
  570. | /* confdefs.h */
  571. | #define PACKAGE_NAME "Bitcoin"
  572. | #define PACKAGE_TARNAME "bitcoin"
  573. | #define PACKAGE_VERSION "0.8.99"
  574. | #define PACKAGE_STRING "Bitcoin 0.8.99"
  575. | #define PACKAGE_BUGREPORT "[email protected]"
  576. | #define PACKAGE_URL ""
  577. | #define STDC_HEADERS 1
  578. | #define HAVE_SYS_TYPES_H 1
  579. | #define HAVE_SYS_STAT_H 1
  580. | #define HAVE_STDLIB_H 1
  581. | #define HAVE_STRING_H 1
  582. | #define HAVE_MEMORY_H 1
  583. | #define HAVE_STRINGS_H 1
  584. | #define HAVE_INTTYPES_H 1
  585. | #define HAVE_STDINT_H 1
  586. | #define HAVE_UNISTD_H 1
  587. | #define HAVE_PTHREAD_PRIO_INHERIT 1
  588. | #define HAVE_PTHREAD 1
  589. | /* end confdefs.h. */
  590. |
  591. | int
  592. | main ()
  593. | {
  594. |
  595. | ;
  596. | return 0;
  597. | }
  598. configure:9635: result: no
  599. configure:9643: checking whether the linker accepts -Wl,--nxcompat
  600. configure:9662: g++ -o conftest -g -O2 -Wall -Wextra -Wformat -Wformat-security -Wno-unused-parameter -DBOOST_SPIRIT_THREADSAFE -DHAVE_BUILD_INFO -D__STDC_FORMAT_MACROS -I/usr/local/opt/berkeley-db4/include -DMAC_OSX -Wl,--nxcompat conftest.cpp -L//usr/local/opt/berkeley-db4/lib -framework Foundation -framework ApplicationServices -framework AppKit >&5
  601. ld: unknown option: --nxcompat
  602. clang: error: linker command failed with exit code 1 (use -v to see invocation)
  603. configure:9662: $? = 1
  604. configure: failed program was:
  605. | /* confdefs.h */
  606. | #define PACKAGE_NAME "Bitcoin"
  607. | #define PACKAGE_TARNAME "bitcoin"
  608. | #define PACKAGE_VERSION "0.8.99"
  609. | #define PACKAGE_STRING "Bitcoin 0.8.99"
  610. | #define PACKAGE_BUGREPORT "[email protected]"
  611. | #define PACKAGE_URL ""
  612. | #define STDC_HEADERS 1
  613. | #define HAVE_SYS_TYPES_H 1
  614. | #define HAVE_SYS_STAT_H 1
  615. | #define HAVE_STDLIB_H 1
  616. | #define HAVE_STRING_H 1
  617. | #define HAVE_MEMORY_H 1
  618. | #define HAVE_STRINGS_H 1
  619. | #define HAVE_INTTYPES_H 1
  620. | #define HAVE_STDINT_H 1
  621. | #define HAVE_UNISTD_H 1
  622. | #define HAVE_PTHREAD_PRIO_INHERIT 1
  623. | #define HAVE_PTHREAD 1
  624. | /* end confdefs.h. */
  625. |
  626. | int
  627. | main ()
  628. | {
  629. |
  630. | ;
  631. | return 0;
  632. | }
  633. configure:9671: result: no
  634. configure:9679: checking whether the linker accepts -Wl,-z,relro
  635. configure:9698: g++ -o conftest -g -O2 -Wall -Wextra -Wformat -Wformat-security -Wno-unused-parameter -DBOOST_SPIRIT_THREADSAFE -DHAVE_BUILD_INFO -D__STDC_FORMAT_MACROS -I/usr/local/opt/berkeley-db4/include -DMAC_OSX -Wl,-z,relro conftest.cpp -L//usr/local/opt/berkeley-db4/lib -framework Foundation -framework ApplicationServices -framework AppKit >&5
  636. ld: unknown option: -z
  637. clang: error: linker command failed with exit code 1 (use -v to see invocation)
  638. configure:9698: $? = 1
  639. configure: failed program was:
  640. | /* confdefs.h */
  641. | #define PACKAGE_NAME "Bitcoin"
  642. | #define PACKAGE_TARNAME "bitcoin"
  643. | #define PACKAGE_VERSION "0.8.99"
  644. | #define PACKAGE_STRING "Bitcoin 0.8.99"
  645. | #define PACKAGE_BUGREPORT "[email protected]"
  646. | #define PACKAGE_URL ""
  647. | #define STDC_HEADERS 1
  648. | #define HAVE_SYS_TYPES_H 1
  649. | #define HAVE_SYS_STAT_H 1
  650. | #define HAVE_STDLIB_H 1
  651. | #define HAVE_STRING_H 1
  652. | #define HAVE_MEMORY_H 1
  653. | #define HAVE_STRINGS_H 1
  654. | #define HAVE_INTTYPES_H 1
  655. | #define HAVE_STDINT_H 1
  656. | #define HAVE_UNISTD_H 1
  657. | #define HAVE_PTHREAD_PRIO_INHERIT 1
  658. | #define HAVE_PTHREAD 1
  659. | /* end confdefs.h. */
  660. |
  661. | int
  662. | main ()
  663. | {
  664. |
  665. | ;
  666. | return 0;
  667. | }
  668. configure:9707: result: no
  669. configure:9715: checking whether the linker accepts -Wl,-z,now
  670. configure:9734: g++ -o conftest -g -O2 -Wall -Wextra -Wformat -Wformat-security -Wno-unused-parameter -DBOOST_SPIRIT_THREADSAFE -DHAVE_BUILD_INFO -D__STDC_FORMAT_MACROS -I/usr/local/opt/berkeley-db4/include -DMAC_OSX -Wl,-z,now conftest.cpp -L//usr/local/opt/berkeley-db4/lib -framework Foundation -framework ApplicationServices -framework AppKit >&5
  671. ld: unknown option: -z
  672. clang: error: linker command failed with exit code 1 (use -v to see invocation)
  673. configure:9734: $? = 1
  674. configure: failed program was:
  675. | /* confdefs.h */
  676. | #define PACKAGE_NAME "Bitcoin"
  677. | #define PACKAGE_TARNAME "bitcoin"
  678. | #define PACKAGE_VERSION "0.8.99"
  679. | #define PACKAGE_STRING "Bitcoin 0.8.99"
  680. | #define PACKAGE_BUGREPORT "[email protected]"
  681. | #define PACKAGE_URL ""
  682. | #define STDC_HEADERS 1
  683. | #define HAVE_SYS_TYPES_H 1
  684. | #define HAVE_SYS_STAT_H 1
  685. | #define HAVE_STDLIB_H 1
  686. | #define HAVE_STRING_H 1
  687. | #define HAVE_MEMORY_H 1
  688. | #define HAVE_STRINGS_H 1
  689. | #define HAVE_INTTYPES_H 1
  690. | #define HAVE_STDINT_H 1
  691. | #define HAVE_UNISTD_H 1
  692. | #define HAVE_PTHREAD_PRIO_INHERIT 1
  693. | #define HAVE_PTHREAD 1
  694. | /* end confdefs.h. */
  695. |
  696. | int
  697. | main ()
  698. | {
  699. |
  700. | ;
  701. | return 0;
  702. | }
  703. configure:9743: result: no
  704. configure:9754: checking whether C++ compiler accepts -fno-stack-protector
  705. configure:9773: g++ -c -g -O2 -Wall -Wextra -Wformat -Wformat-security -Wno-unused-parameter -fno-stack-protector -DBOOST_SPIRIT_THREADSAFE -DHAVE_BUILD_INFO -D__STDC_FORMAT_MACROS -I/usr/local/opt/berkeley-db4/include -DMAC_OSX conftest.cpp >&5
  706. configure:9773: $? = 0
  707. configure:9781: result: yes
  708. configure:9789: checking whether C++ compiler accepts -fstack-protector-all
  709. configure:9808: g++ -c -g -O2 -Wall -Wextra -Wformat -Wformat-security -Wno-unused-parameter -fstack-protector-all -DBOOST_SPIRIT_THREADSAFE -DHAVE_BUILD_INFO -D__STDC_FORMAT_MACROS -I/usr/local/opt/berkeley-db4/include -DMAC_OSX conftest.cpp >&5
  710. configure:9808: $? = 0
  711. configure:9816: result: yes
  712. configure:9826: checking whether the linker accepts -pie
  713. configure:9845: g++ -o conftest -g -O2 -Wall -Wextra -Wformat -Wformat-security -Wno-unused-parameter -DBOOST_SPIRIT_THREADSAFE -DHAVE_BUILD_INFO -D__STDC_FORMAT_MACROS -I/usr/local/opt/berkeley-db4/include -DMAC_OSX -pie conftest.cpp -L//usr/local/opt/berkeley-db4/lib -framework Foundation -framework ApplicationServices -framework AppKit >&5
  714. clang: warning: argument unused during compilation: '-pie'
  715. configure:9845: $? = 0
  716. configure:9854: result: yes
  717. configure:9871: checking whether the linker accepts -Wl,-dead_strip
  718. configure:9890: g++ -o conftest -g -O2 -Wall -Wextra -Wformat -Wformat-security -Wno-unused-parameter -Wstack-protector -fPIE -fno-stack-protector -fstack-protector-all -DBOOST_SPIRIT_THREADSAFE -DHAVE_BUILD_INFO -D__STDC_FORMAT_MACROS -I/usr/local/opt/berkeley-db4/include -DMAC_OSX -D_FORTIFY_SOURCE=2 -pie -Wl,-dead_strip conftest.cpp -L//usr/local/opt/berkeley-db4/lib -framework Foundation -framework ApplicationServices -framework AppKit >&5
  719. clang: warning: argument unused during compilation: '-pie'
  720. configure:9890: $? = 0
  721. configure:9899: result: yes
  722. configure:9912: checking stdio.h usability
  723. configure:9912: g++ -c -g -O2 -Wall -Wextra -Wformat -Wformat-security -Wno-unused-parameter -Wstack-protector -fPIE -fno-stack-protector -fstack-protector-all -DBOOST_SPIRIT_THREADSAFE -DHAVE_BUILD_INFO -D__STDC_FORMAT_MACROS -I/usr/local/opt/berkeley-db4/include -DMAC_OSX -D_FORTIFY_SOURCE=2 conftest.cpp >&5
  724. configure:9912: $? = 0
  725. configure:9912: result: yes
  726. configure:9912: checking stdio.h presence
  727. configure:9912: g++ -E -DBOOST_SPIRIT_THREADSAFE -DHAVE_BUILD_INFO -D__STDC_FORMAT_MACROS -I/usr/local/opt/berkeley-db4/include -DMAC_OSX -D_FORTIFY_SOURCE=2 conftest.cpp
  728. configure:9912: $? = 0
  729. configure:9912: result: yes
  730. configure:9912: checking for stdio.h
  731. configure:9912: result: yes
  732. configure:9912: checking for stdlib.h
  733. configure:9912: result: yes
  734. configure:9912: checking for unistd.h
  735. configure:9912: result: yes
  736. configure:9912: checking for strings.h
  737. configure:9912: result: yes
  738. configure:9912: checking for sys/types.h
  739. configure:9912: result: yes
  740. configure:9912: checking for sys/stat.h
  741. configure:9912: result: yes
  742. configure:9923: checking for MSG_NOSIGNAL
  743. configure:9936: g++ -c -g -O2 -Wall -Wextra -Wformat -Wformat-security -Wno-unused-parameter -Wstack-protector -fPIE -fno-stack-protector -fstack-protector-all -DBOOST_SPIRIT_THREADSAFE -DHAVE_BUILD_INFO -D__STDC_FORMAT_MACROS -I/usr/local/opt/berkeley-db4/include -DMAC_OSX -D_FORTIFY_SOURCE=2 conftest.cpp >&5
  744. conftest.cpp:31:10: error: use of undeclared identifier 'MSG_NOSIGNAL'
  745. int f = MSG_NOSIGNAL;
  746. ^
  747. 1 error generated.
  748. configure:9936: $? = 1
  749. configure: failed program was:
  750. | /* confdefs.h */
  751. | #define PACKAGE_NAME "Bitcoin"
  752. | #define PACKAGE_TARNAME "bitcoin"
  753. | #define PACKAGE_VERSION "0.8.99"
  754. | #define PACKAGE_STRING "Bitcoin 0.8.99"
  755. | #define PACKAGE_BUGREPORT "[email protected]"
  756. | #define PACKAGE_URL ""
  757. | #define STDC_HEADERS 1
  758. | #define HAVE_SYS_TYPES_H 1
  759. | #define HAVE_SYS_STAT_H 1
  760. | #define HAVE_STDLIB_H 1
  761. | #define HAVE_STRING_H 1
  762. | #define HAVE_MEMORY_H 1
  763. | #define HAVE_STRINGS_H 1
  764. | #define HAVE_INTTYPES_H 1
  765. | #define HAVE_STDINT_H 1
  766. | #define HAVE_UNISTD_H 1
  767. | #define HAVE_PTHREAD_PRIO_INHERIT 1
  768. | #define HAVE_PTHREAD 1
  769. | #define HAVE_STDIO_H 1
  770. | #define HAVE_STDLIB_H 1
  771. | #define HAVE_UNISTD_H 1
  772. | #define HAVE_STRINGS_H 1
  773. | #define HAVE_SYS_TYPES_H 1
  774. | #define HAVE_SYS_STAT_H 1
  775. | /* end confdefs.h. */
  776. | #include <sys/socket.h>
  777. | int
  778. | main ()
  779. | {
  780. | int f = MSG_NOSIGNAL;
  781. | ;
  782. | return 0;
  783. | }
  784. configure:9942: result: no
  785. configure:9949: checking for Berkeley DB C++ headers
  786. configure:9980: g++ -c -g -O2 -Wall -Wextra -Wformat -Wformat-security -Wno-unused-parameter -Wstack-protector -fPIE -fno-stack-protector -fstack-protector-all -DBOOST_SPIRIT_THREADSAFE -DHAVE_BUILD_INFO -D__STDC_FORMAT_MACROS -I/usr/local/opt/berkeley-db4/include -DMAC_OSX -D_FORTIFY_SOURCE=2 conftest.cpp >&5
  787. conftest.cpp:28:16: fatal error: 'bdb4.8/db_cxx.h' file not found
  788. #include <bdb4.8/db_cxx.h>
  789. ^
  790. 1 error generated.
  791. configure:9980: $? = 1
  792. configure: failed program was:
  793. | /* confdefs.h */
  794. | #define PACKAGE_NAME "Bitcoin"
  795. | #define PACKAGE_TARNAME "bitcoin"
  796. | #define PACKAGE_VERSION "0.8.99"
  797. | #define PACKAGE_STRING "Bitcoin 0.8.99"
  798. | #define PACKAGE_BUGREPORT "[email protected]"
  799. | #define PACKAGE_URL ""
  800. | #define STDC_HEADERS 1
  801. | #define HAVE_SYS_TYPES_H 1
  802. | #define HAVE_SYS_STAT_H 1
  803. | #define HAVE_STDLIB_H 1
  804. | #define HAVE_STRING_H 1
  805. | #define HAVE_MEMORY_H 1
  806. | #define HAVE_STRINGS_H 1
  807. | #define HAVE_INTTYPES_H 1
  808. | #define HAVE_STDINT_H 1
  809. | #define HAVE_UNISTD_H 1
  810. | #define HAVE_PTHREAD_PRIO_INHERIT 1
  811. | #define HAVE_PTHREAD 1
  812. | #define HAVE_STDIO_H 1
  813. | #define HAVE_STDLIB_H 1
  814. | #define HAVE_UNISTD_H 1
  815. | #define HAVE_STRINGS_H 1
  816. | #define HAVE_SYS_TYPES_H 1
  817. | #define HAVE_SYS_STAT_H 1
  818. | /* end confdefs.h. */
  819. |
  820. | #include <bdb4.8/db_cxx.h>
  821. |
  822. | int
  823. | main ()
  824. | {
  825. |
  826. | #if !((DB_VERSION_MAJOR == 4 && DB_VERSION_MINOR >= 8) || DB_VERSION_MAJOR > 4)
  827. | #error "failed to find bdb 4.8+"
  828. | #endif
  829. |
  830. | ;
  831. | return 0;
  832. | }
  833. configure:9980: g++ -c -g -O2 -Wall -Wextra -Wformat -Wformat-security -Wno-unused-parameter -Wstack-protector -fPIE -fno-stack-protector -fstack-protector-all -DBOOST_SPIRIT_THREADSAFE -DHAVE_BUILD_INFO -D__STDC_FORMAT_MACROS -I/usr/local/opt/berkeley-db4/include -DMAC_OSX -D_FORTIFY_SOURCE=2 conftest.cpp >&5
  834. conftest.cpp:28:16: fatal error: 'libdb4.8/db_cxx.h' file not found
  835. #include <libdb4.8/db_cxx.h>
  836. ^
  837. 1 error generated.
  838. configure:9980: $? = 1
  839. configure: failed program was:
  840. | /* confdefs.h */
  841. | #define PACKAGE_NAME "Bitcoin"
  842. | #define PACKAGE_TARNAME "bitcoin"
  843. | #define PACKAGE_VERSION "0.8.99"
  844. | #define PACKAGE_STRING "Bitcoin 0.8.99"
  845. | #define PACKAGE_BUGREPORT "[email protected]"
  846. | #define PACKAGE_URL ""
  847. | #define STDC_HEADERS 1
  848. | #define HAVE_SYS_TYPES_H 1
  849. | #define HAVE_SYS_STAT_H 1
  850. | #define HAVE_STDLIB_H 1
  851. | #define HAVE_STRING_H 1
  852. | #define HAVE_MEMORY_H 1
  853. | #define HAVE_STRINGS_H 1
  854. | #define HAVE_INTTYPES_H 1
  855. | #define HAVE_STDINT_H 1
  856. | #define HAVE_UNISTD_H 1
  857. | #define HAVE_PTHREAD_PRIO_INHERIT 1
  858. | #define HAVE_PTHREAD 1
  859. | #define HAVE_STDIO_H 1
  860. | #define HAVE_STDLIB_H 1
  861. | #define HAVE_UNISTD_H 1
  862. | #define HAVE_STRINGS_H 1
  863. | #define HAVE_SYS_TYPES_H 1
  864. | #define HAVE_SYS_STAT_H 1
  865. | /* end confdefs.h. */
  866. |
  867. | #include <libdb4.8/db_cxx.h>
  868. |
  869. | int
  870. | main ()
  871. | {
  872. |
  873. | #if !((DB_VERSION_MAJOR == 4 && DB_VERSION_MINOR >= 8) || DB_VERSION_MAJOR > 4)
  874. | #error "failed to find bdb 4.8+"
  875. | #endif
  876. |
  877. | ;
  878. | return 0;
  879. | }
  880. configure:9980: g++ -c -g -O2 -Wall -Wextra -Wformat -Wformat-security -Wno-unused-parameter -Wstack-protector -fPIE -fno-stack-protector -fstack-protector-all -DBOOST_SPIRIT_THREADSAFE -DHAVE_BUILD_INFO -D__STDC_FORMAT_MACROS -I/usr/local/opt/berkeley-db4/include -DMAC_OSX -D_FORTIFY_SOURCE=2 conftest.cpp >&5
  881. conftest.cpp:28:16: fatal error: 'db4.8/db_cxx.h' file not found
  882. #include <db4.8/db_cxx.h>
  883. ^
  884. 1 error generated.
  885. configure:9980: $? = 1
  886. configure: failed program was:
  887. | /* confdefs.h */
  888. | #define PACKAGE_NAME "Bitcoin"
  889. | #define PACKAGE_TARNAME "bitcoin"
  890. | #define PACKAGE_VERSION "0.8.99"
  891. | #define PACKAGE_STRING "Bitcoin 0.8.99"
  892. | #define PACKAGE_BUGREPORT "[email protected]"
  893. | #define PACKAGE_URL ""
  894. | #define STDC_HEADERS 1
  895. | #define HAVE_SYS_TYPES_H 1
  896. | #define HAVE_SYS_STAT_H 1
  897. | #define HAVE_STDLIB_H 1
  898. | #define HAVE_STRING_H 1
  899. | #define HAVE_MEMORY_H 1
  900. | #define HAVE_STRINGS_H 1
  901. | #define HAVE_INTTYPES_H 1
  902. | #define HAVE_STDINT_H 1
  903. | #define HAVE_UNISTD_H 1
  904. | #define HAVE_PTHREAD_PRIO_INHERIT 1
  905. | #define HAVE_PTHREAD 1
  906. | #define HAVE_STDIO_H 1
  907. | #define HAVE_STDLIB_H 1
  908. | #define HAVE_UNISTD_H 1
  909. | #define HAVE_STRINGS_H 1
  910. | #define HAVE_SYS_TYPES_H 1
  911. | #define HAVE_SYS_STAT_H 1
  912. | /* end confdefs.h. */
  913. |
  914. | #include <db4.8/db_cxx.h>
  915. |
  916. | int
  917. | main ()
  918. | {
  919. |
  920. | #if !((DB_VERSION_MAJOR == 4 && DB_VERSION_MINOR >= 8) || DB_VERSION_MAJOR > 4)
  921. | #error "failed to find bdb 4.8+"
  922. | #endif
  923. |
  924. | ;
  925. | return 0;
  926. | }
  927. configure:9980: g++ -c -g -O2 -Wall -Wextra -Wformat -Wformat-security -Wno-unused-parameter -Wstack-protector -fPIE -fno-stack-protector -fstack-protector-all -DBOOST_SPIRIT_THREADSAFE -DHAVE_BUILD_INFO -D__STDC_FORMAT_MACROS -I/usr/local/opt/berkeley-db4/include -DMAC_OSX -D_FORTIFY_SOURCE=2 conftest.cpp >&5
  928. conftest.cpp:28:16: fatal error: 'bdb48/db_cxx.h' file not found
  929. #include <bdb48/db_cxx.h>
  930. ^
  931. 1 error generated.
  932. configure:9980: $? = 1
  933. configure: failed program was:
  934. | /* confdefs.h */
  935. | #define PACKAGE_NAME "Bitcoin"
  936. | #define PACKAGE_TARNAME "bitcoin"
  937. | #define PACKAGE_VERSION "0.8.99"
  938. | #define PACKAGE_STRING "Bitcoin 0.8.99"
  939. | #define PACKAGE_BUGREPORT "[email protected]"
  940. | #define PACKAGE_URL ""
  941. | #define STDC_HEADERS 1
  942. | #define HAVE_SYS_TYPES_H 1
  943. | #define HAVE_SYS_STAT_H 1
  944. | #define HAVE_STDLIB_H 1
  945. | #define HAVE_STRING_H 1
  946. | #define HAVE_MEMORY_H 1
  947. | #define HAVE_STRINGS_H 1
  948. | #define HAVE_INTTYPES_H 1
  949. | #define HAVE_STDINT_H 1
  950. | #define HAVE_UNISTD_H 1
  951. | #define HAVE_PTHREAD_PRIO_INHERIT 1
  952. | #define HAVE_PTHREAD 1
  953. | #define HAVE_STDIO_H 1
  954. | #define HAVE_STDLIB_H 1
  955. | #define HAVE_UNISTD_H 1
  956. | #define HAVE_STRINGS_H 1
  957. | #define HAVE_SYS_TYPES_H 1
  958. | #define HAVE_SYS_STAT_H 1
  959. | /* end confdefs.h. */
  960. |
  961. | #include <bdb48/db_cxx.h>
  962. |
  963. | int
  964. | main ()
  965. | {
  966. |
  967. | #if !((DB_VERSION_MAJOR == 4 && DB_VERSION_MINOR >= 8) || DB_VERSION_MAJOR > 4)
  968. | #error "failed to find bdb 4.8+"
  969. | #endif
  970. |
  971. | ;
  972. | return 0;
  973. | }
  974. configure:9980: g++ -c -g -O2 -Wall -Wextra -Wformat -Wformat-security -Wno-unused-parameter -Wstack-protector -fPIE -fno-stack-protector -fstack-protector-all -DBOOST_SPIRIT_THREADSAFE -DHAVE_BUILD_INFO -D__STDC_FORMAT_MACROS -I/usr/local/opt/berkeley-db4/include -DMAC_OSX -D_FORTIFY_SOURCE=2 conftest.cpp >&5
  975. conftest.cpp:28:16: fatal error: 'libdb48/db_cxx.h' file not found
  976. #include <libdb48/db_cxx.h>
  977. ^
  978. 1 error generated.
  979. configure:9980: $? = 1
  980. configure: failed program was:
  981. | /* confdefs.h */
  982. | #define PACKAGE_NAME "Bitcoin"
  983. | #define PACKAGE_TARNAME "bitcoin"
  984. | #define PACKAGE_VERSION "0.8.99"
  985. | #define PACKAGE_STRING "Bitcoin 0.8.99"
  986. | #define PACKAGE_BUGREPORT "[email protected]"
  987. | #define PACKAGE_URL ""
  988. | #define STDC_HEADERS 1
  989. | #define HAVE_SYS_TYPES_H 1
  990. | #define HAVE_SYS_STAT_H 1
  991. | #define HAVE_STDLIB_H 1
  992. | #define HAVE_STRING_H 1
  993. | #define HAVE_MEMORY_H 1
  994. | #define HAVE_STRINGS_H 1
  995. | #define HAVE_INTTYPES_H 1
  996. | #define HAVE_STDINT_H 1
  997. | #define HAVE_UNISTD_H 1
  998. | #define HAVE_PTHREAD_PRIO_INHERIT 1
  999. | #define HAVE_PTHREAD 1
  1000. | #define HAVE_STDIO_H 1
  1001. | #define HAVE_STDLIB_H 1
  1002. | #define HAVE_UNISTD_H 1
  1003. | #define HAVE_STRINGS_H 1
  1004. | #define HAVE_SYS_TYPES_H 1
  1005. | #define HAVE_SYS_STAT_H 1
  1006. | /* end confdefs.h. */
  1007. |
  1008. | #include <libdb48/db_cxx.h>
  1009. |
  1010. | int
  1011. | main ()
  1012. | {
  1013. |
  1014. | #if !((DB_VERSION_MAJOR == 4 && DB_VERSION_MINOR >= 8) || DB_VERSION_MAJOR > 4)
  1015. | #error "failed to find bdb 4.8+"
  1016. | #endif
  1017. |
  1018. | ;
  1019. | return 0;
  1020. | }
  1021. configure:9980: g++ -c -g -O2 -Wall -Wextra -Wformat -Wformat-security -Wno-unused-parameter -Wstack-protector -fPIE -fno-stack-protector -fstack-protector-all -DBOOST_SPIRIT_THREADSAFE -DHAVE_BUILD_INFO -D__STDC_FORMAT_MACROS -I/usr/local/opt/berkeley-db4/include -DMAC_OSX -D_FORTIFY_SOURCE=2 conftest.cpp >&5
  1022. conftest.cpp:28:16: fatal error: 'db48/db_cxx.h' file not found
  1023. #include <db48/db_cxx.h>
  1024. ^
  1025. 1 error generated.
  1026. configure:9980: $? = 1
  1027. configure: failed program was:
  1028. | /* confdefs.h */
  1029. | #define PACKAGE_NAME "Bitcoin"
  1030. | #define PACKAGE_TARNAME "bitcoin"
  1031. | #define PACKAGE_VERSION "0.8.99"
  1032. | #define PACKAGE_STRING "Bitcoin 0.8.99"
  1033. | #define PACKAGE_BUGREPORT "[email protected]"
  1034. | #define PACKAGE_URL ""
  1035. | #define STDC_HEADERS 1
  1036. | #define HAVE_SYS_TYPES_H 1
  1037. | #define HAVE_SYS_STAT_H 1
  1038. | #define HAVE_STDLIB_H 1
  1039. | #define HAVE_STRING_H 1
  1040. | #define HAVE_MEMORY_H 1
  1041. | #define HAVE_STRINGS_H 1
  1042. | #define HAVE_INTTYPES_H 1
  1043. | #define HAVE_STDINT_H 1
  1044. | #define HAVE_UNISTD_H 1
  1045. | #define HAVE_PTHREAD_PRIO_INHERIT 1
  1046. | #define HAVE_PTHREAD 1
  1047. | #define HAVE_STDIO_H 1
  1048. | #define HAVE_STDLIB_H 1
  1049. | #define HAVE_UNISTD_H 1
  1050. | #define HAVE_STRINGS_H 1
  1051. | #define HAVE_SYS_TYPES_H 1
  1052. | #define HAVE_SYS_STAT_H 1
  1053. | /* end confdefs.h. */
  1054. |
  1055. | #include <db48/db_cxx.h>
  1056. |
  1057. | int
  1058. | main ()
  1059. | {
  1060. |
  1061. | #if !((DB_VERSION_MAJOR == 4 && DB_VERSION_MINOR >= 8) || DB_VERSION_MAJOR > 4)
  1062. | #error "failed to find bdb 4.8+"
  1063. | #endif
  1064. |
  1065. | ;
  1066. | return 0;
  1067. | }
  1068. configure:9980: g++ -c -g -O2 -Wall -Wextra -Wformat -Wformat-security -Wno-unused-parameter -Wstack-protector -fPIE -fno-stack-protector -fstack-protector-all -DBOOST_SPIRIT_THREADSAFE -DHAVE_BUILD_INFO -D__STDC_FORMAT_MACROS -I/usr/local/opt/berkeley-db4/include -DMAC_OSX -D_FORTIFY_SOURCE=2 conftest.cpp >&5
  1069. conftest.cpp:28:16: fatal error: 'bdb4/db_cxx.h' file not found
  1070. #include <bdb4/db_cxx.h>
  1071. ^
  1072. 1 error generated.
  1073. configure:9980: $? = 1
  1074. configure: failed program was:
  1075. | /* confdefs.h */
  1076. | #define PACKAGE_NAME "Bitcoin"
  1077. | #define PACKAGE_TARNAME "bitcoin"
  1078. | #define PACKAGE_VERSION "0.8.99"
  1079. | #define PACKAGE_STRING "Bitcoin 0.8.99"
  1080. | #define PACKAGE_BUGREPORT "[email protected]"
  1081. | #define PACKAGE_URL ""
  1082. | #define STDC_HEADERS 1
  1083. | #define HAVE_SYS_TYPES_H 1
  1084. | #define HAVE_SYS_STAT_H 1
  1085. | #define HAVE_STDLIB_H 1
  1086. | #define HAVE_STRING_H 1
  1087. | #define HAVE_MEMORY_H 1
  1088. | #define HAVE_STRINGS_H 1
  1089. | #define HAVE_INTTYPES_H 1
  1090. | #define HAVE_STDINT_H 1
  1091. | #define HAVE_UNISTD_H 1
  1092. | #define HAVE_PTHREAD_PRIO_INHERIT 1
  1093. | #define HAVE_PTHREAD 1
  1094. | #define HAVE_STDIO_H 1
  1095. | #define HAVE_STDLIB_H 1
  1096. | #define HAVE_UNISTD_H 1
  1097. | #define HAVE_STRINGS_H 1
  1098. | #define HAVE_SYS_TYPES_H 1
  1099. | #define HAVE_SYS_STAT_H 1
  1100. | /* end confdefs.h. */
  1101. |
  1102. | #include <bdb4/db_cxx.h>
  1103. |
  1104. | int
  1105. | main ()
  1106. | {
  1107. |
  1108. | #if !((DB_VERSION_MAJOR == 4 && DB_VERSION_MINOR >= 8) || DB_VERSION_MAJOR > 4)
  1109. | #error "failed to find bdb 4.8+"
  1110. | #endif
  1111. |
  1112. | ;
  1113. | return 0;
  1114. | }
  1115. configure:9980: g++ -c -g -O2 -Wall -Wextra -Wformat -Wformat-security -Wno-unused-parameter -Wstack-protector -fPIE -fno-stack-protector -fstack-protector-all -DBOOST_SPIRIT_THREADSAFE -DHAVE_BUILD_INFO -D__STDC_FORMAT_MACROS -I/usr/local/opt/berkeley-db4/include -DMAC_OSX -D_FORTIFY_SOURCE=2 conftest.cpp >&5
  1116. conftest.cpp:28:16: fatal error: 'libdb4/db_cxx.h' file not found
  1117. #include <libdb4/db_cxx.h>
  1118. ^
  1119. 1 error generated.
  1120. configure:9980: $? = 1
  1121. configure: failed program was:
  1122. | /* confdefs.h */
  1123. | #define PACKAGE_NAME "Bitcoin"
  1124. | #define PACKAGE_TARNAME "bitcoin"
  1125. | #define PACKAGE_VERSION "0.8.99"
  1126. | #define PACKAGE_STRING "Bitcoin 0.8.99"
  1127. | #define PACKAGE_BUGREPORT "[email protected]"
  1128. | #define PACKAGE_URL ""
  1129. | #define STDC_HEADERS 1
  1130. | #define HAVE_SYS_TYPES_H 1
  1131. | #define HAVE_SYS_STAT_H 1
  1132. | #define HAVE_STDLIB_H 1
  1133. | #define HAVE_STRING_H 1
  1134. | #define HAVE_MEMORY_H 1
  1135. | #define HAVE_STRINGS_H 1
  1136. | #define HAVE_INTTYPES_H 1
  1137. | #define HAVE_STDINT_H 1
  1138. | #define HAVE_UNISTD_H 1
  1139. | #define HAVE_PTHREAD_PRIO_INHERIT 1
  1140. | #define HAVE_PTHREAD 1
  1141. | #define HAVE_STDIO_H 1
  1142. | #define HAVE_STDLIB_H 1
  1143. | #define HAVE_UNISTD_H 1
  1144. | #define HAVE_STRINGS_H 1
  1145. | #define HAVE_SYS_TYPES_H 1
  1146. | #define HAVE_SYS_STAT_H 1
  1147. | /* end confdefs.h. */
  1148. |
  1149. | #include <libdb4/db_cxx.h>
  1150. |
  1151. | int
  1152. | main ()
  1153. | {
  1154. |
  1155. | #if !((DB_VERSION_MAJOR == 4 && DB_VERSION_MINOR >= 8) || DB_VERSION_MAJOR > 4)
  1156. | #error "failed to find bdb 4.8+"
  1157. | #endif
  1158. |
  1159. | ;
  1160. | return 0;
  1161. | }
  1162. configure:9980: g++ -c -g -O2 -Wall -Wextra -Wformat -Wformat-security -Wno-unused-parameter -Wstack-protector -fPIE -fno-stack-protector -fstack-protector-all -DBOOST_SPIRIT_THREADSAFE -DHAVE_BUILD_INFO -D__STDC_FORMAT_MACROS -I/usr/local/opt/berkeley-db4/include -DMAC_OSX -D_FORTIFY_SOURCE=2 conftest.cpp >&5
  1163. conftest.cpp:28:16: fatal error: 'db4/db_cxx.h' file not found
  1164. #include <db4/db_cxx.h>
  1165. ^
  1166. 1 error generated.
  1167. configure:9980: $? = 1
  1168. configure: failed program was:
  1169. | /* confdefs.h */
  1170. | #define PACKAGE_NAME "Bitcoin"
  1171. | #define PACKAGE_TARNAME "bitcoin"
  1172. | #define PACKAGE_VERSION "0.8.99"
  1173. | #define PACKAGE_STRING "Bitcoin 0.8.99"
  1174. | #define PACKAGE_BUGREPORT "[email protected]"
  1175. | #define PACKAGE_URL ""
  1176. | #define STDC_HEADERS 1
  1177. | #define HAVE_SYS_TYPES_H 1
  1178. | #define HAVE_SYS_STAT_H 1
  1179. | #define HAVE_STDLIB_H 1
  1180. | #define HAVE_STRING_H 1
  1181. | #define HAVE_MEMORY_H 1
  1182. | #define HAVE_STRINGS_H 1
  1183. | #define HAVE_INTTYPES_H 1
  1184. | #define HAVE_STDINT_H 1
  1185. | #define HAVE_UNISTD_H 1
  1186. | #define HAVE_PTHREAD_PRIO_INHERIT 1
  1187. | #define HAVE_PTHREAD 1
  1188. | #define HAVE_STDIO_H 1
  1189. | #define HAVE_STDLIB_H 1
  1190. | #define HAVE_UNISTD_H 1
  1191. | #define HAVE_STRINGS_H 1
  1192. | #define HAVE_SYS_TYPES_H 1
  1193. | #define HAVE_SYS_STAT_H 1
  1194. | /* end confdefs.h. */
  1195. |
  1196. | #include <db4/db_cxx.h>
  1197. |
  1198. | int
  1199. | main ()
  1200. | {
  1201. |
  1202. | #if !((DB_VERSION_MAJOR == 4 && DB_VERSION_MINOR >= 8) || DB_VERSION_MAJOR > 4)
  1203. | #error "failed to find bdb 4.8+"
  1204. | #endif
  1205. |
  1206. | ;
  1207. | return 0;
  1208. | }
  1209. configure:9980: g++ -c -g -O2 -Wall -Wextra -Wformat -Wformat-security -Wno-unused-parameter -Wstack-protector -fPIE -fno-stack-protector -fstack-protector-all -DBOOST_SPIRIT_THREADSAFE -DHAVE_BUILD_INFO -D__STDC_FORMAT_MACROS -I/usr/local/opt/berkeley-db4/include -DMAC_OSX -D_FORTIFY_SOURCE=2 conftest.cpp >&5
  1210. conftest.cpp:28:16: fatal error: 'bdb5/db_cxx.h' file not found
  1211. #include <bdb5/db_cxx.h>
  1212. ^
  1213. 1 error generated.
  1214. configure:9980: $? = 1
  1215. configure: failed program was:
  1216. | /* confdefs.h */
  1217. | #define PACKAGE_NAME "Bitcoin"
  1218. | #define PACKAGE_TARNAME "bitcoin"
  1219. | #define PACKAGE_VERSION "0.8.99"
  1220. | #define PACKAGE_STRING "Bitcoin 0.8.99"
  1221. | #define PACKAGE_BUGREPORT "[email protected]"
  1222. | #define PACKAGE_URL ""
  1223. | #define STDC_HEADERS 1
  1224. | #define HAVE_SYS_TYPES_H 1
  1225. | #define HAVE_SYS_STAT_H 1
  1226. | #define HAVE_STDLIB_H 1
  1227. | #define HAVE_STRING_H 1
  1228. | #define HAVE_MEMORY_H 1
  1229. | #define HAVE_STRINGS_H 1
  1230. | #define HAVE_INTTYPES_H 1
  1231. | #define HAVE_STDINT_H 1
  1232. | #define HAVE_UNISTD_H 1
  1233. | #define HAVE_PTHREAD_PRIO_INHERIT 1
  1234. | #define HAVE_PTHREAD 1
  1235. | #define HAVE_STDIO_H 1
  1236. | #define HAVE_STDLIB_H 1
  1237. | #define HAVE_UNISTD_H 1
  1238. | #define HAVE_STRINGS_H 1
  1239. | #define HAVE_SYS_TYPES_H 1
  1240. | #define HAVE_SYS_STAT_H 1
  1241. | /* end confdefs.h. */
  1242. |
  1243. | #include <bdb5/db_cxx.h>
  1244. |
  1245. | int
  1246. | main ()
  1247. | {
  1248. |
  1249. | #if !((DB_VERSION_MAJOR == 4 && DB_VERSION_MINOR >= 8) || DB_VERSION_MAJOR > 4)
  1250. | #error "failed to find bdb 4.8+"
  1251. | #endif
  1252. |
  1253. | ;
  1254. | return 0;
  1255. | }
  1256. configure:9980: g++ -c -g -O2 -Wall -Wextra -Wformat -Wformat-security -Wno-unused-parameter -Wstack-protector -fPIE -fno-stack-protector -fstack-protector-all -DBOOST_SPIRIT_THREADSAFE -DHAVE_BUILD_INFO -D__STDC_FORMAT_MACROS -I/usr/local/opt/berkeley-db4/include -DMAC_OSX -D_FORTIFY_SOURCE=2 conftest.cpp >&5
  1257. conftest.cpp:28:16: fatal error: 'libdb5/db_cxx.h' file not found
  1258. #include <libdb5/db_cxx.h>
  1259. ^
  1260. 1 error generated.
  1261. configure:9980: $? = 1
  1262. configure: failed program was:
  1263. | /* confdefs.h */
  1264. | #define PACKAGE_NAME "Bitcoin"
  1265. | #define PACKAGE_TARNAME "bitcoin"
  1266. | #define PACKAGE_VERSION "0.8.99"
  1267. | #define PACKAGE_STRING "Bitcoin 0.8.99"
  1268. | #define PACKAGE_BUGREPORT "[email protected]"
  1269. | #define PACKAGE_URL ""
  1270. | #define STDC_HEADERS 1
  1271. | #define HAVE_SYS_TYPES_H 1
  1272. | #define HAVE_SYS_STAT_H 1
  1273. | #define HAVE_STDLIB_H 1
  1274. | #define HAVE_STRING_H 1
  1275. | #define HAVE_MEMORY_H 1
  1276. | #define HAVE_STRINGS_H 1
  1277. | #define HAVE_INTTYPES_H 1
  1278. | #define HAVE_STDINT_H 1
  1279. | #define HAVE_UNISTD_H 1
  1280. | #define HAVE_PTHREAD_PRIO_INHERIT 1
  1281. | #define HAVE_PTHREAD 1
  1282. | #define HAVE_STDIO_H 1
  1283. | #define HAVE_STDLIB_H 1
  1284. | #define HAVE_UNISTD_H 1
  1285. | #define HAVE_STRINGS_H 1
  1286. | #define HAVE_SYS_TYPES_H 1
  1287. | #define HAVE_SYS_STAT_H 1
  1288. | /* end confdefs.h. */
  1289. |
  1290. | #include <libdb5/db_cxx.h>
  1291. |
  1292. | int
  1293. | main ()
  1294. | {
  1295. |
  1296. | #if !((DB_VERSION_MAJOR == 4 && DB_VERSION_MINOR >= 8) || DB_VERSION_MAJOR > 4)
  1297. | #error "failed to find bdb 4.8+"
  1298. | #endif
  1299. |
  1300. | ;
  1301. | return 0;
  1302. | }
  1303. configure:9980: g++ -c -g -O2 -Wall -Wextra -Wformat -Wformat-security -Wno-unused-parameter -Wstack-protector -fPIE -fno-stack-protector -fstack-protector-all -DBOOST_SPIRIT_THREADSAFE -DHAVE_BUILD_INFO -D__STDC_FORMAT_MACROS -I/usr/local/opt/berkeley-db4/include -DMAC_OSX -D_FORTIFY_SOURCE=2 conftest.cpp >&5
  1304. conftest.cpp:28:16: fatal error: 'db5/db_cxx.h' file not found
  1305. #include <db5/db_cxx.h>
  1306. ^
  1307. 1 error generated.
  1308. configure:9980: $? = 1
  1309. configure: failed program was:
  1310. | /* confdefs.h */
  1311. | #define PACKAGE_NAME "Bitcoin"
  1312. | #define PACKAGE_TARNAME "bitcoin"
  1313. | #define PACKAGE_VERSION "0.8.99"
  1314. | #define PACKAGE_STRING "Bitcoin 0.8.99"
  1315. | #define PACKAGE_BUGREPORT "[email protected]"
  1316. | #define PACKAGE_URL ""
  1317. | #define STDC_HEADERS 1
  1318. | #define HAVE_SYS_TYPES_H 1
  1319. | #define HAVE_SYS_STAT_H 1
  1320. | #define HAVE_STDLIB_H 1
  1321. | #define HAVE_STRING_H 1
  1322. | #define HAVE_MEMORY_H 1
  1323. | #define HAVE_STRINGS_H 1
  1324. | #define HAVE_INTTYPES_H 1
  1325. | #define HAVE_STDINT_H 1
  1326. | #define HAVE_UNISTD_H 1
  1327. | #define HAVE_PTHREAD_PRIO_INHERIT 1
  1328. | #define HAVE_PTHREAD 1
  1329. | #define HAVE_STDIO_H 1
  1330. | #define HAVE_STDLIB_H 1
  1331. | #define HAVE_UNISTD_H 1
  1332. | #define HAVE_STRINGS_H 1
  1333. | #define HAVE_SYS_TYPES_H 1
  1334. | #define HAVE_SYS_STAT_H 1
  1335. | /* end confdefs.h. */
  1336. |
  1337. | #include <db5/db_cxx.h>
  1338. |
  1339. | int
  1340. | main ()
  1341. | {
  1342. |
  1343. | #if !((DB_VERSION_MAJOR == 4 && DB_VERSION_MINOR >= 8) || DB_VERSION_MAJOR > 4)
  1344. | #error "failed to find bdb 4.8+"
  1345. | #endif
  1346. |
  1347. | ;
  1348. | return 0;
  1349. | }
  1350. configure:9980: g++ -c -g -O2 -Wall -Wextra -Wformat -Wformat-security -Wno-unused-parameter -Wstack-protector -fPIE -fno-stack-protector -fstack-protector-all -DBOOST_SPIRIT_THREADSAFE -DHAVE_BUILD_INFO -D__STDC_FORMAT_MACROS -I/usr/local/opt/berkeley-db4/include -DMAC_OSX -D_FORTIFY_SOURCE=2 conftest.cpp >&5
  1351. conftest.cpp:28:16: fatal error: 'bdb/db_cxx.h' file not found
  1352. #include <bdb/db_cxx.h>
  1353. ^
  1354. 1 error generated.
  1355. configure:9980: $? = 1
  1356. configure: failed program was:
  1357. | /* confdefs.h */
  1358. | #define PACKAGE_NAME "Bitcoin"
  1359. | #define PACKAGE_TARNAME "bitcoin"
  1360. | #define PACKAGE_VERSION "0.8.99"
  1361. | #define PACKAGE_STRING "Bitcoin 0.8.99"
  1362. | #define PACKAGE_BUGREPORT "[email protected]"
  1363. | #define PACKAGE_URL ""
  1364. | #define STDC_HEADERS 1
  1365. | #define HAVE_SYS_TYPES_H 1
  1366. | #define HAVE_SYS_STAT_H 1
  1367. | #define HAVE_STDLIB_H 1
  1368. | #define HAVE_STRING_H 1
  1369. | #define HAVE_MEMORY_H 1
  1370. | #define HAVE_STRINGS_H 1
  1371. | #define HAVE_INTTYPES_H 1
  1372. | #define HAVE_STDINT_H 1
  1373. | #define HAVE_UNISTD_H 1
  1374. | #define HAVE_PTHREAD_PRIO_INHERIT 1
  1375. | #define HAVE_PTHREAD 1
  1376. | #define HAVE_STDIO_H 1
  1377. | #define HAVE_STDLIB_H 1
  1378. | #define HAVE_UNISTD_H 1
  1379. | #define HAVE_STRINGS_H 1
  1380. | #define HAVE_SYS_TYPES_H 1
  1381. | #define HAVE_SYS_STAT_H 1
  1382. | /* end confdefs.h. */
  1383. |
  1384. | #include <bdb/db_cxx.h>
  1385. |
  1386. | int
  1387. | main ()
  1388. | {
  1389. |
  1390. | #if !((DB_VERSION_MAJOR == 4 && DB_VERSION_MINOR >= 8) || DB_VERSION_MAJOR > 4)
  1391. | #error "failed to find bdb 4.8+"
  1392. | #endif
  1393. |
  1394. | ;
  1395. | return 0;
  1396. | }
  1397. configure:9980: g++ -c -g -O2 -Wall -Wextra -Wformat -Wformat-security -Wno-unused-parameter -Wstack-protector -fPIE -fno-stack-protector -fstack-protector-all -DBOOST_SPIRIT_THREADSAFE -DHAVE_BUILD_INFO -D__STDC_FORMAT_MACROS -I/usr/local/opt/berkeley-db4/include -DMAC_OSX -D_FORTIFY_SOURCE=2 conftest.cpp >&5
  1398. conftest.cpp:28:16: fatal error: 'libdb/db_cxx.h' file not found
  1399. #include <libdb/db_cxx.h>
  1400. ^
  1401. 1 error generated.
  1402. configure:9980: $? = 1
  1403. configure: failed program was:
  1404. | /* confdefs.h */
  1405. | #define PACKAGE_NAME "Bitcoin"
  1406. | #define PACKAGE_TARNAME "bitcoin"
  1407. | #define PACKAGE_VERSION "0.8.99"
  1408. | #define PACKAGE_STRING "Bitcoin 0.8.99"
  1409. | #define PACKAGE_BUGREPORT "[email protected]"
  1410. | #define PACKAGE_URL ""
  1411. | #define STDC_HEADERS 1
  1412. | #define HAVE_SYS_TYPES_H 1
  1413. | #define HAVE_SYS_STAT_H 1
  1414. | #define HAVE_STDLIB_H 1
  1415. | #define HAVE_STRING_H 1
  1416. | #define HAVE_MEMORY_H 1
  1417. | #define HAVE_STRINGS_H 1
  1418. | #define HAVE_INTTYPES_H 1
  1419. | #define HAVE_STDINT_H 1
  1420. | #define HAVE_UNISTD_H 1
  1421. | #define HAVE_PTHREAD_PRIO_INHERIT 1
  1422. | #define HAVE_PTHREAD 1
  1423. | #define HAVE_STDIO_H 1
  1424. | #define HAVE_STDLIB_H 1
  1425. | #define HAVE_UNISTD_H 1
  1426. | #define HAVE_STRINGS_H 1
  1427. | #define HAVE_SYS_TYPES_H 1
  1428. | #define HAVE_SYS_STAT_H 1
  1429. | /* end confdefs.h. */
  1430. |
  1431. | #include <libdb/db_cxx.h>
  1432. |
  1433. | int
  1434. | main ()
  1435. | {
  1436. |
  1437. | #if !((DB_VERSION_MAJOR == 4 && DB_VERSION_MINOR >= 8) || DB_VERSION_MAJOR > 4)
  1438. | #error "failed to find bdb 4.8+"
  1439. | #endif
  1440. |
  1441. | ;
  1442. | return 0;
  1443. | }
  1444. configure:9980: g++ -c -g -O2 -Wall -Wextra -Wformat -Wformat-security -Wno-unused-parameter -Wstack-protector -fPIE -fno-stack-protector -fstack-protector-all -DBOOST_SPIRIT_THREADSAFE -DHAVE_BUILD_INFO -D__STDC_FORMAT_MACROS -I/usr/local/opt/berkeley-db4/include -DMAC_OSX -D_FORTIFY_SOURCE=2 conftest.cpp >&5
  1445. conftest.cpp:28:16: fatal error: 'db/db_cxx.h' file not found
  1446. #include <db/db_cxx.h>
  1447. ^
  1448. 1 error generated.
  1449. configure:9980: $? = 1
  1450. configure: failed program was:
  1451. | /* confdefs.h */
  1452. | #define PACKAGE_NAME "Bitcoin"
  1453. | #define PACKAGE_TARNAME "bitcoin"
  1454. | #define PACKAGE_VERSION "0.8.99"
  1455. | #define PACKAGE_STRING "Bitcoin 0.8.99"
  1456. | #define PACKAGE_BUGREPORT "[email protected]"
  1457. | #define PACKAGE_URL ""
  1458. | #define STDC_HEADERS 1
  1459. | #define HAVE_SYS_TYPES_H 1
  1460. | #define HAVE_SYS_STAT_H 1
  1461. | #define HAVE_STDLIB_H 1
  1462. | #define HAVE_STRING_H 1
  1463. | #define HAVE_MEMORY_H 1
  1464. | #define HAVE_STRINGS_H 1
  1465. | #define HAVE_INTTYPES_H 1
  1466. | #define HAVE_STDINT_H 1
  1467. | #define HAVE_UNISTD_H 1
  1468. | #define HAVE_PTHREAD_PRIO_INHERIT 1
  1469. | #define HAVE_PTHREAD 1
  1470. | #define HAVE_STDIO_H 1
  1471. | #define HAVE_STDLIB_H 1
  1472. | #define HAVE_UNISTD_H 1
  1473. | #define HAVE_STRINGS_H 1
  1474. | #define HAVE_SYS_TYPES_H 1
  1475. | #define HAVE_SYS_STAT_H 1
  1476. | /* end confdefs.h. */
  1477. |
  1478. | #include <db/db_cxx.h>
  1479. |
  1480. | int
  1481. | main ()
  1482. | {
  1483. |
  1484. | #if !((DB_VERSION_MAJOR == 4 && DB_VERSION_MINOR >= 8) || DB_VERSION_MAJOR > 4)
  1485. | #error "failed to find bdb 4.8+"
  1486. | #endif
  1487. |
  1488. | ;
  1489. | return 0;
  1490. | }
  1491. configure:9980: g++ -c -g -O2 -Wall -Wextra -Wformat -Wformat-security -Wno-unused-parameter -Wstack-protector -fPIE -fno-stack-protector -fstack-protector-all -DBOOST_SPIRIT_THREADSAFE -DHAVE_BUILD_INFO -D__STDC_FORMAT_MACROS -I/usr/local/opt/berkeley-db4/include -DMAC_OSX -D_FORTIFY_SOURCE=2 conftest.cpp >&5
  1492. configure:9980: $? = 0
  1493. configure:10009: g++ -c -g -O2 -Wall -Wextra -Wformat -Wformat-security -Wno-unused-parameter -Wstack-protector -fPIE -fno-stack-protector -fstack-protector-all -DBOOST_SPIRIT_THREADSAFE -DHAVE_BUILD_INFO -D__STDC_FORMAT_MACROS -I/usr/local/opt/berkeley-db4/include -DMAC_OSX -D_FORTIFY_SOURCE=2 conftest.cpp >&5
  1494. configure:10009: $? = 0
  1495. configure:10052: result: default
  1496. configure:10071: checking for main in -ldb_cxx-4.8
  1497. configure:10090: g++ -o conftest -g -O2 -Wall -Wextra -Wformat -Wformat-security -Wno-unused-parameter -Wstack-protector -fPIE -fno-stack-protector -fstack-protector-all -DBOOST_SPIRIT_THREADSAFE -DHAVE_BUILD_INFO -D__STDC_FORMAT_MACROS -I/usr/local/opt/berkeley-db4/include -DMAC_OSX -D_FORTIFY_SOURCE=2 -pie -Wl,-dead_strip conftest.cpp -ldb_cxx-4.8 -L//usr/local/opt/berkeley-db4/lib -framework Foundation -framework ApplicationServices -framework AppKit >&5
  1498. clang: warning: argument unused during compilation: '-pie'
  1499. configure:10090: $? = 0
  1500. configure:10100: result: yes
  1501. configure:10117: checking for main in -lminiupnpc
  1502. configure:10136: g++ -o conftest -g -O2 -Wall -Wextra -Wformat -Wformat-security -Wno-unused-parameter -Wstack-protector -fPIE -fno-stack-protector -fstack-protector-all -DBOOST_SPIRIT_THREADSAFE -DHAVE_BUILD_INFO -D__STDC_FORMAT_MACROS -I/usr/local/opt/berkeley-db4/include -DMAC_OSX -D_FORTIFY_SOURCE=2 -pie -Wl,-dead_strip conftest.cpp -lminiupnpc -L//usr/local/opt/berkeley-db4/lib -framework Foundation -framework ApplicationServices -framework AppKit >&5
  1503. clang: warning: argument unused during compilation: '-pie'
  1504. ld: library not found for -lminiupnpc
  1505. clang: error: linker command failed with exit code 1 (use -v to see invocation)
  1506. configure:10136: $? = 1
  1507. configure: failed program was:
  1508. | /* confdefs.h */
  1509. | #define PACKAGE_NAME "Bitcoin"
  1510. | #define PACKAGE_TARNAME "bitcoin"
  1511. | #define PACKAGE_VERSION "0.8.99"
  1512. | #define PACKAGE_STRING "Bitcoin 0.8.99"
  1513. | #define PACKAGE_BUGREPORT "[email protected]"
  1514. | #define PACKAGE_URL ""
  1515. | #define STDC_HEADERS 1
  1516. | #define HAVE_SYS_TYPES_H 1
  1517. | #define HAVE_SYS_STAT_H 1
  1518. | #define HAVE_STDLIB_H 1
  1519. | #define HAVE_STRING_H 1
  1520. | #define HAVE_MEMORY_H 1
  1521. | #define HAVE_STRINGS_H 1
  1522. | #define HAVE_INTTYPES_H 1
  1523. | #define HAVE_STDINT_H 1
  1524. | #define HAVE_UNISTD_H 1
  1525. | #define HAVE_PTHREAD_PRIO_INHERIT 1
  1526. | #define HAVE_PTHREAD 1
  1527. | #define HAVE_STDIO_H 1
  1528. | #define HAVE_STDLIB_H 1
  1529. | #define HAVE_UNISTD_H 1
  1530. | #define HAVE_STRINGS_H 1
  1531. | #define HAVE_SYS_TYPES_H 1
  1532. | #define HAVE_SYS_STAT_H 1
  1533. | /* end confdefs.h. */
  1534. |
  1535. |
  1536. | int
  1537. | main ()
  1538. | {
  1539. | return main ();
  1540. | ;
  1541. | return 0;
  1542. | }
  1543. configure:10145: result: no
  1544. configure:10208: checking for boostlib >= 1.20.0
  1545. configure:10277: g++ -c -g -O2 -Wall -Wextra -Wformat -Wformat-security -Wno-unused-parameter -Wstack-protector -fPIE -fno-stack-protector -fstack-protector-all -DBOOST_SPIRIT_THREADSAFE -DHAVE_BUILD_INFO -D__STDC_FORMAT_MACROS -I/usr/local/opt/berkeley-db4/include -DMAC_OSX -D_FORTIFY_SOURCE=2 -I/usr/local/include conftest.cpp >&5
  1546. configure:10277: $? = 0
  1547. configure:10279: result: yes
  1548. configure:10457: checking whether the Boost::System library is available
  1549. configure:10481: g++ -c -g -O2 -Wall -Wextra -Wformat -Wformat-security -Wno-unused-parameter -Wstack-protector -fPIE -fno-stack-protector -fstack-protector-all -DBOOST_SPIRIT_THREADSAFE -DHAVE_BUILD_INFO -D__STDC_FORMAT_MACROS -I/usr/local/opt/berkeley-db4/include -DMAC_OSX -D_FORTIFY_SOURCE=2 -I/usr/local/include conftest.cpp >&5
  1550. conftest.cpp:32:1: warning: expression result unused [-Wunused-value]
  1551. boost::system::system_category
  1552. ^~~~~~~~~~~~~~~~~~~~~~~~~~~~~~
  1553. 1 warning generated.
  1554. configure:10481: $? = 0
  1555. configure:10496: result: yes
  1556. configure:10511: checking for exit in -lboost_system-mt
  1557. configure:10536: g++ -o conftest -g -O2 -Wall -Wextra -Wformat -Wformat-security -Wno-unused-parameter -Wstack-protector -fPIE -fno-stack-protector -fstack-protector-all -DBOOST_SPIRIT_THREADSAFE -DHAVE_BUILD_INFO -D__STDC_FORMAT_MACROS -I/usr/local/opt/berkeley-db4/include -DMAC_OSX -D_FORTIFY_SOURCE=2 -I/usr/local/include -pie -Wl,-dead_strip -L/usr/local/lib conftest.cpp -lboost_system-mt -L//usr/local/opt/berkeley-db4/lib -framework Foundation -framework ApplicationServices -framework AppKit >&5
  1558. clang: warning: argument unused during compilation: '-pie'
  1559. configure:10536: $? = 0
  1560. configure:10546: result: yes
  1561. configure:10701: checking whether the Boost::Filesystem library is available
  1562. configure:10725: g++ -c -g -O2 -Wall -Wextra -Wformat -Wformat-security -Wno-unused-parameter -Wstack-protector -fPIE -fno-stack-protector -fstack-protector-all -DBOOST_SPIRIT_THREADSAFE -DHAVE_BUILD_INFO -D__STDC_FORMAT_MACROS -I/usr/local/opt/berkeley-db4/include -DMAC_OSX -D_FORTIFY_SOURCE=2 -I/usr/local/include conftest.cpp >&5
  1563. configure:10725: $? = 0
  1564. configure:10739: result: yes
  1565. configure:10750: checking for exit in -lboost_filesystem-mt
  1566. configure:10775: g++ -o conftest -g -O2 -Wall -Wextra -Wformat -Wformat-security -Wno-unused-parameter -Wstack-protector -fPIE -fno-stack-protector -fstack-protector-all -DBOOST_SPIRIT_THREADSAFE -DHAVE_BUILD_INFO -D__STDC_FORMAT_MACROS -I/usr/local/opt/berkeley-db4/include -DMAC_OSX -D_FORTIFY_SOURCE=2 -I/usr/local/include -pie -Wl,-dead_strip -L/usr/local/lib conftest.cpp -lboost_filesystem-mt -L//usr/local/opt/berkeley-db4/lib -framework Foundation -framework ApplicationServices -framework AppKit -lboost_system-mt >&5
  1567. clang: warning: argument unused during compilation: '-pie'
  1568. configure:10775: $? = 0
  1569. configure:10785: result: yes
  1570. configure:10935: checking whether the Boost::Program_Options library is available
  1571. configure:10959: g++ -c -g -O2 -Wall -Wextra -Wformat -Wformat-security -Wno-unused-parameter -Wstack-protector -fPIE -fno-stack-protector -fstack-protector-all -DBOOST_SPIRIT_THREADSAFE -DHAVE_BUILD_INFO -D__STDC_FORMAT_MACROS -I/usr/local/opt/berkeley-db4/include -DMAC_OSX -D_FORTIFY_SOURCE=2 -I/usr/local/include conftest.cpp >&5
  1572. configure:10959: $? = 0
  1573. configure:10973: result: yes
  1574. configure:10984: checking for exit in -lboost_program_options-mt
  1575. configure:11009: g++ -o conftest -g -O2 -Wall -Wextra -Wformat -Wformat-security -Wno-unused-parameter -Wstack-protector -fPIE -fno-stack-protector -fstack-protector-all -DBOOST_SPIRIT_THREADSAFE -DHAVE_BUILD_INFO -D__STDC_FORMAT_MACROS -I/usr/local/opt/berkeley-db4/include -DMAC_OSX -D_FORTIFY_SOURCE=2 -I/usr/local/include -pie -Wl,-dead_strip -L/usr/local/lib conftest.cpp -lboost_program_options-mt -L//usr/local/opt/berkeley-db4/lib -framework Foundation -framework ApplicationServices -framework AppKit >&5
  1576. clang: warning: argument unused during compilation: '-pie'
  1577. configure:11009: $? = 0
  1578. configure:11019: result: yes
  1579. configure:11162: checking whether the Boost::Thread library is available
  1580. configure:11198: g++ -c -g -O2 -Wall -Wextra -Wformat -Wformat-security -Wno-unused-parameter -Wstack-protector -fPIE -fno-stack-protector -fstack-protector-all -DBOOST_SPIRIT_THREADSAFE -DHAVE_BUILD_INFO -D__STDC_FORMAT_MACROS -I/usr/local/opt/berkeley-db4/include -DMAC_OSX -D_FORTIFY_SOURCE=2 -I/usr/local/include conftest.cpp >&5
  1581. configure:11198: $? = 0
  1582. configure:11213: result: yes
  1583. configure:11242: checking for exit in -lboost_thread-mt
  1584. configure:11267: g++ -o conftest -g -O2 -Wall -Wextra -Wformat -Wformat-security -Wno-unused-parameter -Wstack-protector -fPIE -fno-stack-protector -fstack-protector-all -DBOOST_SPIRIT_THREADSAFE -DHAVE_BUILD_INFO -D__STDC_FORMAT_MACROS -I/usr/local/opt/berkeley-db4/include -DMAC_OSX -D_FORTIFY_SOURCE=2 -I/usr/local/include -pie -Wl,-dead_strip -L/usr/local/lib conftest.cpp -lboost_thread-mt -L//usr/local/opt/berkeley-db4/lib -framework Foundation -framework ApplicationServices -framework AppKit >&5
  1585. clang: warning: argument unused during compilation: '-pie'
  1586. configure:11267: $? = 0
  1587. configure:11277: result: yes
  1588. configure:11437: checking whether the Boost::Chrono library is available
  1589. configure:11461: g++ -c -g -O2 -Wall -Wextra -Wformat -Wformat-security -Wno-unused-parameter -Wstack-protector -fPIE -fno-stack-protector -fstack-protector-all -DBOOST_SPIRIT_THREADSAFE -DHAVE_BUILD_INFO -D__STDC_FORMAT_MACROS -I/usr/local/opt/berkeley-db4/include -DMAC_OSX -D_FORTIFY_SOURCE=2 -I/usr/local/include conftest.cpp >&5
  1590. configure:11461: $? = 0
  1591. configure:11476: result: yes
  1592. configure:11491: checking for exit in -lboost_chrono-mt
  1593. configure:11516: g++ -o conftest -g -O2 -Wall -Wextra -Wformat -Wformat-security -Wno-unused-parameter -Wstack-protector -fPIE -fno-stack-protector -fstack-protector-all -DBOOST_SPIRIT_THREADSAFE -DHAVE_BUILD_INFO -D__STDC_FORMAT_MACROS -I/usr/local/opt/berkeley-db4/include -DMAC_OSX -D_FORTIFY_SOURCE=2 -I/usr/local/include -pie -Wl,-dead_strip -L/usr/local/lib conftest.cpp -lboost_chrono-mt -L//usr/local/opt/berkeley-db4/lib -framework Foundation -framework ApplicationServices -framework AppKit >&5
  1594. clang: warning: argument unused during compilation: '-pie'
  1595. configure:11516: $? = 0
  1596. configure:11526: result: yes
  1597. configure:11685: checking whether the Boost::Unit_Test_Framework library is available
  1598. configure:11708: g++ -c -g -O2 -Wall -Wextra -Wformat -Wformat-security -Wno-unused-parameter -Wstack-protector -fPIE -fno-stack-protector -fstack-protector-all -DBOOST_SPIRIT_THREADSAFE -DHAVE_BUILD_INFO -D__STDC_FORMAT_MACROS -I/usr/local/opt/berkeley-db4/include -DMAC_OSX -D_FORTIFY_SOURCE=2 -I/usr/local/include conftest.cpp >&5
  1599. conftest.cpp:38:21: warning: unused variable 'test' [-Wunused-variable]
  1600. test_suite* test= BOOST_TEST_SUITE( "Unit test example 1" ); return 0;
  1601. ^
  1602. In file included from conftest.cpp:33:
  1603. In file included from /usr/local/include/boost/test/unit_test.hpp:19:
  1604. /usr/local/include/boost/test/test_tools.hpp:309:18: warning: variable 'dummy_cond' is not needed and will not be emitted [-Wunneeded-internal-declaration]
  1605. namespace { bool dummy_cond = false; }
  1606. ^
  1607. 2 warnings generated.
  1608. configure:11708: $? = 0
  1609. configure:11722: result: yes
  1610. configure:11860: g++ -o conftest -g -O2 -Wall -Wextra -Wformat -Wformat-security -Wno-unused-parameter -Wstack-protector -fPIE -fno-stack-protector -fstack-protector-all -DBOOST_SPIRIT_THREADSAFE -DHAVE_BUILD_INFO -D__STDC_FORMAT_MACROS -I/usr/local/opt/berkeley-db4/include -DMAC_OSX -D_FORTIFY_SOURCE=2 -pie -Wl,-dead_strip conftest.cpp -L//usr/local/opt/berkeley-db4/lib -framework Foundation -framework ApplicationServices -framework AppKit -L/usr/local/lib -lboost_system-mt -lboost_filesystem-mt -lboost_program_options-mt -lboost_thread-mt -lboost_chrono-mt >&5
  1611. clang: warning: argument unused during compilation: '-pie'
  1612. conftest.cpp:35:12: fatal error: 'boost/thread/thread.hpp' file not found
  1613. #include <boost/thread/thread.hpp>
  1614. ^
  1615. 1 error generated.
  1616. configure:11860: $? = 1
  1617. configure: failed program was:
  1618. | /* confdefs.h */
  1619. | #define PACKAGE_NAME "Bitcoin"
  1620. | #define PACKAGE_TARNAME "bitcoin"
  1621. | #define PACKAGE_VERSION "0.8.99"
  1622. | #define PACKAGE_STRING "Bitcoin 0.8.99"
  1623. | #define PACKAGE_BUGREPORT "[email protected]"
  1624. | #define PACKAGE_URL ""
  1625. | #define STDC_HEADERS 1
  1626. | #define HAVE_SYS_TYPES_H 1
  1627. | #define HAVE_SYS_STAT_H 1
  1628. | #define HAVE_STDLIB_H 1
  1629. | #define HAVE_STRING_H 1
  1630. | #define HAVE_MEMORY_H 1
  1631. | #define HAVE_STRINGS_H 1
  1632. | #define HAVE_INTTYPES_H 1
  1633. | #define HAVE_STDINT_H 1
  1634. | #define HAVE_UNISTD_H 1
  1635. | #define HAVE_PTHREAD_PRIO_INHERIT 1
  1636. | #define HAVE_PTHREAD 1
  1637. | #define HAVE_STDIO_H 1
  1638. | #define HAVE_STDLIB_H 1
  1639. | #define HAVE_UNISTD_H 1
  1640. | #define HAVE_STRINGS_H 1
  1641. | #define HAVE_SYS_TYPES_H 1
  1642. | #define HAVE_SYS_STAT_H 1
  1643. | #define HAVE_BOOST /**/
  1644. | #define HAVE_BOOST_SYSTEM /**/
  1645. | #define HAVE_BOOST_FILESYSTEM /**/
  1646. | #define HAVE_BOOST_PROGRAM_OPTIONS /**/
  1647. | #define HAVE_BOOST_THREAD /**/
  1648. | #define HAVE_BOOST_CHRONO /**/
  1649. | #define HAVE_BOOST_UNIT_TEST_FRAMEWORK /**/
  1650. | /* end confdefs.h. */
  1651. |
  1652. | #include <boost/thread/thread.hpp>
  1653. | #include <boost/version.hpp>
  1654. |
  1655. | int
  1656. | main ()
  1657. | {
  1658. |
  1659. | #if BOOST_VERSION >= 105000 && (!defined(BOOST_HAS_NANOSLEEP) || BOOST_VERSION >= 105200)
  1660. | boost::this_thread::sleep_for(boost::chrono::milliseconds(0));
  1661. | #else
  1662. | choke me
  1663. | #endif
  1664. |
  1665. | ;
  1666. | return 0;
  1667. | }
  1668. configure:11897: g++ -o conftest -g -O2 -Wall -Wextra -Wformat -Wformat-security -Wno-unused-parameter -Wstack-protector -fPIE -fno-stack-protector -fstack-protector-all -DBOOST_SPIRIT_THREADSAFE -DHAVE_BUILD_INFO -D__STDC_FORMAT_MACROS -I/usr/local/opt/berkeley-db4/include -DMAC_OSX -D_FORTIFY_SOURCE=2 -pie -Wl,-dead_strip conftest.cpp -L//usr/local/opt/berkeley-db4/lib -framework Foundation -framework ApplicationServices -framework AppKit -L/usr/local/lib -lboost_system-mt -lboost_filesystem-mt -lboost_program_options-mt -lboost_thread-mt >&5
  1669. clang: warning: argument unused during compilation: '-pie'
  1670. conftest.cpp:35:12: fatal error: 'boost/version.hpp' file not found
  1671. #include <boost/version.hpp>
  1672. ^
  1673. 1 error generated.
  1674. configure:11897: $? = 1
  1675. configure: failed program was:
  1676. | /* confdefs.h */
  1677. | #define PACKAGE_NAME "Bitcoin"
  1678. | #define PACKAGE_TARNAME "bitcoin"
  1679. | #define PACKAGE_VERSION "0.8.99"
  1680. | #define PACKAGE_STRING "Bitcoin 0.8.99"
  1681. | #define PACKAGE_BUGREPORT "[email protected]"
  1682. | #define PACKAGE_URL ""
  1683. | #define STDC_HEADERS 1
  1684. | #define HAVE_SYS_TYPES_H 1
  1685. | #define HAVE_SYS_STAT_H 1
  1686. | #define HAVE_STDLIB_H 1
  1687. | #define HAVE_STRING_H 1
  1688. | #define HAVE_MEMORY_H 1
  1689. | #define HAVE_STRINGS_H 1
  1690. | #define HAVE_INTTYPES_H 1
  1691. | #define HAVE_STDINT_H 1
  1692. | #define HAVE_UNISTD_H 1
  1693. | #define HAVE_PTHREAD_PRIO_INHERIT 1
  1694. | #define HAVE_PTHREAD 1
  1695. | #define HAVE_STDIO_H 1
  1696. | #define HAVE_STDLIB_H 1
  1697. | #define HAVE_UNISTD_H 1
  1698. | #define HAVE_STRINGS_H 1
  1699. | #define HAVE_SYS_TYPES_H 1
  1700. | #define HAVE_SYS_STAT_H 1
  1701. | #define HAVE_BOOST /**/
  1702. | #define HAVE_BOOST_SYSTEM /**/
  1703. | #define HAVE_BOOST_FILESYSTEM /**/
  1704. | #define HAVE_BOOST_PROGRAM_OPTIONS /**/
  1705. | #define HAVE_BOOST_THREAD /**/
  1706. | #define HAVE_BOOST_CHRONO /**/
  1707. | #define HAVE_BOOST_UNIT_TEST_FRAMEWORK /**/
  1708. | /* end confdefs.h. */
  1709. |
  1710. | #include <boost/version.hpp>
  1711. | #include <boost/thread.hpp>
  1712. | #include <boost/date_time/posix_time/posix_time_types.hpp>
  1713. |
  1714. | int
  1715. | main ()
  1716. | {
  1717. |
  1718. | #if BOOST_VERSION <= 105600
  1719. | boost::this_thread::sleep(boost::posix_time::milliseconds(0));
  1720. | #else
  1721. | choke me
  1722. | #endif
  1723. |
  1724. | ;
  1725. | return 0;
  1726. | }
  1727. configure:11910: error: No working boost sleep implementation found
  1728.  
  1729. ## ---------------- ##
  1730. ## Cache variables. ##
  1731. ## ---------------- ##
  1732.  
  1733. ac_cv_build=x86_64-apple-darwin13.0.0
  1734. ac_cv_c_bigendian=no
  1735. ac_cv_c_compiler_gnu=yes
  1736. ac_cv_cxx_compiler_gnu=yes
  1737. ac_cv_env_CCC_set=
  1738. ac_cv_env_CCC_value=
  1739. ac_cv_env_CC_set=
  1740. ac_cv_env_CC_value=
  1741. ac_cv_env_CFLAGS_set=
  1742. ac_cv_env_CFLAGS_value=
  1743. ac_cv_env_CPPFLAGS_set=
  1744. ac_cv_env_CPPFLAGS_value=
  1745. ac_cv_env_CPP_set=
  1746. ac_cv_env_CPP_value=
  1747. ac_cv_env_CRYPTO_CFLAGS_set=
  1748. ac_cv_env_CRYPTO_CFLAGS_value=
  1749. ac_cv_env_CRYPTO_LIBS_set=
  1750. ac_cv_env_CRYPTO_LIBS_value=
  1751. ac_cv_env_CXXCPP_set=
  1752. ac_cv_env_CXXCPP_value=
  1753. ac_cv_env_CXXFLAGS_set=
  1754. ac_cv_env_CXXFLAGS_value=
  1755. ac_cv_env_CXX_set=
  1756. ac_cv_env_CXX_value=
  1757. ac_cv_env_LDFLAGS_set=
  1758. ac_cv_env_LDFLAGS_value=
  1759. ac_cv_env_LIBS_set=
  1760. ac_cv_env_LIBS_value=
  1761. ac_cv_env_OBJCFLAGS_set=
  1762. ac_cv_env_OBJCFLAGS_value=
  1763. ac_cv_env_OBJCXXFLAGS_set=
  1764. ac_cv_env_OBJCXXFLAGS_value=
  1765. ac_cv_env_OBJCXX_set=
  1766. ac_cv_env_OBJCXX_value=
  1767. ac_cv_env_OBJC_set=
  1768. ac_cv_env_OBJC_value=
  1769. ac_cv_env_PKG_CONFIG_LIBDIR_set=
  1770. ac_cv_env_PKG_CONFIG_LIBDIR_value=
  1771. ac_cv_env_PKG_CONFIG_PATH_set=
  1772. ac_cv_env_PKG_CONFIG_PATH_value=
  1773. ac_cv_env_PKG_CONFIG_set=
  1774. ac_cv_env_PKG_CONFIG_value=
  1775. ac_cv_env_PROTOBUF_CFLAGS_set=
  1776. ac_cv_env_PROTOBUF_CFLAGS_value=
  1777. ac_cv_env_PROTOBUF_LIBS_set=
  1778. ac_cv_env_PROTOBUF_LIBS_value=
  1779. ac_cv_env_QR_CFLAGS_set=
  1780. ac_cv_env_QR_CFLAGS_value=
  1781. ac_cv_env_QR_LIBS_set=
  1782. ac_cv_env_QR_LIBS_value=
  1783. ac_cv_env_QT_CFLAGS_set=
  1784. ac_cv_env_QT_CFLAGS_value=
  1785. ac_cv_env_QT_DBUS_CFLAGS_set=
  1786. ac_cv_env_QT_DBUS_CFLAGS_value=
  1787. ac_cv_env_QT_DBUS_LIBS_set=
  1788. ac_cv_env_QT_DBUS_LIBS_value=
  1789. ac_cv_env_QT_LIBS_set=
  1790. ac_cv_env_QT_LIBS_value=
  1791. ac_cv_env_QT_TEST_CFLAGS_set=
  1792. ac_cv_env_QT_TEST_CFLAGS_value=
  1793. ac_cv_env_QT_TEST_LIBS_set=
  1794. ac_cv_env_QT_TEST_LIBS_value=
  1795. ac_cv_env_SSL_CFLAGS_set=
  1796. ac_cv_env_SSL_CFLAGS_value=
  1797. ac_cv_env_SSL_LIBS_set=
  1798. ac_cv_env_SSL_LIBS_value=
  1799. ac_cv_env_build_alias_set=
  1800. ac_cv_env_build_alias_value=
  1801. ac_cv_env_host_alias_set=
  1802. ac_cv_env_host_alias_value=
  1803. ac_cv_env_target_alias_set=
  1804. ac_cv_env_target_alias_value=
  1805. ac_cv_header_inttypes_h=yes
  1806. ac_cv_header_memory_h=yes
  1807. ac_cv_header_stdc=yes
  1808. ac_cv_header_stdint_h=yes
  1809. ac_cv_header_stdio_h=yes
  1810. ac_cv_header_stdlib_h=yes
  1811. ac_cv_header_string_h=yes
  1812. ac_cv_header_strings_h=yes
  1813. ac_cv_header_sys_stat_h=yes
  1814. ac_cv_header_sys_types_h=yes
  1815. ac_cv_header_unistd_h=yes
  1816. ac_cv_host=x86_64-apple-darwin13.0.0
  1817. ac_cv_lib_boost_chrono_mt___exit=yes
  1818. ac_cv_lib_boost_filesystem_mt___exit=yes
  1819. ac_cv_lib_boost_program_options_mt___exit=yes
  1820. ac_cv_lib_boost_system_mt___exit=yes
  1821. ac_cv_lib_boost_thread_mt___exit=yes
  1822. ac_cv_lib_db_cxx_4_8___main=yes
  1823. ac_cv_lib_miniupnpc_main=no
  1824. ac_cv_objc_compiler_gnu=yes
  1825. ac_cv_objcxx_compiler_gnu=yes
  1826. ac_cv_objext=o
  1827. ac_cv_path_EGREP='/usr/bin/grep -E'
  1828. ac_cv_path_GIT=/usr/bin/git
  1829. ac_cv_path_GREP=/usr/bin/grep
  1830. ac_cv_path_HEXDUMP=/usr/bin/hexdump
  1831. ac_cv_path_JAVA=/usr/bin/java
  1832. ac_cv_path_LRELEASE=/usr/local/bin/lrelease
  1833. ac_cv_path_LUPDATE=/usr/local/bin/lupdate
  1834. ac_cv_path_MOC=/usr/local/bin/moc
  1835. ac_cv_path_PROTOC=/usr/local/bin/protoc
  1836. ac_cv_path_RCC=/usr/local/bin/rcc
  1837. ac_cv_path_SED=/usr/bin/sed
  1838. ac_cv_path_UIC=/usr/local/bin/uic
  1839. ac_cv_path_ac_pt_AR=/usr/bin/ar
  1840. ac_cv_path_ac_pt_GCOV=/usr/bin/gcov
  1841. ac_cv_path_ac_pt_PKG_CONFIG=/usr/local/bin/pkg-config
  1842. ac_cv_path_ac_pt_RANLIB=/usr/bin/ranlib
  1843. ac_cv_path_ac_pt_STRIP=/usr/bin/strip
  1844. ac_cv_path_install='/usr/bin/install -c'
  1845. ac_cv_prog_AWK=awk
  1846. ac_cv_prog_BREW=brew
  1847. ac_cv_prog_CPP='gcc -E'
  1848. ac_cv_prog_CXXCPP='g++ -E'
  1849. ac_cv_prog_ac_ct_CC=gcc
  1850. ac_cv_prog_ac_ct_CXX=g++
  1851. ac_cv_prog_ac_ct_OBJC=gcc
  1852. ac_cv_prog_ac_ct_OBJCXX=g++
  1853. ac_cv_prog_cc_c89=
  1854. ac_cv_prog_cc_g=yes
  1855. ac_cv_prog_cxx_g=yes
  1856. ac_cv_prog_make_make_set=yes
  1857. ac_cv_prog_objc_g=yes
  1858. ac_cv_prog_objcxx_g=yes
  1859. ac_cv_sys_file_offset_bits=no
  1860. ac_cv_sys_largefile_CC=no
  1861. am_cv_CC_dependencies_compiler_type=gcc3
  1862. am_cv_CXX_dependencies_compiler_type=gcc3
  1863. am_cv_OBJCXX_dependencies_compiler_type=gcc3
  1864. am_cv_OBJC_dependencies_compiler_type=gcc3
  1865. am_cv_make_support_nested_variables=yes
  1866. am_cv_prog_cc_c_o=yes
  1867. ax_cv_PTHREAD_PRIO_INHERIT=yes
  1868. ax_cv_boost_chrono=yes
  1869. ax_cv_boost_filesystem=yes
  1870. ax_cv_boost_program_options=yes
  1871. ax_cv_boost_system=yes
  1872. ax_cv_boost_thread=yes
  1873. ax_cv_boost_unit_test_framework=yes
  1874. ax_cv_check_cxxcppflags___D_FORTIFY_SOURCE_2=yes
  1875. ax_cv_check_cxxflags___Wstack_protector=yes
  1876. ax_cv_check_cxxflags___fPIE=yes
  1877. ax_cv_check_cxxflags___fno_stack_protector=yes
  1878. ax_cv_check_cxxflags___fstack_protector_all=yes
  1879. ax_cv_check_ldflags___Wl___dynamicbase=no
  1880. ax_cv_check_ldflags___Wl___large_address_aware=no
  1881. ax_cv_check_ldflags___Wl___nxcompat=no
  1882. ax_cv_check_ldflags___Wl__dead_strip=yes
  1883. ax_cv_check_ldflags___Wl__z_now=no
  1884. ax_cv_check_ldflags___Wl__z_relro=no
  1885. ax_cv_check_ldflags___framework_Foundation__framework_ApplicationServices__framework_AppKit=yes
  1886. ax_cv_check_ldflags___pie=yes
  1887.  
  1888. ## ----------------- ##
  1889. ## Output variables. ##
  1890. ## ----------------- ##
  1891.  
  1892. ACLOCAL='${SHELL} /Users/mike/Documents/Source/Bitcoin/src/build-aux/missing aclocal-1.14'
  1893. AMDEPBACKSLASH='\'
  1894. AMDEP_FALSE='#'
  1895. AMDEP_TRUE=''
  1896. AMTAR='$${TAR-tar}'
  1897. AM_BACKSLASH='\'
  1898. AM_DEFAULT_V='$(AM_DEFAULT_VERBOSITY)'
  1899. AM_DEFAULT_VERBOSITY='0'
  1900. AM_V='$(V)'
  1901. AR='/usr/bin/ar'
  1902. AUTOCONF='${SHELL} /Users/mike/Documents/Source/Bitcoin/src/build-aux/missing autoconf'
  1903. AUTOHEADER='${SHELL} /Users/mike/Documents/Source/Bitcoin/src/build-aux/missing autoheader'
  1904. AUTOMAKE='${SHELL} /Users/mike/Documents/Source/Bitcoin/src/build-aux/missing automake-1.14'
  1905. AWK='awk'
  1906. BDB_CPPFLAGS=''
  1907. BDB_LIBS='-ldb_cxx-4.8'
  1908. BOOST_CHRONO_LIB='-lboost_chrono-mt'
  1909. BOOST_CPPFLAGS='-I/usr/local/include'
  1910. BOOST_FILESYSTEM_LIB='-lboost_filesystem-mt'
  1911. BOOST_LDFLAGS='-L/usr/local/lib'
  1912. BOOST_LIBS='-L/usr/local/lib -lboost_system-mt -lboost_filesystem-mt -lboost_program_options-mt -lboost_thread-mt'
  1913. BOOST_PROGRAM_OPTIONS_LIB='-lboost_program_options-mt'
  1914. BOOST_SYSTEM_LIB='-lboost_system-mt'
  1915. BOOST_THREAD_LIB='-lboost_thread-mt'
  1916. BOOST_UNIT_TEST_FRAMEWORK_LIB='-lboost_unit_test_framework-mt'
  1917. BREW='brew'
  1918. BUILD_QT=''
  1919. BUILD_TEST=''
  1920. BUILD_TEST_QT=''
  1921. CC='gcc'
  1922. CCACHE=''
  1923. CCDEPMODE='depmode=gcc3'
  1924. CFLAGS='-g -O2'
  1925. CLIENT_VERSION_BUILD=''
  1926. CLIENT_VERSION_IS_RELEASE=''
  1927. CLIENT_VERSION_MAJOR=''
  1928. CLIENT_VERSION_MINOR=''
  1929. CLIENT_VERSION_REVISION=''
  1930. COMPARISON_TOOL_REORG_TESTS='0'
  1931. COPYRIGHT_YEAR=''
  1932. CPP='gcc -E'
  1933. CPPFLAGS=' -DBOOST_SPIRIT_THREADSAFE -DHAVE_BUILD_INFO -D__STDC_FORMAT_MACROS -I/usr/local/opt/berkeley-db4/include -DMAC_OSX -D_FORTIFY_SOURCE=2'
  1934. CRYPTO_CFLAGS=''
  1935. CRYPTO_LIBS=''
  1936. CXX='g++'
  1937. CXXCPP='g++ -E'
  1938. CXXDEPMODE='depmode=gcc3'
  1939. CXXFLAGS='-g -O2 -Wall -Wextra -Wformat -Wformat-security -Wno-unused-parameter -Wstack-protector -fPIE -fno-stack-protector -fstack-protector-all'
  1940. CYGPATH_W='echo'
  1941. DEFS=''
  1942. DEPDIR='.deps'
  1943. ECHO_C='\c'
  1944. ECHO_N=''
  1945. ECHO_T=''
  1946. EGREP='/usr/bin/grep -E'
  1947. EXEEXT=''
  1948. GCOV='/usr/bin/gcov'
  1949. GENHTML=''
  1950. GIT='/usr/bin/git'
  1951. GREP='/usr/bin/grep'
  1952. HEXDUMP='/usr/bin/hexdump'
  1953. INCLUDES=' -D_THREAD_SAFE -pthread'
  1954. INSTALL_DATA='${INSTALL} -m 644'
  1955. INSTALL_PROGRAM='${INSTALL}'
  1956. INSTALL_SCRIPT='${INSTALL}'
  1957. INSTALL_STRIP_PROGRAM='$(install_sh) -c -s'
  1958. JAVA='/usr/bin/java'
  1959. JAVA_COMPARISON_TOOL=''
  1960. LCOV=''
  1961. LDFLAGS=' -pie -Wl,-dead_strip'
  1962. LEVELDB_TARGET_FLAGS='TARGET_OS=Darwin'
  1963. LIBOBJS=''
  1964. LIBS=' -L//usr/local/opt/berkeley-db4/lib -framework Foundation -framework ApplicationServices -framework AppKit'
  1965. LRELEASE='/usr/local/bin/lrelease'
  1966. LTLIBOBJS=''
  1967. LUPDATE='/usr/local/bin/lupdate'
  1968. MAINT=''
  1969. MAINTAINER_MODE_FALSE='#'
  1970. MAINTAINER_MODE_TRUE=''
  1971. MAKEINFO='${SHELL} /Users/mike/Documents/Source/Bitcoin/src/build-aux/missing makeinfo'
  1972. MAKENSIS=''
  1973. MKDIR_P='src/build-aux/install-sh -c -d'
  1974. MOC='/usr/local/bin/moc'
  1975. MOC_DEFS='-DQ_OS_MAC'
  1976. OBJC='gcc'
  1977. OBJCDEPMODE='depmode=gcc3'
  1978. OBJCFLAGS='-g -O2'
  1979. OBJCXX='g++'
  1980. OBJCXXDEPMODE='depmode=gcc3'
  1981. OBJCXXFLAGS='-g -O2 -Wall -Wextra -Wformat -Wformat-security -Wno-unused-parameter -Wstack-protector -fPIE -fno-stack-protector -fstack-protector-all'
  1982. OBJEXT='o'
  1983. PACKAGE='bitcoin'
  1984. PACKAGE_BUGREPORT='[email protected]'
  1985. PACKAGE_NAME='Bitcoin'
  1986. PACKAGE_STRING='Bitcoin 0.8.99'
  1987. PACKAGE_TARNAME='bitcoin'
  1988. PACKAGE_URL=''
  1989. PACKAGE_VERSION='0.8.99'
  1990. PATH_SEPARATOR=':'
  1991. PKG_CONFIG='/usr/local/bin/pkg-config'
  1992. PKG_CONFIG_LIBDIR=''
  1993. PKG_CONFIG_PATH='/usr/local/opt/openssl/lib/pkgconfig:'
  1994. PORT=''
  1995. PROTOBUF_CFLAGS=''
  1996. PROTOBUF_LIBS=''
  1997. PROTOC='/usr/local/bin/protoc'
  1998. PTHREAD_CC='gcc'
  1999. PTHREAD_CFLAGS='-D_THREAD_SAFE -pthread'
  2000. PTHREAD_LIBS=''
  2001. QR_CFLAGS=''
  2002. QR_LIBS=''
  2003. QT_CFLAGS=''
  2004. QT_DBUS_CFLAGS=''
  2005. QT_DBUS_INCLUDES=''
  2006. QT_DBUS_LIBS=''
  2007. QT_INCLUDES=''
  2008. QT_LIBS=''
  2009. QT_TEST_CFLAGS=''
  2010. QT_TEST_INCLUDES=''
  2011. QT_TEST_LIBS=''
  2012. RANLIB='/usr/bin/ranlib'
  2013. RCC='/usr/local/bin/rcc'
  2014. SED='/usr/bin/sed'
  2015. SET_MAKE=''
  2016. SHELL='/bin/sh'
  2017. SSL_CFLAGS=''
  2018. SSL_LIBS=''
  2019. STRIP='/usr/bin/strip'
  2020. TARGET_DARWIN_FALSE=''
  2021. TARGET_DARWIN_TRUE=''
  2022. TARGET_WINDOWS_FALSE=''
  2023. TARGET_WINDOWS_TRUE=''
  2024. TESTDEFS='-DBOOST_TEST_DYN_LINK'
  2025. UIC='/usr/local/bin/uic'
  2026. USE_COMPARISON_TOOL_FALSE=''
  2027. USE_COMPARISON_TOOL_REORG_TESTS_FALSE=''
  2028. USE_COMPARISON_TOOL_REORG_TESTS_TRUE=''
  2029. USE_COMPARISON_TOOL_TRUE=''
  2030. USE_IPV6=''
  2031. USE_LCOV_FALSE=''
  2032. USE_LCOV_TRUE=''
  2033. USE_QRCODE=''
  2034. USE_QRCODE_FALSE=''
  2035. USE_QRCODE_TRUE=''
  2036. USE_UPNP=''
  2037. VERSION='0.8.99'
  2038. WINDRES=''
  2039. XGETTEXT=''
  2040. ac_ct_CC='gcc'
  2041. ac_ct_CXX='g++'
  2042. ac_ct_OBJC='gcc'
  2043. ac_ct_OBJCXX='g++'
  2044. am__EXEEXT_FALSE=''
  2045. am__EXEEXT_TRUE=''
  2046. am__fastdepCC_FALSE='#'
  2047. am__fastdepCC_TRUE=''
  2048. am__fastdepCXX_FALSE='#'
  2049. am__fastdepCXX_TRUE=''
  2050. am__fastdepOBJCXX_FALSE='#'
  2051. am__fastdepOBJCXX_TRUE=''
  2052. am__fastdepOBJC_FALSE='#'
  2053. am__fastdepOBJC_TRUE=''
  2054. am__include='include'
  2055. am__isrc=''
  2056. am__leading_dot='.'
  2057. am__nodep='_no'
  2058. am__quote=''
  2059. am__tar='$${TAR-tar} chof - "$$tardir"'
  2060. am__untar='$${TAR-tar} xf -'
  2061. ax_pthread_config=''
  2062. bindir='${exec_prefix}/bin'
  2063. build='x86_64-apple-darwin13.0.0'
  2064. build_alias=''
  2065. build_cpu='x86_64'
  2066. build_os='darwin13.0.0'
  2067. build_vendor='apple'
  2068. datadir='${datarootdir}'
  2069. datarootdir='${prefix}/share'
  2070. docdir='${datarootdir}/doc/${PACKAGE_TARNAME}'
  2071. dvidir='${docdir}'
  2072. exec_prefix='NONE'
  2073. host='x86_64-apple-darwin13.0.0'
  2074. host_alias=''
  2075. host_cpu='x86_64'
  2076. host_os='darwin13.0.0'
  2077. host_vendor='apple'
  2078. htmldir='${docdir}'
  2079. includedir='${prefix}/include'
  2080. infodir='${datarootdir}/info'
  2081. install_sh='${SHELL} /Users/mike/Documents/Source/Bitcoin/src/build-aux/install-sh'
  2082. libdir='${exec_prefix}/lib'
  2083. libexecdir='${exec_prefix}/libexec'
  2084. localedir='${datarootdir}/locale'
  2085. localstatedir='${prefix}/var'
  2086. mandir='${datarootdir}/man'
  2087. mkdir_p='$(MKDIR_P)'
  2088. oldincludedir='/usr/include'
  2089. pdfdir='${docdir}'
  2090. prefix='NONE'
  2091. program_transform_name='s,x,x,'
  2092. psdir='${docdir}'
  2093. sbindir='${exec_prefix}/sbin'
  2094. sharedstatedir='${prefix}/com'
  2095. sysconfdir='${prefix}/etc'
  2096. target_alias=''
  2097.  
  2098. ## ----------- ##
  2099. ## confdefs.h. ##
  2100. ## ----------- ##
  2101.  
  2102. /* confdefs.h */
  2103. #define PACKAGE_NAME "Bitcoin"
  2104. #define PACKAGE_TARNAME "bitcoin"
  2105. #define PACKAGE_VERSION "0.8.99"
  2106. #define PACKAGE_STRING "Bitcoin 0.8.99"
  2107. #define PACKAGE_BUGREPORT "[email protected]"
  2108. #define PACKAGE_URL ""
  2109. #define STDC_HEADERS 1
  2110. #define HAVE_SYS_TYPES_H 1
  2111. #define HAVE_SYS_STAT_H 1
  2112. #define HAVE_STDLIB_H 1
  2113. #define HAVE_STRING_H 1
  2114. #define HAVE_MEMORY_H 1
  2115. #define HAVE_STRINGS_H 1
  2116. #define HAVE_INTTYPES_H 1
  2117. #define HAVE_STDINT_H 1
  2118. #define HAVE_UNISTD_H 1
  2119. #define HAVE_PTHREAD_PRIO_INHERIT 1
  2120. #define HAVE_PTHREAD 1
  2121. #define HAVE_STDIO_H 1
  2122. #define HAVE_STDLIB_H 1
  2123. #define HAVE_UNISTD_H 1
  2124. #define HAVE_STRINGS_H 1
  2125. #define HAVE_SYS_TYPES_H 1
  2126. #define HAVE_SYS_STAT_H 1
  2127. #define HAVE_BOOST /**/
  2128. #define HAVE_BOOST_SYSTEM /**/
  2129. #define HAVE_BOOST_FILESYSTEM /**/
  2130. #define HAVE_BOOST_PROGRAM_OPTIONS /**/
  2131. #define HAVE_BOOST_THREAD /**/
  2132. #define HAVE_BOOST_CHRONO /**/
  2133. #define HAVE_BOOST_UNIT_TEST_FRAMEWORK /**/
  2134.  
  2135. configure: exit 1
Advertisement
Add Comment
Please, Sign In to add comment