Guest User

Untitled

a guest
Feb 7th, 2011
316
0
Never
Not a member of Pastebin yet? Sign Up, it unlocks many cool features!
text 3.64 KB | None | 0 0
  1. C:\qca-ossl-2.0.0-beta3>qmake
  2. WARNING: c:\qca-ossl-2.0.0-beta3\qca-ossl.pro:17: Unable to find file for inclus
  3. ion winlocal.prf
  4. c:\qca-ossl-2.0.0-beta3\qca-ossl.pro:19: Parse Error ('error("WINLOCAL_PREFIX no
  5. t found. See http://delta.affinix.com/platform/')
  6. c:\qca-ossl-2.0.0-beta3\qca-ossl.pro:19: Unterminated conditional block at end o
  7. f file
  8. Error processing project file: C:/qca-ossl-2.0.0-beta3/qca-ossl.pro
  9.  
  10. C:\qca-ossl-2.0.0-beta3>make
  11. 'make' is not recognized as an internal or external command,
  12. operable program or batch file.
  13.  
  14. C:\qca-ossl-2.0.0-beta3>nmake
  15. 'nmake' is not recognized as an internal or external command,
  16. operable program or batch file.
  17.  
  18. C:\qca-ossl-2.0.0-beta3>qmake
  19. WARNING: c:\qca-ossl-2.0.0-beta3\qca-ossl.pro:17: Unable to find file for inclus
  20. ion winlocal.prf
  21. c:\qca-ossl-2.0.0-beta3\qca-ossl.pro:19: Parse Error ('error("WINLOCAL_PREFIX no
  22. t found. See http://delta.affinix.com/platform/')
  23. c:\qca-ossl-2.0.0-beta3\qca-ossl.pro:19: Unterminated conditional block at end o
  24. f file
  25. Error processing project file: C:/qca-ossl-2.0.0-beta3/qca-ossl.pro
  26.  
  27. C:\qca-ossl-2.0.0-beta3>mkdir C:\local
  28.  
  29. C:\qca-ossl-2.0.0-beta3>mkdir C:\local\bin
  30.  
  31. C:\qca-ossl-2.0.0-beta3>mkdir C:\local\include
  32.  
  33. C:\qca-ossl-2.0.0-beta3>mkdir C:\local\lib
  34.  
  35. C:\qca-ossl-2.0.0-beta3>echo "WINLOCAL_PREFIX = C:/local" > %QTDIR%\mkspecs\feat
  36. ures\winlocal.prf
  37.  
  38. C:\qca-ossl-2.0.0-beta3>configwin.bat rd
  39. Configuring for release and debug, dynamic
  40. Wrote conf_win.pri
  41. C:\qca-ossl-2.0.0-beta3>qmake
  42. WARNING: c:\Qt\2010.05\qt\mkspecs\features\crypto.prf:1: Unescaped backslashes a
  43. re deprecated.
  44. WARNING: c:\Qt\2010.05\qt\mkspecs\features\crypto.prf:1: Unescaped backslashes a
  45. re deprecated.
  46. WARNING: c:\Qt\2010.05\qt\mkspecs\features\crypto.prf:1: Unescaped backslashes a
  47. re deprecated.
  48.  
  49. C:\qca-ossl-2.0.0-beta3>mingw32-make
  50. mingw32-make -f Makefile.Debug all
  51. mingw32-make[1]: Entering directory `C:/qca-ossl-2.0.0-beta3'
  52. C:\Qt\2010.05\qt\bin\moc.exe -DUNICODE -DQT_LARGEFILE_SUPPORT -DOSSL_097 -DQT_DL
  53. L -DQT_PLUGIN -DQT_CORE_LIB -DQT_THREAD_SUPPORT -I"..\Qt\2010.05\qt\include\QtCo
  54. re" -I"..\Qt\2010.05\qt\include" -I"..\local\include" -I"..\qca-2.0.3\include\Qt
  55. Crypto" -I"..\Qt\2010.05\qt\include\ActiveQt" -I"debug" -I"..\Qt\2010.05\qt\mksp
  56. ecs\win32-g++" -D__GNUC__ -DWIN32 qca-ossl.cpp -o debug\qca-ossl.moc
  57. g++ -c -g -frtti -fexceptions -mthreads -Wall -DUNICODE -DQT_LARGEFILE_SUPPORT -
  58. DOSSL_097 -DQT_DLL -DQT_PLUGIN -DQT_CORE_LIB -DQT_THREAD_SUPPORT -I"..\Qt\2010.0
  59. 5\qt\include\QtCore" -I"..\Qt\2010.05\qt\include" -I"..\local\include" -I"..\qca
  60. -2.0.3\include\QtCrypto" -I"..\Qt\2010.05\qt\include\ActiveQt" -I"debug" -I"..\Q
  61. t\2010.05\qt\mkspecs\win32-g++" -o debug\qca-ossl.o qca-ossl.cpp
  62. qca-ossl.cpp:26:25: error: openssl/evp.h: No such file or directory
  63. qca-ossl.cpp:27:26: error: openssl/hmac.h: No such file or directory
  64. qca-ossl.cpp:33:26: error: openssl/rand.h: No such file or directory
  65. qca-ossl.cpp:34:25: error: openssl/pem.h: No such file or directory
  66. qca-ossl.cpp:35:25: error: openssl/err.h: No such file or directory
  67. qca-ossl.cpp:36:28: error: openssl/x509v3.h: No such file or directory
  68. qca-ossl.cpp:37:28: error: openssl/pkcs12.h: No such file or directory
  69. qca-ossl.cpp:38:25: error: openssl/ssl.h: No such file or directory
  70. qca-ossl.cpp:52: error: 'BIO' was not declared in this scope
  71. qca-ossl.cpp:52: error: 'b' was not declared in this scope
  72. qca-ossl.cpp:53: error: expected ',' or ';' before '{' token
  73. qca-ossl.cpp:6951: error: expected '}' at end of input
  74. mingw32-make[1]: *** [debug/qca-ossl.o] Error 1
  75. mingw32-make[1]: Leaving directory `C:/qca-ossl-2.0.0-beta3'
  76. mingw32-make: *** [debug-all] Error 2
  77.  
  78. C:\qca-ossl-2.0.0-beta3>
Advertisement
Add Comment
Please, Sign In to add comment