Want more features on Pastebin? Sign Up, it's FREE!
Guest

Untitled

By: a guest on Oct 26th, 2011  |  syntax: None  |  size: 2.88 KB  |  views: 49  |  expires: Never
download  |  raw  |  embed  |  report abuse  |  print
Text below is selected. Please press Ctrl+C to copy to your clipboard. (⌘+C on Mac)
  1. Scanning dependencies of target compile_python_files
  2.                                                                                                                              
  3.  
  4.   File "/home/mike/progdata/AUR/qgis/src/build/python//utils.py", line 192
  5.     except Exception, e:
  6.                     ^
  7. SyntaxError: invalid syntax
  8.  
  9. [ 62%] Built target compile_python_files
  10. [ 62%] Generating analysis/sipanalysispart0.cpp, analysis/sipanalysispart1.cpp, analysis/sipanalysispart2.cpp, analysis/sipanalysispart3.cpp                                                                                                                
  11.                                                                                                                              
  12. Scanning dependencies of target python_module_qgis_analysis
  13. [ 62%] Building CXX object python/CMakeFiles/python_module_qgis_analysis.dir/analysis/sipanalysispart0.cpp.o                  
  14. [ 62%] Building CXX object python/CMakeFiles/python_module_qgis_analysis.dir/analysis/sipanalysispart1.cpp.o                  
  15. [ 62%] Building CXX object python/CMakeFiles/python_module_qgis_analysis.dir/analysis/sipanalysispart2.cpp.o                  
  16. [ 63%] Building CXX object python/CMakeFiles/python_module_qgis_analysis.dir/analysis/sipanalysispart3.cpp.o                  
  17. Linking CXX shared library analysis.so                                                                                        
  18. /usr/bin/ld: error in /usr/bin/python2(.eh_frame); no .eh_frame_hdr table will be created.                                    
  19. [ 63%] Built target python_module_qgis_analysis
  20. [ 63%] Generating core/sipcorepart0.cpp, core/sipcorepart1.cpp, core/sipcorepart2.cpp, core/sipcorepart3.cpp
  21.                                                                                                                              
  22. Scanning dependencies of target python_module_qgis_core
  23. [ 63%] Building CXX object python/CMakeFiles/python_module_qgis_core.dir/core/sipcorepart0.cpp.o                              
  24. /home/mike/progdata/AUR/qgis/src/qgis-1.7.1/python/core/conversions.sip: In function ‘int convertTo_QMap_1800_0600QMap_1800_0100QVariant(PyObject*, void**, int*, PyObject*)’:
  25. /home/mike/progdata/AUR/qgis/src/qgis-1.7.1/python/core/conversions.sip:498:30: error: ‘PyInt_AsLong’ was not declared in this scope
  26. /home/mike/progdata/AUR/qgis/src/qgis-1.7.1/python/core/conversions.sip: In function ‘PyObject* convertFrom_QMap_1800_0600QMap_1800_0100QVariant(void*, PyObject*)’:
  27. /home/mike/progdata/AUR/qgis/src/qgis-1.7.1/python/core/conversions.sip:435:45: error: ‘PyInt_FromLong’ was not declared in this scope
  28. make[2]: *** [python/CMakeFiles/python_module_qgis_core.dir/core/sipcorepart0.cpp.o] Error 1
  29. make[1]: *** [python/CMakeFiles/python_module_qgis_core.dir/all] Error 2
  30. make: *** [all] Error 2
  31. ==> ERROR: A failure occurred in build().
  32.     Aborting...
  33.  
  34.  
clone this paste RAW Paste Data