Guest User

Untitled

a guest
Jul 26th, 2014
55
0
Never
Not a member of Pastebin yet? Sign Up, it unlocks many cool features!
C# 3.45 KB | None | 0 0
  1. Target AfterBuild:
  2. Task "Using task CreateItem from Microsoft.Build.Tasks.CreateItem, Microsoft.Build.Tasks.v4.0, Version=4.0.0.0, Culture=neutral, PublicKeyToken=b03f5f7f11d50a3a
  3. /Users/thill/Projects/libgit2sharp/LibGit2Sharp/CopyNativeDependencies.targets: error : Error executing task CreateItem: Invalid path
  4. Error executing task CreateItem: System.ArgumentException: Invalid path
  5.  at System.IO.Path.GetDirectoryName (System.String path) [0x00000] in <filename unknown>:0
  6.  at Microsoft.Build.BuildEngine.DirectoryScanner.ProcessInclude (ITaskItem include_item, System.Collections.Generic.Dictionary`2 excludedItems, System.Collections.Generic.List`1 includedItems) [0x00000] in <filename unknown>:0
  7.  at Microsoft.Build.BuildEngine.DirectoryScanner.Scan () [0x00000] in <filename unknown>:0
  8.  at Microsoft.Build.Tasks.CreateItem.Execute () [0x00000] in <filename unknown>:0
  9.  at Microsoft.Build.BuildEngine.TaskEngine.Execute () [0x00000] in <filename unknown>:0
  10.  at Microsoft.Build.BuildEngine.BuildTask.Execute () [0x00000] in <filename unknown>:0
  11.  
  12. Task "CreateItem" execution -- FAILED
  13. Done building target "AfterBuild" in project "/Users/thill/Projects/libgit2sharp/LibGit2Sharp.Tests/LibGit2Sharp.Tests.csproj".-- FAILED
  14. Sone building target "AfterBuild" in project "/Users/thill/Projects/libgit2sharp/LibGit2Sharp.Tests/LibGit2Sharp.Tests.csproj" ("/Users/thill/Projects/libgit2sharp/LibGit2Sharp/CopyNativeDependencies.targets"); "Build" depends on it.
  15. Done building target "Build" in project "/Users/thill/Projects/libgit2sharp/LibGit2Sharp.Tests/LibGit2Sharp.Tests.csproj" ("/Library/Frameworks/Mono.framework/Versions/3.4.0/lib/mono/4.5/Microsoft.Common.targets").
  16. Done building project "/Users/thill/Projects/libgit2sharp/LibGit2Sharp.Tests/LibGit2Sharp.Tests.csproj".-- FAILED
  17.  
  18. Task "MSBuild" execution -- FAILED
  19. Done building target "Build" in project "/Users/thill/Projects/libgit2sharp/LibGit2Sharp.sln".-- FAILED
  20. Done building target "Build" in project "/Users/thill/Projects/libgit2sharp/LibGit2Sharp.sln" ("/Users/thill/Projects/libgit2sharp/LibGit2Sharp.sln").
  21. Done building project "/Users/thill/Projects/libgit2sharp/LibGit2Sharp.sln".-- FAILED
  22.  
  23. Task "MSBuild" execution -- FAILED
  24. Done building target "Build" in project "/Users/thill/Projects/libgit2sharp/CI/build.msbuild".-- FAILED
  25. Done building target "Build" in project "/Users/thill/Projects/libgit2sharp/CI/build.msbuild" ("/Users/thill/Projects/libgit2sharp/CI/build.msbuild"); "Test" depends on it.
  26. Done building target "Test" in project "/Users/thill/Projects/libgit2sharp/CI/build.msbuild" ("/Users/thill/Projects/libgit2sharp/CI/build.msbuild"); "Deploy" depends on it.
  27. Done building target "Deploy" in project "/Users/thill/Projects/libgit2sharp/CI/build.msbuild" ("/Users/thill/Projects/libgit2sharp/CI/build.msbuild").
  28. Done building project "/Users/thill/Projects/libgit2sharp/CI/build.msbuild".-- FAILED
  29.  
  30. Build FAILED.
  31. Errors:
  32.  
  33. /Users/thill/Projects/libgit2sharp/CI/build.msbuild (Deploy) ->
  34. (Build target) ->
  35. /Users/thill/Projects/libgit2sharp/LibGit2Sharp.sln (Build) ->
  36. (Build target) ->
  37. /Users/thill/Projects/libgit2sharp/LibGit2Sharp.Tests/LibGit2Sharp.Tests.csproj (default targets) ->
  38. /Users/thill/Projects/libgit2sharp/LibGit2Sharp/CopyNativeDependencies.targets (AfterBuild target) ->
  39.  
  40.     /Users/thill/Projects/libgit2sharp/LibGit2Sharp/CopyNativeDependencies.targets: error : Error executing task CreateItem: Invalid path
  41.  
  42.      0 Warning(s)
  43.      1 Error(s)
  44.  
  45. Time Elapsed 00:00:01.4838770
Advertisement
Add Comment
Please, Sign In to add comment