Pastebin launched a little side project called VERYVIRAL.com, check it out ;-) Want more features on Pastebin? Sign Up, it's FREE!
Guest

Untitled

By: a guest on Mar 29th, 2011  |  syntax: None  |  size: 13.18 KB  |  views: 68  |  expires: Never
download  |  raw  |  embed  |  report abuse  |  print
Text below is selected. Please press Ctrl+C to copy to your clipboard. (⌘+C on Mac)
  1. /home/doriad/bin/CMake/bin/cmake -H/media/portable/Projects/src/lafarren-image-completer -B/media/portable/Projects/bin/lafarren-image-completer --check-build-system CMakeFiles/Makefile.cmake 0
  2. /home/doriad/bin/CMake/bin/cmake -E cmake_progress_start /media/portable/Projects/bin/lafarren-image-completer/CMakeFiles /media/portable/Projects/bin/lafarren-image-completer/CMakeFiles/progress.marks
  3. make -f CMakeFiles/Makefile2 all
  4. make[1]: Entering directory `/media/portable/Projects/bin/lafarren-image-completer'
  5. make -f CMakeFiles/ImageCompleterLib.dir/build.make CMakeFiles/ImageCompleterLib.dir/depend
  6. make[2]: Entering directory `/media/portable/Projects/bin/lafarren-image-completer'
  7. cd /media/portable/Projects/bin/lafarren-image-completer && /home/doriad/bin/CMake/bin/cmake -E cmake_depends "Unix Makefiles" /media/portable/Projects/src/lafarren-image-completer /media/portable/Projects/src/lafarren-image-completer /media/portable/Projects/bin/lafarren-image-completer /media/portable/Projects/bin/lafarren-image-completer /media/portable/Projects/bin/lafarren-image-completer/CMakeFiles/ImageCompleterLib.dir/DependInfo.cmake --color=
  8. make[2]: Leaving directory `/media/portable/Projects/bin/lafarren-image-completer'
  9. make -f CMakeFiles/ImageCompleterLib.dir/build.make CMakeFiles/ImageCompleterLib.dir/build
  10. make[2]: Entering directory `/media/portable/Projects/bin/lafarren-image-completer'
  11. /home/doriad/bin/CMake/bin/cmake -E cmake_progress_report /media/portable/Projects/bin/lafarren-image-completer/CMakeFiles 7
  12. [  2%] Building CXX object CMakeFiles/ImageCompleterLib.dir/src/image-completer-cmd/AppData.cpp.o
  13. /usr/lib/ccache/c++   -D_FILE_OFFSET_BITS=64 -DWXUSINGDLL -D__WXGTK__ -DITK_IO_FACTORY_REGISTER_MANAGER -pthread  -ftemplate-depth-50 -Wall -Wno-deprecated -I/home/doriad/src/ITK/ITK/Core/TestKernel/include -I/home/doriad/src/ITK/ITK/Filtering/SpatialFunction/include -I/home/doriad/src/ITK/ITK/Filtering/QuadEdgeMeshFiltering/include -I/home/doriad/src/ITK/ITK/Core/QuadEdgeMesh/include -I/home/doriad/src/ITK/ITK/Segmentation/LabelVoting/include -I/home/doriad/src/ITK/ITK/Filtering/ImageLabel/include -I/home/doriad/src/ITK/ITK/Filtering/ImageCompose/include -I/home/doriad/src/ITK/ITK/IO/VTK/include -I/home/doriad/src/ITK/ITK/IO/Stimulate/include -I/home/doriad/src/ITK/ITK/IO/Spatialobjects/include -I/home/doriad/src/ITK/ITK/IO/XML/include -I/home/doriad/src/ITK/ITK/IO/Siemens/include -I/home/doriad/src/ITK/ITK/IO/RAW/include -I/home/doriad/src/ITK/ITK/IO/NRRD/include -I/home/doriad/src/ITK/ITK/Utilities/NrrdIO/src -I/home/doriad/bin/ITK/ITK/Utilities/NrrdIO/src/NrrdIO -I/home/doriad/src/ITK/ITK/IO/NIFTI/include -I/home/doriad/src/ITK/ITK/Utilities/NIFTI/src/nifti/znzlib -I/home/doriad/src/ITK/ITK/Utilities/NIFTI/src/nifti/niftilib -I/home/doriad/src/ITK/ITK/IO/Meta/include -I/home/doriad/src/ITK/ITK/Utilities/MetaIO/src/MetaIO -I/home/doriad/src/ITK/ITK/IO/LSM/include -I/home/doriad/src/ITK/ITK/IO/TIFF/include -I/home/doriad/src/ITK/ITK/Utilities/TIFF/src -I/home/doriad/bin/ITK/ITK/Utilities/TIFF/src -I/home/doriad/src/ITK/ITK/IO/JPEG/include -I/home/doriad/src/ITK/ITK/Utilities/JPEG/src -I/home/doriad/bin/ITK/ITK/Utilities/JPEG/src -I/home/doriad/src/ITK/ITK/IO/GIPL/include -I/home/doriad/src/ITK/ITK/IO/GE/include -I/home/doriad/src/ITK/ITK/IO/IPL/include -I/home/doriad/src/ITK/ITK/IO/GDCM/include -I/home/doriad/src/ITK/ITK/IO/BioRad/include -I/home/doriad/src/ITK/ITK/IO/BMP/include -I/home/doriad/src/ITK/ITK/Utilities/GDCM/src/gdcm/Source/DataStructureAndEncodingDefinition -I/home/doriad/src/ITK/ITK/Utilities/GDCM/src/gdcm/Source/MessageExchangeDefinition -I/home/doriad/src/ITK/ITK/Utilities/GDCM/src/gdcm/Source/InformationObjectDefinition -I/home/doriad/src/ITK/ITK/Utilities/GDCM/src/gdcm/Source/Common -I/home/doriad/src/ITK/ITK/Utilities/GDCM/src/gdcm/Source/DataDictionary -I/home/doriad/src/ITK/ITK/Utilities/GDCM/src/gdcm/Source/MediaStorageAndFileFormat -I/home/doriad/bin/ITK/ITK/Utilities/GDCM/src/gdcm/Source/Common -I/home/doriad/bin/ITK/ITK/Utilities/GDCM -I/home/doriad/src/ITK/ITK/Utilities/OpenJPEG/src/openjpeg -I/home/doriad/bin/ITK/ITK/Utilities/OpenJPEG/src/openjpeg -I/home/doriad/src/ITK/ITK/Filtering/FFT/include -I/home/doriad/src/ITK/ITK/Utilities/Expat/src/expat -I/home/doriad/bin/ITK/ITK/Utilities/Expat/src/expat -I/home/doriad/src/ITK/ITK/Filtering/DiffusionTensorImage/include -I/home/doriad/src/ITK/ITK/Filtering/DeformationField/include -I/home/doriad/src/ITK/ITK/Filtering/BiasCorrection/include -I/home/doriad/src/ITK/ITK/Numerics/Polynomials/include -I/home/doriad/src/ITK/ITK/Filtering/AntiAlias/include -I/home/doriad/src/ITK/ITK/Segmentation/LevelSets/include -I/home/doriad/src/ITK/ITK/Segmentation/SignedDistanceFunction/include -I/home/doriad/src/ITK/ITK/Numerics/Optimizers/include -I/home/doriad/src/ITK/ITK/Filtering/ImageFeature/include -I/home/doriad/src/ITK/ITK/Core/SpatialObjects/include -I/home/doriad/src/ITK/ITK/Core/Mesh/include -I/home/doriad/src/ITK/ITK/Filtering/ImageGradient/include -I/home/doriad/src/ITK/ITK/Filtering/Smoothing/include -I/home/doriad/src/ITK/ITK/Filtering/ImageCompare/include -I/home/doriad/src/ITK/ITK/Filtering/DistanceMap/include -I/home/doriad/src/ITK/ITK/Numerics/NarrowBand/include -I/home/doriad/src/ITK/ITK/Filtering/MathematicalMorphology/include -I/home/doriad/src/ITK/ITK/IO/PNG/include -I/home/doriad/src/ITK/ITK/Utilities/PNG/src -I/home/doriad/bin/ITK/ITK/Utilities/PNG/src -I/home/doriad/src/ITK/ITK/Utilities/ZLIB/src -I/home/doriad/bin/ITK/ITK/Utilities/ZLIB/src -I/home/doriad/src/ITK/ITK/IO/Base/include -I/home/doriad/src/ITK/ITK/Segmentation/ConnectedComponents/include -I/home/doriad/src/ITK/ITK/Filtering/Thresholding/include -I/home/doriad/src/ITK/ITK/Filtering/ImageIntensity/include -I/home/doriad/src/ITK/ITK/Filtering/Path/include -I/home/doriad/src/ITK/ITK/Filtering/AnisotropicSmoothing/include -I/home/doriad/src/ITK/ITK/Filtering/ImageGrid/include -I/home/doriad/src/ITK/ITK/Core/ImageFunction/include -I/home/doriad/src/ITK/ITK/Core/Transform/include -I/home/doriad/src/ITK/ITK/Filtering/ImageStatistics/include -I/home/doriad/src/ITK/ITK/Numerics/Statistics/include -I/home/doriad/bin/ITK/ITK/Utilities/Netlib -I/home/doriad/src/ITK/ITK/Core/ImageAdaptors/include -I/home/doriad/src/ITK/ITK/Filtering/CurvatureFlow/include -I/home/doriad/src/ITK/ITK/Filtering/ImageFilterBase/include -I/home/doriad/src/ITK/ITK/Core/FiniteDifference/include -I/home/doriad/src/ITK/ITK/Core/Common/include -I/home/doriad/bin/ITK/ITK/Core/Common -I/home/doriad/src/ITK/ITK/Utilities/VNLInstantiation/include -I/home/doriad/bin/ITK/ITK/Utilities/VNL/src/vxl/core -I/home/doriad/bin/ITK/ITK/Utilities/VNL/src/vxl/vcl -I/home/doriad/bin/ITK/ITK/Utilities/VNL/src/vxl/v3p/netlib -I/home/doriad/src/ITK/ITK/Utilities/VNL/src/vxl/core -I/home/doriad/src/ITK/ITK/Utilities/VNL/src/vxl/vcl -I/home/doriad/src/ITK/ITK/Utilities/VNL/src/vxl/v3p/netlib -I/home/doriad/bin/ITK/ITK/Utilities/KWSys/src -I/media/portable/Projects/bin/lafarren-image-completer/ITKIOFactoryRegistration -I/media/portable/src/Eigen -I/media/portable/src/Eigen/unsupported -I/usr/include/suitesparse -isystem /home/doriad/bin/wxWidgets2.9/lib/wx/include/gtk2-unicode-2.9 -isystem /home/doriad/src/wxWidgets-2.9.1/include -I/media/portable/Projects/src/lafarren-image-completer/src/image-completer-cmd -I/media/portable/Projects/src/lafarren-image-completer/src/image-completer-lib -I/media/portable/Projects/src/lafarren-image-completer/src/image-completer-lib/api -I/media/portable/Projects/src/lafarren-image-completer/src/image-completer-lib/impl -I/media/portable/Projects/src/lafarren-image-completer/src/image-completer-lib/impl/compositors -I/media/portable/Projects/src/lafarren-image-completer/src/image-completer-lib/impl/energy-calculators -I/media/portable/Projects/src/lafarren-image-completer/src/tech/tech -I/media/portable/Projects/src/lafarren-image-completer/src/tech    -o CMakeFiles/ImageCompleterLib.dir/src/image-completer-cmd/AppData.cpp.o -c /media/portable/Projects/src/lafarren-image-completer/src/image-completer-cmd/AppData.cpp
  14. In file included from /media/portable/Projects/src/lafarren-image-completer/src/image-completer-lib/api/LfnIcSettings.h:25,
  15.                  from /media/portable/Projects/src/lafarren-image-completer/src/image-completer-cmd/AppData.h:27,
  16.                  from /media/portable/Projects/src/lafarren-image-completer/src/image-completer-cmd/AppData.cpp:23:
  17. /media/portable/Projects/src/lafarren-image-completer/src/tech/tech/Core.h:51:2: error: #error "Implement tech/Core.h types for this platform!"
  18. /media/portable/Projects/src/lafarren-image-completer/src/tech/tech/Core.h:66:2: error: #error "Implement tech/Core.h's special keyword macros for this platform!"
  19. In file included from /media/portable/Projects/src/lafarren-image-completer/src/image-completer-lib/api/LfnIcSettings.h:26,
  20.                  from /media/portable/Projects/src/lafarren-image-completer/src/image-completer-cmd/AppData.h:27,
  21.                  from /media/portable/Projects/src/lafarren-image-completer/src/image-completer-cmd/AppData.cpp:23:
  22. /media/portable/Projects/src/lafarren-image-completer/src/image-completer-lib/api/LfnIcTypes.h:32: error: ‘int64’ does not name a type
  23. /media/portable/Projects/src/lafarren-image-completer/src/image-completer-lib/api/LfnIcTypes.h:33: error: ‘Energy’ does not name a type
  24. /media/portable/Projects/src/lafarren-image-completer/src/image-completer-lib/api/LfnIcTypes.h:34: error: ‘Energy’ does not name a type
  25. /media/portable/Projects/src/lafarren-image-completer/src/image-completer-lib/api/LfnIcTypes.h:37: error: ‘Energy’ does not name a type
  26. /media/portable/Projects/src/lafarren-image-completer/src/image-completer-lib/api/LfnIcTypes.h:38: error: ‘Belief’ does not name a type
  27. /media/portable/Projects/src/lafarren-image-completer/src/image-completer-lib/api/LfnIcTypes.h:39: error: ‘Belief’ does not name a type
  28. In file included from /media/portable/Projects/src/lafarren-image-completer/src/image-completer-cmd/AppData.h:27,
  29.                  from /media/portable/Projects/src/lafarren-image-completer/src/image-completer-cmd/AppData.cpp:23:
  30. /media/portable/Projects/src/lafarren-image-completer/src/image-completer-lib/api/LfnIcSettings.h:52: error: ‘int64’ does not name a type
  31. /media/portable/Projects/src/lafarren-image-completer/src/image-completer-lib/api/LfnIcSettings.h:54: error: ‘Belief’ does not name a type
  32. /media/portable/Projects/src/lafarren-image-completer/src/image-completer-lib/api/LfnIcSettings.h:55: error: ‘Belief’ does not name a type
  33. /media/portable/Projects/src/lafarren-image-completer/src/image-completer-lib/api/LfnIcSettings.h:57: error: ‘Belief’ does not name a type
  34. /media/portable/Projects/src/lafarren-image-completer/src/image-completer-lib/api/LfnIcSettings.h:58: error: ‘Belief’ does not name a type
  35. /media/portable/Projects/src/lafarren-image-completer/src/image-completer-lib/api/LfnIcSettings.h:60: error: ‘Energy’ does not name a type
  36. /media/portable/Projects/src/lafarren-image-completer/src/image-completer-lib/api/LfnIcSettings.h:61: error: ‘Energy’ does not name a type
  37. /media/portable/Projects/src/lafarren-image-completer/src/image-completer-lib/api/LfnIcSettings.h:99: error: ‘Belief’ does not name a type
  38. /media/portable/Projects/src/lafarren-image-completer/src/image-completer-lib/api/LfnIcSettings.h:103: error: ‘Belief’ does not name a type
  39. /media/portable/Projects/src/lafarren-image-completer/src/image-completer-lib/api/LfnIcSettings.h:108: error: ‘Energy’ does not name a type
  40. /media/portable/Projects/src/lafarren-image-completer/src/image-completer-lib/api/LfnIcSettings.h:122: error: expected constructor, destructor, or type conversion before ‘void’
  41. /media/portable/Projects/src/lafarren-image-completer/src/image-completer-lib/api/LfnIcSettings.h:123: error: expected constructor, destructor, or type conversion before ‘void’
  42. /media/portable/Projects/src/lafarren-image-completer/src/image-completer-lib/api/LfnIcSettings.h:124: error: expected constructor, destructor, or type conversion before ‘void’
  43. /media/portable/Projects/src/lafarren-image-completer/src/image-completer-lib/api/LfnIcSettings.h:144: error: expected constructor, destructor, or type conversion before ‘bool’
  44. /media/portable/Projects/src/lafarren-image-completer/src/image-completer-cmd/AppData.cpp: In constructor ‘AppData::AppData(const CommandLineOptions&, AppData::Image&, AppData::Mask&, AppData::Image&)’:
  45. /media/portable/Projects/src/lafarren-image-completer/src/image-completer-cmd/AppData.cpp:37: error: ‘SettingsConstruct’ is not a member of ‘LfnIc’
  46. /media/portable/Projects/src/lafarren-image-completer/src/image-completer-cmd/AppData.cpp:41: error: ‘AreSettingsValid’ is not a member of ‘LfnIc’
  47. /media/portable/Projects/src/lafarren-image-completer/src/image-completer-lib/api/LfnIcTypes.h: At global scope:
  48. /media/portable/Projects/src/lafarren-image-completer/src/image-completer-lib/api/LfnIcTypes.h:42: warning: ‘LfnIc::PRIORITY_MIN’ defined but not used
  49. make[2]: *** [CMakeFiles/ImageCompleterLib.dir/src/image-completer-cmd/AppData.cpp.o] Error 1
  50. make[2]: Leaving directory `/media/portable/Projects/bin/lafarren-image-completer'
  51. make[1]: *** [CMakeFiles/ImageCompleterLib.dir/all] Error 2
  52. make[1]: Leaving directory `/media/portable/Projects/bin/lafarren-image-completer'
  53. make: *** [all] Error 2