Pastebin launched a little side project called HostCabi.net, check it out ;-)Don't like ads? PRO users don't see any ads ;-)
Guest

spice-gtk3

By: a guest on May 14th, 2012  |  syntax: None  |  size: 1.57 KB  |  hits: 66  |  expires: Never
download  |  raw  |  embed  |  report abuse  |  print
Text below is selected. Please press Ctrl+C to copy to your clipboard. (⌘+C on Mac)
  1. make  all-recursive
  2. make[1]: Entering directory `/tmp/packerbuild-1000/spice-gtk3/spice-gtk3/src/spice-gtk-0.12'
  3. Making all in spice-common
  4. make[2]: Entering directory `/tmp/packerbuild-1000/spice-gtk3/spice-gtk3/src/spice-gtk-0.12/spice-common'
  5. make  all-recursive
  6. make[3]: Entering directory `/tmp/packerbuild-1000/spice-gtk3/spice-gtk3/src/spice-gtk-0.12/spice-common'
  7. Making all in python_modules
  8. make[4]: Entering directory `/tmp/packerbuild-1000/spice-gtk3/spice-gtk3/src/spice-gtk-0.12/spice-common/python_modules'
  9. make[4]: Nessuna operazione da eseguire per «all».
  10. make[4]: Leaving directory `/tmp/packerbuild-1000/spice-gtk3/spice-gtk3/src/spice-gtk-0.12/spice-common/python_modules'
  11. Making all in common
  12. make[4]: Entering directory `/tmp/packerbuild-1000/spice-gtk3/spice-gtk3/src/spice-gtk-0.12/spice-common/common'
  13.   GEN    generated_client_demarshallers.c
  14. make[4]: *** [generated_client_demarshallers.c] Errore 1
  15. make[4]: Leaving directory `/tmp/packerbuild-1000/spice-gtk3/spice-gtk3/src/spice-gtk-0.12/spice-common/common'
  16. make[3]: *** [all-recursive] Errore 1
  17. make[3]: Leaving directory `/tmp/packerbuild-1000/spice-gtk3/spice-gtk3/src/spice-gtk-0.12/spice-common'
  18. make[2]: *** [all] Errore 2
  19. make[2]: Leaving directory `/tmp/packerbuild-1000/spice-gtk3/spice-gtk3/src/spice-gtk-0.12/spice-common'
  20. make[1]: *** [all-recursive] Errore 1
  21. make[1]: Leaving directory `/tmp/packerbuild-1000/spice-gtk3/spice-gtk3/src/spice-gtk-0.12'
  22. make: *** [all] Errore 2
  23. ==> ERRORE: Si è verificato un errore in build().
  24.     L'operazione sta per essere interrotta...
  25. The build failed.