Pastebin launched a little side project called VERYVIRAL.com, check it out ;-) Want more features on Pastebin? Sign Up, it's FREE!
Guest

libtuxcap

By: a guest on Nov 29th, 2012  |  syntax: Bash  |  size: 21.47 KB  |  views: 46  |  expires: Never
download  |  raw  |  embed  |  report abuse  |  print
Text below is selected. Please press Ctrl+C to copy to your clipboard. (⌘+C on Mac)
  1. [ 35%] Building CXX object tuxcap/lib/CMakeFiles/tuxcap.dir/__/pycap/PycapApp.o                                                                        
  2. /tmp/yaourt-tmp-andrew/aur-libtuxcap/src/libtuxcap-1.4.0/tuxcap/pycap/PycapApp.cpp: In member function 'virtual void Sexy::PycapApp::Init(int, char**, bool)':
  3. /tmp/yaourt-tmp-andrew/aur-libtuxcap/src/libtuxcap-1.4.0/tuxcap/pycap/PycapApp.cpp:186:36: error: 'Py_InitModule' was not declared in this scope
  4. /tmp/yaourt-tmp-andrew/aur-libtuxcap/src/libtuxcap-1.4.0/tuxcap/pycap/PycapApp.cpp:190:24: error: 'PyExc_StandardError' was not declared in this scope
  5. /tmp/yaourt-tmp-andrew/aur-libtuxcap/src/libtuxcap-1.4.0/tuxcap/pycap/PycapApp.cpp:197:39: error: 'PyString_FromString' was not declared in this scope
  6. /tmp/yaourt-tmp-andrew/aur-libtuxcap/src/libtuxcap-1.4.0/tuxcap/pycap/PycapApp.cpp:199:24: error: 'PyExc_StandardError' was not declared in this scope
  7. /tmp/yaourt-tmp-andrew/aur-libtuxcap/src/libtuxcap-1.4.0/tuxcap/pycap/PycapApp.cpp:207:24: error: 'PyExc_StandardError' was not declared in this scope
  8. /tmp/yaourt-tmp-andrew/aur-libtuxcap/src/libtuxcap-1.4.0/tuxcap/pycap/PycapApp.cpp:227:49: error: 'PyString_Check' was not declared in this scope
  9. /tmp/yaourt-tmp-andrew/aur-libtuxcap/src/libtuxcap-1.4.0/tuxcap/pycap/PycapApp.cpp:229:54: error: 'PyString_AsString' was not declared in this scope
  10. /tmp/yaourt-tmp-andrew/aur-libtuxcap/src/libtuxcap-1.4.0/tuxcap/pycap/PycapApp.cpp:233:28: error: 'PyExc_StandardError' was not declared in this scope
  11. /tmp/yaourt-tmp-andrew/aur-libtuxcap/src/libtuxcap-1.4.0/tuxcap/pycap/PycapApp.cpp:239:49: error: 'PyString_Check' was not declared in this scope
  12. /tmp/yaourt-tmp-andrew/aur-libtuxcap/src/libtuxcap-1.4.0/tuxcap/pycap/PycapApp.cpp:241:58: error: 'PyString_AsString' was not declared in this scope
  13. /tmp/yaourt-tmp-andrew/aur-libtuxcap/src/libtuxcap-1.4.0/tuxcap/pycap/PycapApp.cpp:245:28: error: 'PyExc_StandardError' was not declared in this scope
  14. /tmp/yaourt-tmp-andrew/aur-libtuxcap/src/libtuxcap-1.4.0/tuxcap/pycap/PycapApp.cpp:251:49: error: 'PyString_Check' was not declared in this scope
  15. /tmp/yaourt-tmp-andrew/aur-libtuxcap/src/libtuxcap-1.4.0/tuxcap/pycap/PycapApp.cpp:253:51: error: 'PyString_AsString' was not declared in this scope
  16. /tmp/yaourt-tmp-andrew/aur-libtuxcap/src/libtuxcap-1.4.0/tuxcap/pycap/PycapApp.cpp:257:28: error: 'PyExc_StandardError' was not declared in this scope
  17. /tmp/yaourt-tmp-andrew/aur-libtuxcap/src/libtuxcap-1.4.0/tuxcap/pycap/PycapApp.cpp:263:49: error: 'PyString_Check' was not declared in this scope
  18. /tmp/yaourt-tmp-andrew/aur-libtuxcap/src/libtuxcap-1.4.0/tuxcap/pycap/PycapApp.cpp:265:57: error: 'PyString_AsString' was not declared in this scope
  19. /tmp/yaourt-tmp-andrew/aur-libtuxcap/src/libtuxcap-1.4.0/tuxcap/pycap/PycapApp.cpp:269:28: error: 'PyExc_StandardError' was not declared in this scope
  20. /tmp/yaourt-tmp-andrew/aur-libtuxcap/src/libtuxcap-1.4.0/tuxcap/pycap/PycapApp.cpp:275:49: error: 'PyString_Check' was not declared in this scope
  21. /tmp/yaourt-tmp-andrew/aur-libtuxcap/src/libtuxcap-1.4.0/tuxcap/pycap/PycapApp.cpp:277:48: error: 'PyString_AsString' was not declared in this scope
  22. /tmp/yaourt-tmp-andrew/aur-libtuxcap/src/libtuxcap-1.4.0/tuxcap/pycap/PycapApp.cpp:281:28: error: 'PyExc_StandardError' was not declared in this scope
  23. /tmp/yaourt-tmp-andrew/aur-libtuxcap/src/libtuxcap-1.4.0/tuxcap/pycap/PycapApp.cpp:287:49: error: 'PyString_Check' was not declared in this scope
  24. /tmp/yaourt-tmp-andrew/aur-libtuxcap/src/libtuxcap-1.4.0/tuxcap/pycap/PycapApp.cpp:289:49: error: 'PyString_AsString' was not declared in this scope
  25. /tmp/yaourt-tmp-andrew/aur-libtuxcap/src/libtuxcap-1.4.0/tuxcap/pycap/PycapApp.cpp:293:28: error: 'PyExc_StandardError' was not declared in this scope
  26. /tmp/yaourt-tmp-andrew/aur-libtuxcap/src/libtuxcap-1.4.0/tuxcap/pycap/PycapApp.cpp:299:46: error: 'PyInt_Check' was not declared in this scope
  27. /tmp/yaourt-tmp-andrew/aur-libtuxcap/src/libtuxcap-1.4.0/tuxcap/pycap/PycapApp.cpp:301:43: error: 'PyInt_AsLong' was not declared in this scope
  28. /tmp/yaourt-tmp-andrew/aur-libtuxcap/src/libtuxcap-1.4.0/tuxcap/pycap/PycapApp.cpp:305:28: error: 'PyExc_StandardError' was not declared in this scope
  29. /tmp/yaourt-tmp-andrew/aur-libtuxcap/src/libtuxcap-1.4.0/tuxcap/pycap/PycapApp.cpp:311:46: error: 'PyInt_Check' was not declared in this scope
  30. /tmp/yaourt-tmp-andrew/aur-libtuxcap/src/libtuxcap-1.4.0/tuxcap/pycap/PycapApp.cpp:313:44: error: 'PyInt_AsLong' was not declared in this scope
  31. /tmp/yaourt-tmp-andrew/aur-libtuxcap/src/libtuxcap-1.4.0/tuxcap/pycap/PycapApp.cpp:317:28: error: 'PyExc_StandardError' was not declared in this scope
  32. /tmp/yaourt-tmp-andrew/aur-libtuxcap/src/libtuxcap-1.4.0/tuxcap/pycap/PycapApp.cpp:323:46: error: 'PyInt_Check' was not declared in this scope
  33. /tmp/yaourt-tmp-andrew/aur-libtuxcap/src/libtuxcap-1.4.0/tuxcap/pycap/PycapApp.cpp:325:50: error: 'PyInt_AsLong' was not declared in this scope
  34. /tmp/yaourt-tmp-andrew/aur-libtuxcap/src/libtuxcap-1.4.0/tuxcap/pycap/PycapApp.cpp:329:28: error: 'PyExc_StandardError' was not declared in this scope
  35. /tmp/yaourt-tmp-andrew/aur-libtuxcap/src/libtuxcap-1.4.0/tuxcap/pycap/PycapApp.cpp:335:46: error: 'PyInt_Check' was not declared in this scope
  36. /tmp/yaourt-tmp-andrew/aur-libtuxcap/src/libtuxcap-1.4.0/tuxcap/pycap/PycapApp.cpp:337:50: error: 'PyInt_AsLong' was not declared in this scope
  37. /tmp/yaourt-tmp-andrew/aur-libtuxcap/src/libtuxcap-1.4.0/tuxcap/pycap/PycapApp.cpp:341:28: error: 'PyExc_StandardError' was not declared in this scope
  38. /tmp/yaourt-tmp-andrew/aur-libtuxcap/src/libtuxcap-1.4.0/tuxcap/pycap/PycapApp.cpp:347:46: error: 'PyInt_Check' was not declared in this scope
  39. /tmp/yaourt-tmp-andrew/aur-libtuxcap/src/libtuxcap-1.4.0/tuxcap/pycap/PycapApp.cpp:349:44: error: 'PyInt_AsLong' was not declared in this scope
  40. /tmp/yaourt-tmp-andrew/aur-libtuxcap/src/libtuxcap-1.4.0/tuxcap/pycap/PycapApp.cpp:353:46: error: 'PyInt_Check' was not declared in this scope
  41. /tmp/yaourt-tmp-andrew/aur-libtuxcap/src/libtuxcap-1.4.0/tuxcap/pycap/PycapApp.cpp:355:50: error: 'PyInt_AsLong' was not declared in this scope
  42. /tmp/yaourt-tmp-andrew/aur-libtuxcap/src/libtuxcap-1.4.0/tuxcap/pycap/PycapApp.cpp:359:28: error: 'PyExc_StandardError' was not declared in this scope
  43. /tmp/yaourt-tmp-andrew/aur-libtuxcap/src/libtuxcap-1.4.0/tuxcap/pycap/PycapApp.cpp:364:49: error: 'PyString_Check' was not declared in this scope
  44. /tmp/yaourt-tmp-andrew/aur-libtuxcap/src/libtuxcap-1.4.0/tuxcap/pycap/PycapApp.cpp:366:56: error: 'PyString_AsString' was not declared in this scope
  45. /tmp/yaourt-tmp-andrew/aur-libtuxcap/src/libtuxcap-1.4.0/tuxcap/pycap/PycapApp.cpp:371:24: error: 'PyExc_StandardError' was not declared in this scope
  46. /tmp/yaourt-tmp-andrew/aur-libtuxcap/src/libtuxcap-1.4.0/tuxcap/pycap/PycapApp.cpp: In member function 'virtual void Sexy::PycapApp::LoadingThreadCompleted()':
  47. /tmp/yaourt-tmp-andrew/aur-libtuxcap/src/libtuxcap-1.4.0/tuxcap/pycap/PycapApp.cpp:423:24: error: 'PyExc_StandardError' was not declared in this scope
  48. /tmp/yaourt-tmp-andrew/aur-libtuxcap/src/libtuxcap-1.4.0/tuxcap/pycap/PycapApp.cpp: In static member function 'static PyObject* Sexy::PycapApp::pSetColour(PyObject*, PyObject*)':
  49. /tmp/yaourt-tmp-andrew/aur-libtuxcap/src/libtuxcap-1.4.0/tuxcap/pycap/PycapApp.cpp:528:24: error: 'PyExc_StandardError' was not declared in this scope
  50. /tmp/yaourt-tmp-andrew/aur-libtuxcap/src/libtuxcap-1.4.0/tuxcap/pycap/PycapApp.cpp:539:24: error: 'PyExc_StandardError' was not declared in this scope
  51. /tmp/yaourt-tmp-andrew/aur-libtuxcap/src/libtuxcap-1.4.0/tuxcap/pycap/PycapApp.cpp: In static member function 'static PyObject* Sexy::PycapApp::pSetFont(PyObject*, PyObject*)':
  52. /tmp/yaourt-tmp-andrew/aur-libtuxcap/src/libtuxcap-1.4.0/tuxcap/pycap/PycapApp.cpp:561:24: error: 'PyExc_StandardError' was not declared in this scope
  53. /tmp/yaourt-tmp-andrew/aur-libtuxcap/src/libtuxcap-1.4.0/tuxcap/pycap/PycapApp.cpp:572:24: error: 'PyExc_StandardError' was not declared in this scope
  54. /tmp/yaourt-tmp-andrew/aur-libtuxcap/src/libtuxcap-1.4.0/tuxcap/pycap/PycapApp.cpp:582:24: error: 'PyExc_StandardError' was not declared in this scope
  55. /tmp/yaourt-tmp-andrew/aur-libtuxcap/src/libtuxcap-1.4.0/tuxcap/pycap/PycapApp.cpp: In static member function 'static PyObject* Sexy::PycapApp::pSetColourize(PyObject*, PyObject*)':
  56. /tmp/yaourt-tmp-andrew/aur-libtuxcap/src/libtuxcap-1.4.0/tuxcap/pycap/PycapApp.cpp:605:24: error: 'PyExc_StandardError' was not declared in this scope
  57. /tmp/yaourt-tmp-andrew/aur-libtuxcap/src/libtuxcap-1.4.0/tuxcap/pycap/PycapApp.cpp:616:24: error: 'PyExc_StandardError' was not declared in this scope
  58. /tmp/yaourt-tmp-andrew/aur-libtuxcap/src/libtuxcap-1.4.0/tuxcap/pycap/PycapApp.cpp: In static member function 'static PyObject* Sexy::PycapApp::pFillRect(PyObject*, PyObject*)':
  59. /tmp/yaourt-tmp-andrew/aur-libtuxcap/src/libtuxcap-1.4.0/tuxcap/pycap/PycapApp.cpp:637:24: error: 'PyExc_StandardError' was not declared in this scope
  60. /tmp/yaourt-tmp-andrew/aur-libtuxcap/src/libtuxcap-1.4.0/tuxcap/pycap/PycapApp.cpp:648:24: error: 'PyExc_StandardError' was not declared in this scope
  61. /tmp/yaourt-tmp-andrew/aur-libtuxcap/src/libtuxcap-1.4.0/tuxcap/pycap/PycapApp.cpp: In static member function 'static PyObject* Sexy::PycapApp::pDrawLine(PyObject*, PyObject*)':
  62. /tmp/yaourt-tmp-andrew/aur-libtuxcap/src/libtuxcap-1.4.0/tuxcap/pycap/PycapApp.cpp:669:24: error: 'PyExc_StandardError' was not declared in this scope
  63. /tmp/yaourt-tmp-andrew/aur-libtuxcap/src/libtuxcap-1.4.0/tuxcap/pycap/PycapApp.cpp:680:24: error: 'PyExc_StandardError' was not declared in this scope
  64. /tmp/yaourt-tmp-andrew/aur-libtuxcap/src/libtuxcap-1.4.0/tuxcap/pycap/PycapApp.cpp: In static member function 'static PyObject* Sexy::PycapApp::pDrawImage(PyObject*, PyObject*)':
  65. /tmp/yaourt-tmp-andrew/aur-libtuxcap/src/libtuxcap-1.4.0/tuxcap/pycap/PycapApp.cpp:701:24: error: 'PyExc_StandardError' was not declared in this scope
  66. /tmp/yaourt-tmp-andrew/aur-libtuxcap/src/libtuxcap-1.4.0/tuxcap/pycap/PycapApp.cpp:712:24: error: 'PyExc_StandardError' was not declared in this scope
  67. /tmp/yaourt-tmp-andrew/aur-libtuxcap/src/libtuxcap-1.4.0/tuxcap/pycap/PycapApp.cpp:722:24: error: 'PyExc_StandardError' was not declared in this scope
  68. /tmp/yaourt-tmp-andrew/aur-libtuxcap/src/libtuxcap-1.4.0/tuxcap/pycap/PycapApp.cpp: In static member function 'static PyObject* Sexy::PycapApp::pDrawImageF(PyObject*, PyObject*)':
  69. /tmp/yaourt-tmp-andrew/aur-libtuxcap/src/libtuxcap-1.4.0/tuxcap/pycap/PycapApp.cpp:745:24: error: 'PyExc_StandardError' was not declared in this scope
  70. /tmp/yaourt-tmp-andrew/aur-libtuxcap/src/libtuxcap-1.4.0/tuxcap/pycap/PycapApp.cpp:756:24: error: 'PyExc_StandardError' was not declared in this scope
  71. /tmp/yaourt-tmp-andrew/aur-libtuxcap/src/libtuxcap-1.4.0/tuxcap/pycap/PycapApp.cpp:766:24: error: 'PyExc_StandardError' was not declared in this scope
  72. /tmp/yaourt-tmp-andrew/aur-libtuxcap/src/libtuxcap-1.4.0/tuxcap/pycap/PycapApp.cpp: In static member function 'static PyObject* Sexy::PycapApp::pDrawImageRot(PyObject*, PyObject*)':
  73. /tmp/yaourt-tmp-andrew/aur-libtuxcap/src/libtuxcap-1.4.0/tuxcap/pycap/PycapApp.cpp:790:24: error: 'PyExc_StandardError' was not declared in this scope
  74. /tmp/yaourt-tmp-andrew/aur-libtuxcap/src/libtuxcap-1.4.0/tuxcap/pycap/PycapApp.cpp:801:24: error: 'PyExc_StandardError' was not declared in this scope
  75. /tmp/yaourt-tmp-andrew/aur-libtuxcap/src/libtuxcap-1.4.0/tuxcap/pycap/PycapApp.cpp:811:24: error: 'PyExc_StandardError' was not declared in this scope
  76. /tmp/yaourt-tmp-andrew/aur-libtuxcap/src/libtuxcap-1.4.0/tuxcap/pycap/PycapApp.cpp: In static member function 'static PyObject* Sexy::PycapApp::pDrawImageRotF(PyObject*, PyObject*)':
  77. /tmp/yaourt-tmp-andrew/aur-libtuxcap/src/libtuxcap-1.4.0/tuxcap/pycap/PycapApp.cpp:835:24: error: 'PyExc_StandardError' was not declared in this scope
  78. /tmp/yaourt-tmp-andrew/aur-libtuxcap/src/libtuxcap-1.4.0/tuxcap/pycap/PycapApp.cpp:846:24: error: 'PyExc_StandardError' was not declared in this scope
  79. /tmp/yaourt-tmp-andrew/aur-libtuxcap/src/libtuxcap-1.4.0/tuxcap/pycap/PycapApp.cpp:856:24: error: 'PyExc_StandardError' was not declared in this scope
  80. /tmp/yaourt-tmp-andrew/aur-libtuxcap/src/libtuxcap-1.4.0/tuxcap/pycap/PycapApp.cpp: In static member function 'static PyObject* Sexy::PycapApp::pDrawImageScaled(PyObject*, PyObject*)':
  81. /tmp/yaourt-tmp-andrew/aur-libtuxcap/src/libtuxcap-1.4.0/tuxcap/pycap/PycapApp.cpp:879:24: error: 'PyExc_StandardError' was not declared in this scope
  82. /tmp/yaourt-tmp-andrew/aur-libtuxcap/src/libtuxcap-1.4.0/tuxcap/pycap/PycapApp.cpp:890:24: error: 'PyExc_StandardError' was not declared in this scope
  83. /tmp/yaourt-tmp-andrew/aur-libtuxcap/src/libtuxcap-1.4.0/tuxcap/pycap/PycapApp.cpp:900:24: error: 'PyExc_StandardError' was not declared in this scope
  84. /tmp/yaourt-tmp-andrew/aur-libtuxcap/src/libtuxcap-1.4.0/tuxcap/pycap/PycapApp.cpp: In static member function 'static PyObject* Sexy::PycapApp::pDrawString(PyObject*, PyObject*)':
  85. /tmp/yaourt-tmp-andrew/aur-libtuxcap/src/libtuxcap-1.4.0/tuxcap/pycap/PycapApp.cpp:934:22: error: 'PyExc_StandardError' was not declared in this scope
  86. /tmp/yaourt-tmp-andrew/aur-libtuxcap/src/libtuxcap-1.4.0/tuxcap/pycap/PycapApp.cpp:945:24: error: 'PyExc_StandardError' was not declared in this scope
  87. /tmp/yaourt-tmp-andrew/aur-libtuxcap/src/libtuxcap-1.4.0/tuxcap/pycap/PycapApp.cpp: In static member function 'static PyObject* Sexy::PycapApp::pShowMouse(PyObject*, PyObject*)':
  88. /tmp/yaourt-tmp-andrew/aur-libtuxcap/src/libtuxcap-1.4.0/tuxcap/pycap/PycapApp.cpp:966:22: error: 'PyExc_StandardError' was not declared in this scope
  89. /tmp/yaourt-tmp-andrew/aur-libtuxcap/src/libtuxcap-1.4.0/tuxcap/pycap/PycapApp.cpp: In static member function 'static PyObject* Sexy::PycapApp::pDrawmodeNormal(PyObject*, PyObject*)':
  90. /tmp/yaourt-tmp-andrew/aur-libtuxcap/src/libtuxcap-1.4.0/tuxcap/pycap/PycapApp.cpp:997:24: error: 'PyExc_StandardError' was not declared in this scope
  91. /tmp/yaourt-tmp-andrew/aur-libtuxcap/src/libtuxcap-1.4.0/tuxcap/pycap/PycapApp.cpp: In static member function 'static PyObject* Sexy::PycapApp::pDrawmodeAdd(PyObject*, PyObject*)':
  92. /tmp/yaourt-tmp-andrew/aur-libtuxcap/src/libtuxcap-1.4.0/tuxcap/pycap/PycapApp.cpp:1020:24: error: 'PyExc_StandardError' was not declared in this scope
  93. /tmp/yaourt-tmp-andrew/aur-libtuxcap/src/libtuxcap-1.4.0/tuxcap/pycap/PycapApp.cpp: In static member function 'static PyObject* Sexy::PycapApp::pPlaySound(PyObject*, PyObject*)':
  94. /tmp/yaourt-tmp-andrew/aur-libtuxcap/src/libtuxcap-1.4.0/tuxcap/pycap/PycapApp.cpp:1046:22: error: 'PyExc_StandardError' was not declared in this scope
  95. /tmp/yaourt-tmp-andrew/aur-libtuxcap/src/libtuxcap-1.4.0/tuxcap/pycap/PycapApp.cpp:1056:24: error: 'PyExc_StandardError' was not declared in this scope
  96. /tmp/yaourt-tmp-andrew/aur-libtuxcap/src/libtuxcap-1.4.0/tuxcap/pycap/PycapApp.cpp:1078:24: error: 'PyExc_StandardError' was not declared in this scope
  97. /tmp/yaourt-tmp-andrew/aur-libtuxcap/src/libtuxcap-1.4.0/tuxcap/pycap/PycapApp.cpp: In static member function 'static PyObject* Sexy::PycapApp::pReadReg(PyObject*, PyObject*)':
  98. /tmp/yaourt-tmp-andrew/aur-libtuxcap/src/libtuxcap-1.4.0/tuxcap/pycap/PycapApp.cpp:1099:22: error: 'PyExc_StandardError' was not declared in this scope
  99. /tmp/yaourt-tmp-andrew/aur-libtuxcap/src/libtuxcap-1.4.0/tuxcap/pycap/PycapApp.cpp: In static member function 'static PyObject* Sexy::PycapApp::pWriteReg(PyObject*, PyObject*)':
  100. /tmp/yaourt-tmp-andrew/aur-libtuxcap/src/libtuxcap-1.4.0/tuxcap/pycap/PycapApp.cpp:1127:24: error: 'PyExc_StandardError' was not declared in this scope
  101. /tmp/yaourt-tmp-andrew/aur-libtuxcap/src/libtuxcap-1.4.0/tuxcap/pycap/PycapApp.cpp: In static member function 'static PyObject* Sexy::PycapApp::pPlayTune(PyObject*, PyObject*)':
  102. /tmp/yaourt-tmp-andrew/aur-libtuxcap/src/libtuxcap-1.4.0/tuxcap/pycap/PycapApp.cpp:1155:22: error: 'PyExc_StandardError' was not declared in this scope
  103. /tmp/yaourt-tmp-andrew/aur-libtuxcap/src/libtuxcap-1.4.0/tuxcap/pycap/PycapApp.cpp:1165:24: error: 'PyExc_StandardError' was not declared in this scope
  104. /tmp/yaourt-tmp-andrew/aur-libtuxcap/src/libtuxcap-1.4.0/tuxcap/pycap/PycapApp.cpp: In static member function 'static PyObject* Sexy::PycapApp::pStopTune(PyObject*, PyObject*)':
  105. /tmp/yaourt-tmp-andrew/aur-libtuxcap/src/libtuxcap-1.4.0/tuxcap/pycap/PycapApp.cpp:1188:22: error: 'PyExc_StandardError' was not declared in this scope
  106. /tmp/yaourt-tmp-andrew/aur-libtuxcap/src/libtuxcap-1.4.0/tuxcap/pycap/PycapApp.cpp:1198:24: error: 'PyExc_StandardError' was not declared in this scope
  107. /tmp/yaourt-tmp-andrew/aur-libtuxcap/src/libtuxcap-1.4.0/tuxcap/pycap/PycapApp.cpp: In static member function 'static PyObject* Sexy::PycapApp::pSetVolume(PyObject*, PyObject*)':
  108. /tmp/yaourt-tmp-andrew/aur-libtuxcap/src/libtuxcap-1.4.0/tuxcap/pycap/PycapApp.cpp:1222:22: error: 'PyExc_StandardError' was not declared in this scope
  109. /tmp/yaourt-tmp-andrew/aur-libtuxcap/src/libtuxcap-1.4.0/tuxcap/pycap/PycapApp.cpp: In static member function 'static PyObject* Sexy::PycapApp::pSetTuneVolume(PyObject*, PyObject*)':
  110. /tmp/yaourt-tmp-andrew/aur-libtuxcap/src/libtuxcap-1.4.0/tuxcap/pycap/PycapApp.cpp:1246:24: error: 'PyExc_StandardError' was not declared in this scope
  111. /tmp/yaourt-tmp-andrew/aur-libtuxcap/src/libtuxcap-1.4.0/tuxcap/pycap/PycapApp.cpp: In static member function 'static PyObject* Sexy::PycapApp::pSetClipRect(PyObject*, PyObject*)':
  112. /tmp/yaourt-tmp-andrew/aur-libtuxcap/src/libtuxcap-1.4.0/tuxcap/pycap/PycapApp.cpp:1268:24: error: 'PyExc_StandardError' was not declared in this scope
  113. /tmp/yaourt-tmp-andrew/aur-libtuxcap/src/libtuxcap-1.4.0/tuxcap/pycap/PycapApp.cpp:1279:24: error: 'PyExc_StandardError' was not declared in this scope
  114. /tmp/yaourt-tmp-andrew/aur-libtuxcap/src/libtuxcap-1.4.0/tuxcap/pycap/PycapApp.cpp: In static member function 'static PyObject* Sexy::PycapApp::pClearClipRect(PyObject*, PyObject*)':
  115. /tmp/yaourt-tmp-andrew/aur-libtuxcap/src/libtuxcap-1.4.0/tuxcap/pycap/PycapApp.cpp:1302:24: error: 'PyExc_StandardError' was not declared in this scope
  116. /tmp/yaourt-tmp-andrew/aur-libtuxcap/src/libtuxcap-1.4.0/tuxcap/pycap/PycapApp.cpp: In static member function 'static PyObject* Sexy::PycapApp::pSetTranslation(PyObject*, PyObject*)':
  117. /tmp/yaourt-tmp-andrew/aur-libtuxcap/src/libtuxcap-1.4.0/tuxcap/pycap/PycapApp.cpp:1324:22: error: 'PyExc_StandardError' was not declared in this scope
  118. /tmp/yaourt-tmp-andrew/aur-libtuxcap/src/libtuxcap-1.4.0/tuxcap/pycap/PycapApp.cpp:1335:30: error: 'PyExc_StandardError' was not declared in this scope
  119. /tmp/yaourt-tmp-andrew/aur-libtuxcap/src/libtuxcap-1.4.0/tuxcap/pycap/PycapApp.cpp: In static member function 'static PyObject* Sexy::PycapApp::pSetFullscreen(PyObject*, PyObject*)':
  120. /tmp/yaourt-tmp-andrew/aur-libtuxcap/src/libtuxcap-1.4.0/tuxcap/pycap/PycapApp.cpp:1356:22: error: 'PyExc_StandardError' was not declared in this scope
  121. /tmp/yaourt-tmp-andrew/aur-libtuxcap/src/libtuxcap-1.4.0/tuxcap/pycap/PycapApp.cpp: In static member function 'static PyObject* Sexy::PycapApp::pAllowAllAccess(PyObject*, PyObject*)':
  122. /tmp/yaourt-tmp-andrew/aur-libtuxcap/src/libtuxcap-1.4.0/tuxcap/pycap/PycapApp.cpp:1393:22: error: 'PyExc_StandardError' was not declared in this scope
  123. /tmp/yaourt-tmp-andrew/aur-libtuxcap/src/libtuxcap-1.4.0/tuxcap/pycap/PycapApp.cpp: In static member function 'static PyObject* Sexy::PycapApp::pGetKeyCode(PyObject*, PyObject*)':
  124. /tmp/yaourt-tmp-andrew/aur-libtuxcap/src/libtuxcap-1.4.0/tuxcap/pycap/PycapApp.cpp:1417:22: error: 'PyExc_StandardError' was not declared in this scope
  125. /tmp/yaourt-tmp-andrew/aur-libtuxcap/src/libtuxcap-1.4.0/tuxcap/pycap/PycapApp.cpp: In static member function 'static PyObject* Sexy::PycapApp::pIsKeyDown(PyObject*, PyObject*)':
  126. /tmp/yaourt-tmp-andrew/aur-libtuxcap/src/libtuxcap-1.4.0/tuxcap/pycap/PycapApp.cpp:1452:22: error: 'PyExc_StandardError' was not declared in this scope
  127. /tmp/yaourt-tmp-andrew/aur-libtuxcap/src/libtuxcap-1.4.0/tuxcap/pycap/PycapApp.cpp: In static member function 'static PyObject* Sexy::PycapApp::pDrawImageRotScaled(PyObject*, PyObject*)':
  128. /tmp/yaourt-tmp-andrew/aur-libtuxcap/src/libtuxcap-1.4.0/tuxcap/pycap/PycapApp.cpp:1496:22: error: 'PyExc_StandardError' was not declared in this scope
  129. /tmp/yaourt-tmp-andrew/aur-libtuxcap/src/libtuxcap-1.4.0/tuxcap/pycap/PycapApp.cpp:1507:24: error: 'PyExc_StandardError' was not declared in this scope
  130. /tmp/yaourt-tmp-andrew/aur-libtuxcap/src/libtuxcap-1.4.0/tuxcap/pycap/PycapApp.cpp:1517:24: error: 'PyExc_StandardError' was not declared in this scope
  131. /tmp/yaourt-tmp-andrew/aur-libtuxcap/src/libtuxcap-1.4.0/tuxcap/pycap/PycapApp.cpp: In static member function 'static PyObject* Sexy::PycapApp::pSet3DAccelerated(PyObject*, PyObject*)':
  132. /tmp/yaourt-tmp-andrew/aur-libtuxcap/src/libtuxcap-1.4.0/tuxcap/pycap/PycapApp.cpp:1548:22: error: 'PyExc_StandardError' was not declared in this scope
  133. /tmp/yaourt-tmp-andrew/aur-libtuxcap/src/libtuxcap-1.4.0/tuxcap/pycap/PycapApp.cpp: In static member function 'static PyObject* Sexy::PycapApp::pDrawQuad(PyObject*, PyObject*)':
  134. /tmp/yaourt-tmp-andrew/aur-libtuxcap/src/libtuxcap-1.4.0/tuxcap/pycap/PycapApp.cpp:1571:22: error: 'PyExc_StandardError' was not declared in this scope
  135. /tmp/yaourt-tmp-andrew/aur-libtuxcap/src/libtuxcap-1.4.0/tuxcap/pycap/PycapApp.cpp:1582:24: error: 'PyExc_StandardError' was not declared in this scope
  136. /tmp/yaourt-tmp-andrew/aur-libtuxcap/src/libtuxcap-1.4.0/tuxcap/pycap/PycapApp.cpp: In static member function 'static PyObject* Sexy::PycapApp::pDrawTri(PyObject*, PyObject*)':
  137. /tmp/yaourt-tmp-andrew/aur-libtuxcap/src/libtuxcap-1.4.0/tuxcap/pycap/PycapApp.cpp:1608:22: error: 'PyExc_StandardError' was not declared in this scope
  138. /tmp/yaourt-tmp-andrew/aur-libtuxcap/src/libtuxcap-1.4.0/tuxcap/pycap/PycapApp.cpp:1619:24: error: 'PyExc_StandardError' was not declared in this scope
  139. make[2]: *** [tuxcap/lib/CMakeFiles/tuxcap.dir/__/pycap/PycapApp.o] Error 1
  140. make[1]: *** [tuxcap/lib/CMakeFiles/tuxcap.dir/all] Error 2
  141. make: *** [all] Error 2
clone this paste RAW Paste Data