Want more features on Pastebin? Sign Up, it's FREE!
Guest

Paraview 3.98 compile fail

By: a guest on Feb 1st, 2013  |  syntax: None  |  size: 195.53 KB  |  views: 140  |  expires: Never
download  |  raw  |  embed  |  report abuse  |  print
Text below is selected. Please press Ctrl+C to copy to your clipboard. (⌘+C on Mac)
  1. ==> Erstelle Paket: paraview 3.98.0-2 (Fr 1. Feb 18:56:04 CET 2013)
  2. ==> Prüfe Laufzeit-Abhängigkeiten...
  3. ==> Prüfe Buildtime-Abhängigkeiten...
  4. ==> Empfange Quellen...
  5.   -> ParaView-3.98.0-src.tgz gefunden
  6.   -> paraview.png gefunden
  7.   -> paraview.desktop gefunden
  8. ==> Überprüfe Gültigkeit der Quell-Dateien mit sha1sums...
  9.     ParaView-3.98.0-src.tgz ... Durchgelaufen
  10.     paraview.png ... Durchgelaufen
  11.     paraview.desktop ... Durchgelaufen
  12. ==> Entpacke Quellen...
  13.   -> Entpacke ParaView-3.98.0-src.tgz mit bsdtar
  14. ==> Beginne build()...
  15. -- The C compiler identification is GNU 4.7.2
  16. -- The CXX compiler identification is GNU 4.7.2
  17. -- Check for working C compiler: /usr/bin/cc
  18. -- Check for working C compiler: /usr/bin/cc -- works
  19. -- Detecting C compiler ABI info
  20. -- Detecting C compiler ABI info - done
  21. -- Check for working CXX compiler: /usr/bin/c++
  22. -- Check for working CXX compiler: /usr/bin/c++ -- works
  23. -- Detecting CXX compiler ABI info
  24. -- Detecting CXX compiler ABI info - done
  25. -- Found Git: /usr/bin/git (found version "1.8.1.2")
  26. -- Could not use git to determine source version, using version 3.98.0-enhanced
  27. -- Looking for Q_WS_X11
  28. -- Looking for Q_WS_X11 - found
  29. -- Looking for Q_WS_WIN
  30. -- Looking for Q_WS_WIN - not found
  31. -- Looking for Q_WS_QWS
  32. -- Looking for Q_WS_QWS - not found
  33. -- Looking for Q_WS_MAC
  34. -- Looking for Q_WS_MAC - not found
  35. -- Found Qt4: /usr/bin/qmake (found suitable version "4.8.4", minimum required is "4.7.0")
  36. -- Found PythonLibs: /usr/lib/libpython2.7.so  
  37. -- Performing Test HAVE_GCC_ERROR_RETURN_TYPE
  38. -- Performing Test HAVE_GCC_ERROR_RETURN_TYPE - Success
  39. -- Performing Test HAVE_GCC_VISIBILITY
  40. -- Performing Test HAVE_GCC_VISIBILITY - Success
  41. -- Performing Test Support for 64 bit file systems
  42. -- Performing Test Support for 64 bit file systems - Success
  43. -- Performing Test VTK_CONST_REVERSE_ITERATOR_COMPARISON
  44. -- Performing Test VTK_CONST_REVERSE_ITERATOR_COMPARISON - Success
  45. -- Check if the system is big endian
  46. -- Searching 16 bit integer
  47. -- Looking for sys/types.h
  48. -- Looking for sys/types.h - found
  49. -- Looking for stdint.h
  50. -- Looking for stdint.h - found
  51. -- Looking for stddef.h
  52. -- Looking for stddef.h - found
  53. -- Check size of unsigned short
  54. -- Check size of unsigned short - done
  55. -- Using unsigned short
  56. -- Check if the system is big endian - little endian
  57. -- Looking for include file pthread.h
  58. -- Looking for include file pthread.h - found
  59. -- Looking for pthread_create
  60. -- Looking for pthread_create - not found
  61. -- Looking for pthread_create in pthreads
  62. -- Looking for pthread_create in pthreads - not found
  63. -- Looking for pthread_create in pthread
  64. -- Looking for pthread_create in pthread - found
  65. -- Found Threads: TRUE  
  66. -- Looking for C++ include iostream
  67. -- Looking for C++ include iostream - found
  68. -- Check for STD namespace
  69. -- Check for STD namespace - found
  70. -- Check for ANSI scope
  71. -- Check for ANSI scope - found
  72. -- Check for sstream
  73. -- Check for sstream - found
  74. -- Check size of int
  75. -- Check size of int - done
  76. -- Check size of long
  77. -- Check size of long - done
  78. -- Check size of char
  79. -- Check size of char - done
  80. -- Check size of short
  81. -- Check size of short - done
  82. -- Check size of float
  83. -- Check size of float - done
  84. -- Check size of double
  85. -- Check size of double - done
  86. -- Check size of long long
  87. -- Check size of long long - done
  88. -- Check size of __int64
  89. -- Check size of __int64 - failed
  90. -- Check size of uintptr_t
  91. -- Check size of uintptr_t - done
  92. -- Checking support for C++ type bool
  93. -- Checking support for C++ type bool -- yes
  94. -- Checking signedness of char
  95. -- Checking signedness of char -- signed
  96. -- Checking support for full template specialization syntax
  97. -- Checking support for full template specialization syntax -- yes
  98. -- Checking support for C++ explicit template instantiation
  99. -- Checking support for C++ explicit template instantiation -- yes
  100. -- Checking for builtin __sync_add_and_fetch
  101. -- Checking for builtin __sync_add_and_fetch -- success
  102. -- Checking ANSI streams end-of-file bug level
  103. -- Checking ANSI streams end-of-file bug level - 1
  104. -- Checking if ostream supports long long
  105. -- Checking if ostream supports long long -- yes
  106. -- Checking if istream supports long long
  107. -- Checking if istream supports long long -- yes
  108. -- Looking for getsockname in socket
  109. -- Looking for getsockname in socket - not found
  110. -- Checking for getsockname with socklen_t
  111. -- Checking for getsockname with socklen_t -- yes
  112. -- Looking for SO_REUSEADDR
  113. -- Looking for SO_REUSEADDR - found
  114. -- Group StandAlone modules: vtkCommonCore;vtkCommonComputationalGeometry;vtkCommonExecutionModel;vtkCommonTransforms;vtkCommonSystem;vtkCommonMisc;vtkParallelCore;vtkChartsCore;vtkInfovisLayout;vtkInfovisCore;vtkImagingStatistics;vtkImagingHybrid;vtkImagingColor;vtkImagingMorphological;vtkImagingGeneral;vtkImagingFourier;vtkImagingCore;vtkImagingMath;vtkImagingStencil;vtkImagingSources;vtkDomainsChemistry;vtkFiltersStatistics;vtkFiltersExtraction;vtkFiltersParallel;vtkFiltersSelection;vtkFiltersHybrid;vtkFiltersGeometry;vtkFiltersProgrammable;vtkFiltersImaging;vtkFiltersGeneral;vtkFiltersAMR;vtkFiltersFlowPaths;vtkFiltersCore;vtkFiltersGeneric;vtkFiltersHyperTree;vtkFiltersTexture;vtkFiltersSources;vtkFiltersVerdict;vtkFiltersModeling;vtkFiltersParallelImaging;vtkIOMovie;vtkIOParallel;vtkIOLSDyna;vtkIOExodus;vtkIOLegacy;vtkIOGeometry;vtkIONetCDF;vtkIOImport;vtkIOExport;vtkIOInfovis;vtkIOSQL;vtkIOXMLParser;vtkIOImage;vtkIOEnSight;vtkIOAMR;vtkIOVideo;vtkIOCore;vtkIOXML;vtkIOMINC;vtkIOPLY
  115. -- Group MPI modules: vtkParallelMPI;vtkFiltersParallelGeometry;vtkFiltersParallelMPI;vtkIOMPIImage;vtkIOParallelNetCDF
  116. -- Group Qt modules: vtkViewsQt;vtkRenderingQt;vtkGUISupportQtWebkit;vtkGUISupportQt;vtkGUISupportQtSQL;vtkGUISupportQtOpenGL;pqWidgets
  117. -- Group Rendering modules: vtkViewsInfovis;vtkViewsCore;vtkViewsContext2D;vtkViewsGeovis;vtkInteractionImage;vtkInteractionStyle;vtkInteractionWidgets;vtkRenderingHybridOpenGL;vtkRenderingFreeTypeOpenGL;vtkRenderingVolumeOpenGL;vtkRenderingOpenGL;vtkRenderingLOD;vtkRenderingVolumeAMR;vtkRenderingImage;vtkRenderingCore;vtkRenderingAnnotation;vtkRenderingVolume;vtkRenderingLabel;vtkRenderingContext2D;vtkRenderingFreeType;vtkGeovisCore
  118. -- Group Views modules: vtkViewsContext2D;vtkViewsGeovis
  119. -- Group Imaging modules: vtkInteractionImage;vtkImagingStatistics;vtkImagingHybrid;vtkImagingColor;vtkImagingMorphological;vtkImagingGeneral;vtkImagingFourier;vtkImagingMath;vtkImagingStencil;vtkImagingSources;vtkRenderingImage;vtkFiltersImaging
  120. -- Group Tk modules: vtkRenderingTk
  121. -- Group ParaViewPython modules: vtkPVPythonSupport
  122. -- Group ParaViewCore modules: vtkPVCommon;vtkPVVTKExtensionsCore;vtkPVClientServerCoreCore;vtkPVServerImplementationCore;vtkPVServerManagerCore;smTestDriver
  123. -- Group ParaViewRendering modules: vtkPVVTKExtensionsRendering;vtkPVVTKExtensionsWebGLExporter;vtkPVClientServerCoreRendering;vtkPVServerImplementationRendering;vtkPVServerManagerRendering
  124. -- Group ParaViewQt modules: pqWidgets;pqCore;pqComponents;pqApplicationComponents
  125. -- Group CoProcessing modules: vtkCoProcessor;vtkCoProcessorImplementation
  126. -- Disable test module vtkInteractionWidgets-Test-Cxx since required modules are not enabled: vtkImagingStencil
  127. -- Disable test module vtkInteractionWidgets-Test-Python since required modules are not enabled: vtkImagingStencil
  128. -- Disable test module vtkInfovisCore-Test-Cxx since required modules are not enabled: vtkInfovisLayout
  129. -- Disable test module vtkImagingCore-Test-Cxx since required modules are not enabled: vtkImagingMath;vtkImagingStatistics;vtkImagingStencil;vtkRenderingImage
  130. -- Disable test module vtkImagingCore-Test-Python since required modules are not enabled: vtkImagingMath;vtkImagingStatistics;vtkImagingStencil;vtkRenderingImage
  131. -- Disable test module vtkRenderingOpenGL-Test-Cxx since required modules are not enabled: vtkRenderingImage
  132. -- Disable test module vtkRenderingOpenGL-Test-Python since required modules are not enabled: vtkRenderingImage
  133. -- Disable test module vtkIOInfovis-Test-Cxx since required modules are not enabled: vtkInfovisLayout
  134. -- Disable test module vtkIOImage-Test-Cxx since required modules are not enabled: vtkImagingMath
  135. -- Disable test module vtkIOImage-Test-Python since required modules are not enabled: vtkImagingMath
  136. -- Enabled 255 modules:
  137. --  * VisItLib, needed by vtkIOVisItBridge.
  138. --  * pqApplicationComponents, needed by VTK_Group_ParaViewQt.
  139. --  * pqComponents, needed by 3 modules:
  140.         VTK_Group_ParaViewQt
  141.         pqApplicationComponents
  142.         pqComponents-Test-Cxx
  143. --  * pqCore, needed by 5 modules:
  144.         VTK_Group_ParaViewQt
  145.         pqComponents
  146.         pqCore-Test-Cxx
  147.         pqCore-Test-Python
  148.         pqPython
  149. --  * pqPython, needed by pqComponents.
  150. --  * pqWidgets, needed by 3 modules:
  151.         VTK_Group_ParaViewQt
  152.         pqCore
  153.         pqWidgets-Test-Cxx
  154. --  * smTestDriver, needed by VTK_Group_ParaViewCore.
  155. --  * vtkChartsCore, needed by 5 modules:
  156.         vtkChartsCore-Test-Cxx
  157.         vtkChartsCore-Test-Python
  158.         vtkIOExport-Test-Cxx
  159.         vtkPVServerManagerApplication
  160.         vtkPVVTKExtensionsRendering
  161. --  * vtkClientServer, needed by 2 modules:
  162.         vtkClientServer-Test-Cxx
  163.         vtkPVCommon
  164. --  * vtkCoProcessor, needed by 2 modules:
  165.         VTK_Group_CoProcessing
  166.         vtkCoProcessorImplementation
  167. --  * vtkCoProcessorImplementation, needed by 3 modules:
  168.         VTK_Group_CoProcessing
  169.         vtkCoProcessorImplementation-Test-Cxx
  170.         vtkCoProcessorImplementation-Test-Python
  171. --  * vtkCommonColor, needed by 8 modules:
  172.         vtkChartsCore
  173.         vtkChartsCore-Test-Cxx
  174.         vtkChartsCore-Test-Python
  175.         vtkCommonColor-Test-Cxx
  176.         vtkFiltersModeling-Test-Cxx
  177.         vtkFiltersModeling-Test-Python
  178.         vtkIOExport-Test-Cxx
  179.         vtkRenderingMatplotlib-Test-Cxx
  180. --  * vtkCommonComputationalGeometry, needed by 3 modules:
  181.         vtkCommonComputationalGeometry-Test-Python
  182.         vtkFiltersGeneral
  183.         vtkFiltersSources
  184. --  * vtkCommonCore, needed by 23 modules:
  185.         smTestDriver
  186.         vtkClientServer
  187.         vtkClientServer-Test-Cxx
  188.         vtkCommonCore-Test-Cxx
  189.         vtkCommonCore-Test-Python
  190.         vtkCommonMath
  191.         vtkCommonSystem
  192.         vtkCommonTransforms
  193.         vtkCosmo
  194.         vtkIOExport
  195.         vtkIOImport
  196.         vtkIOParallelNetCDF
  197.         vtkIOXdmf2
  198.         vtkImagingHybrid-Test-Cxx
  199.         vtkImagingHybrid-Test-Python
  200.         vtkPVCommon
  201.         vtkPVPythonSupport
  202.         vtkPVServerManagerCore
  203.         vtkParallelCore
  204.         vtkUtilitiesProcessXML
  205.         vtkVPIC
  206.         vtkWrappingPython
  207.         vtkWrappingTools
  208. --  * vtkCommonDataModel, needed by 24 modules:
  209.         VisItLib
  210.         vtkCommonColor
  211.         vtkCommonComputationalGeometry
  212.         vtkCommonDataModel-Test-Cxx
  213.         vtkCommonDataModel-Test-Python
  214.         vtkCommonExecutionModel
  215.         vtkDomainsChemistry
  216.         vtkFiltersParallelStatistics
  217.         vtkIOCore
  218.         vtkIOGeometry
  219.         vtkIOImage
  220.         vtkIOInfovis
  221.         vtkIOLegacy
  222.         vtkIOMovie
  223.         vtkIONetCDF
  224.         vtkIOParallelLSDyna
  225.         vtkIOVisItBridge
  226.         vtkIOXMLParser
  227.         vtkIOXdmf2
  228.         vtkImagingHybrid-Test-Cxx
  229.         vtkImagingHybrid-Test-Python
  230.         vtkInfovisCore
  231.         vtkRenderingContext2D
  232.         vtkTestingGenericBridge
  233. --  * vtkCommonExecutionModel, needed by 28 modules:
  234.         VisItLib
  235.         vtkCommonColor-Test-Cxx
  236.         vtkCommonDataModel-Test-Cxx
  237.         vtkCommonDataModel-Test-Python
  238.         vtkCommonExecutionModel-Test-Cxx
  239.         vtkFiltersCore
  240.         vtkFiltersCosmo
  241.         vtkFiltersExtraction
  242.         vtkFiltersFlowPaths
  243.         vtkFiltersProgrammable
  244.         vtkFiltersStatistics
  245.         vtkFiltersVerdict
  246.         vtkGUISupportQt
  247.         vtkIOCore
  248.         vtkIOEnSight
  249.         vtkIOImage
  250.         vtkIOLSDyna
  251.         vtkIOMovie
  252.         vtkIONetCDF-Test-Cxx
  253.         vtkIONetCDF-Test-Python
  254.         vtkIOPLY
  255.         vtkIOParallelNetCDF-Test-Cxx
  256.         vtkIOVPIC
  257.         vtkIOVisItBridge
  258.         vtkIOXdmf2
  259.         vtkImagingCore
  260.         vtkPVServerManagerApplication
  261.         vtkRenderingCore
  262. --  * vtkCommonMath, needed by 11 modules:
  263.         vtkCommonComputationalGeometry
  264.         vtkCommonDataModel
  265.         vtkCommonMath-Test-Cxx
  266.         vtkCommonMisc
  267.         vtkCommonTransforms
  268.         vtkFiltersCore
  269.         vtkFiltersParallelStatistics
  270.         vtkFiltersStatistics
  271.         vtkIOImage
  272.         vtkImagingCore
  273.         vtkRenderingContext2D
  274. --  * vtkCommonMisc, needed by 13 modules:
  275.         VisItLib
  276.         vtkCommonDataModel
  277.         vtkCommonExecutionModel
  278.         vtkCommonMisc-Test-Cxx
  279.         vtkFiltersCore
  280.         vtkFiltersStatistics
  281.         vtkIOCore
  282.         vtkIOGeometry
  283.         vtkIOImage
  284.         vtkIOInfovis
  285.         vtkIOLegacy
  286.         vtkIOPLY
  287.         vtkIOXMLParser
  288. --  * vtkCommonSystem, needed by 17 modules:
  289.         vtkCommonComputationalGeometry
  290.         vtkCommonCore-Test-Cxx
  291.         vtkCommonCore-Test-Python
  292.         vtkCommonDataModel
  293.         vtkCommonMath-Test-Cxx
  294.         vtkCommonSystem-Test-Cxx
  295.         vtkFiltersCore
  296.         vtkFiltersParallelStatistics
  297.         vtkIOGeometry
  298.         vtkIOImage
  299.         vtkIOInfovis
  300.         vtkIOLegacy
  301.         vtkIOMovie
  302.         vtkIONetCDF
  303.         vtkIOXMLParser
  304.         vtkImagingCore
  305.         vtkInfovisCore
  306. --  * vtkCommonTransforms, needed by 11 modules:
  307.         vtkCommonCore-Test-Cxx
  308.         vtkCommonCore-Test-Python
  309.         vtkCommonDataModel
  310.         vtkCommonMath-Test-Cxx
  311.         vtkCommonTransforms-Test-Python
  312.         vtkFiltersCore
  313.         vtkFiltersStatistics
  314.         vtkIOImage
  315.         vtkImagingCore
  316.         vtkRenderingContext2D
  317.         vtkRenderingCore
  318. --  * vtkCosmo, needed by vtkFiltersCosmo.
  319. --  * vtkDICOMParser, needed by vtkIOImage.
  320. --  * vtkDomainsChemistry, needed by 3 modules:
  321.         vtkDomainsChemistry-Test-Cxx
  322.         vtkPVClientServerCoreRendering
  323.         vtkPVServerManagerApplication
  324. --  * vtkFiltersAMR, needed by 13 modules:
  325.         VisItLib
  326.         vtkFiltersAMR-Test-Cxx
  327.         vtkFiltersAMR-Test-Python
  328.         vtkFiltersFlowPaths-Test-Cxx
  329.         vtkFiltersParallelFlowPaths
  330.         vtkIOAMR
  331.         vtkIOLegacy-Test-Cxx
  332.         vtkIOXML-Test-Cxx
  333.         vtkIOXML-Test-Python
  334.         vtkPVClientServerCoreRendering
  335.         vtkPVServerManagerApplication
  336.         vtkPVVTKExtensionsDefault
  337.         vtkRenderingVolumeAMR
  338. --  * vtkFiltersCore, needed by 11 modules:
  339.         vtkCommonExecutionModel-Test-Cxx
  340.         vtkFiltersCore-Test-Cxx
  341.         vtkFiltersCore-Test-Python
  342.         vtkFiltersExtraction
  343.         vtkFiltersGeneral
  344.         vtkFiltersGeneric
  345.         vtkFiltersGeometry
  346.         vtkIOXML-Test-Cxx
  347.         vtkIOXML-Test-Python
  348.         vtkPVServerManagerApplication
  349.         vtkPVVTKExtensionsCore
  350. --  * vtkFiltersCosmo, needed by vtkPVServerManagerApplication.
  351. --  * vtkFiltersExtraction, needed by 10 modules:
  352.         vtkFiltersExtraction-Test-Cxx
  353.         vtkFiltersExtraction-Test-Python
  354.         vtkFiltersParallel
  355.         vtkFiltersParallelMPI
  356.         vtkIOXdmf2
  357.         vtkInfovisCore
  358.         vtkPVClientServerCoreCore
  359.         vtkPVServerManagerApplication
  360.         vtkPVVTKExtensionsRendering
  361.         vtkRenderingCore
  362. --  * vtkFiltersFlowPaths, needed by 4 modules:
  363.         VisItLib
  364.         vtkFiltersFlowPaths-Test-Cxx
  365.         vtkFiltersParallelFlowPaths
  366.         vtkPVServerManagerApplication
  367. --  * vtkFiltersGeneral, needed by 17 modules:
  368.         vtkFiltersAMR
  369.         vtkFiltersCore-Test-Cxx
  370.         vtkFiltersCore-Test-Python
  371.         vtkFiltersFlowPaths
  372.         vtkFiltersGeneral-Test-Cxx
  373.         vtkFiltersGeneral-Test-Python
  374.         vtkFiltersHybrid
  375.         vtkFiltersHyperTree
  376.         vtkFiltersModeling
  377.         vtkFiltersParallelMPI
  378.         vtkFiltersSources
  379.         vtkFiltersTexture
  380.         vtkIOExodus
  381.         vtkIOXdmf2-Test-Cxx
  382.         vtkInfovisCore
  383.         vtkPVServerManagerApplication
  384.         vtkRenderingCore
  385. --  * vtkFiltersGeneric, needed by 4 modules:
  386.         vtkFiltersGeneric-Test-Cxx
  387.         vtkPVServerManagerApplication
  388.         vtkPVServerManagerApplication
  389.         vtkPVVTKExtensionsRendering
  390. --  * vtkFiltersGeometry, needed by 6 modules:
  391.         vtkFiltersGeometry-Test-Cxx
  392.         vtkFiltersGeometry-Test-Python
  393.         vtkIOGeometry-Test-Cxx
  394.         vtkIOGeometry-Test-Python
  395.         vtkPVServerManagerApplication
  396.         vtkRenderingCore
  397. --  * vtkFiltersHybrid, needed by 4 modules:
  398.         vtkFiltersHybrid-Test-Cxx
  399.         vtkFiltersHybrid-Test-Python
  400.         vtkInteractionWidgets
  401.         vtkPVServerManagerApplication
  402. --  * vtkFiltersHyperTree, needed by 3 modules:
  403.         vtkFiltersHyperTree-Test-Cxx
  404.         vtkPVServerManagerApplication
  405.         vtkPVVTKExtensionsRendering
  406. --  * vtkFiltersImaging, needed by 2 modules:
  407.         vtkFiltersFlowPaths-Test-Cxx
  408.         vtkFiltersParallelImaging
  409. --  * vtkFiltersModeling, needed by 10 modules:
  410.         vtkFiltersGeneric-Test-Cxx
  411.         vtkFiltersHyperTree-Test-Cxx
  412.         vtkFiltersModeling-Test-Cxx
  413.         vtkFiltersModeling-Test-Python
  414.         vtkFiltersParallel
  415.         vtkFiltersSources-Test-Cxx
  416.         vtkFiltersSources-Test-Python
  417.         vtkInteractionWidgets
  418.         vtkPVServerManagerApplication
  419.         vtkRenderingLOD
  420. --  * vtkFiltersParallel, needed by 9 modules:
  421.         vtkFiltersParallel-Test-Cxx
  422.         vtkFiltersParallel-Test-Python
  423.         vtkFiltersParallelImaging
  424.         vtkFiltersParallelMPI
  425.         vtkIOParallel
  426.         vtkPVServerManagerApplication
  427.         vtkPVServerManagerApplication
  428.         vtkPVVTKExtensionsRendering
  429.         vtkRenderingParallel
  430. --  * vtkFiltersParallelFlowPaths, needed by 2 modules:
  431.         vtkFiltersParallelFlowPaths-Test-Cxx
  432.         vtkPVServerManagerApplication
  433. --  * vtkFiltersParallelImaging, needed by 3 modules:
  434.         vtkFiltersParallel-Test-Cxx
  435.         vtkFiltersParallel-Test-Python
  436.         vtkPVServerManagerApplication
  437. --  * vtkFiltersParallelMPI, needed by 5 modules:
  438.         vtkFiltersParallel-Test-Cxx
  439.         vtkFiltersParallel-Test-Python
  440.         vtkPVServerManagerApplication
  441.         vtkPVVTKExtensionsRendering
  442.         vtkRenderingParallel-Test-Cxx
  443. --  * vtkFiltersParallelStatistics, needed by 3 modules:
  444.         vtkFiltersParallelStatistics-Test-Cxx
  445.         vtkPVServerManagerApplication
  446.         vtkPVVTKExtensionsDefault
  447. --  * vtkFiltersProgrammable, needed by 4 modules:
  448.         vtkFiltersProgrammable-Test-Cxx
  449.         vtkFiltersProgrammable-Test-Python
  450.         vtkPVClientServerCoreCore
  451.         vtkPVServerManagerApplication
  452. --  * vtkFiltersSources, needed by 9 modules:
  453.         vtkFiltersFlowPaths
  454.         vtkFiltersGeneric
  455.         vtkFiltersModeling
  456.         vtkFiltersSources-Test-Cxx
  457.         vtkFiltersSources-Test-Python
  458.         vtkIOXML-Test-Cxx
  459.         vtkIOXML-Test-Python
  460.         vtkPVServerManagerApplication
  461.         vtkRenderingCore
  462. --  * vtkFiltersStatistics, needed by 5 modules:
  463.         vtkFiltersImaging
  464.         vtkFiltersParallelStatistics
  465.         vtkFiltersStatistics-Test-Cxx
  466.         vtkFiltersStatistics-Test-Python
  467.         vtkPVServerManagerApplication
  468. --  * vtkFiltersTexture, needed by 2 modules:
  469.         vtkFiltersTexture-Test-Python
  470.         vtkPVServerManagerApplication
  471. --  * vtkFiltersVerdict, needed by 3 modules:
  472.         vtkFiltersVerdict-Test-Cxx
  473.         vtkFiltersVerdict-Test-Python
  474.         vtkPVServerManagerApplication
  475. --  * vtkGUISupportQt, needed by 4 modules:
  476.         pqApplicationComponents
  477.         pqCore
  478.         pqWidgets
  479.         vtkGUISupportQt-Test-Cxx
  480. --  * vtkIOAMR, needed by 8 modules:
  481.         vtkFiltersAMR-Test-Cxx
  482.         vtkFiltersAMR-Test-Python
  483.         vtkFiltersParallelFlowPaths-Test-Cxx
  484.         vtkIOAMR-Test-Cxx
  485.         vtkIOGeometry-Test-Cxx
  486.         vtkIOGeometry-Test-Python
  487.         vtkPVServerManagerApplication
  488.         vtkPVVTKExtensionsRendering-Test-Cxx
  489. --  * vtkIOCore, needed by 12 modules:
  490.         vtkCommonExecutionModel-Test-Cxx
  491.         vtkFiltersFlowPaths
  492.         vtkIOCore-Test-Cxx
  493.         vtkIOCore-Test-Python
  494.         vtkIOExport
  495.         vtkIOGeometry
  496.         vtkIOImage
  497.         vtkIOInfovis
  498.         vtkIOLegacy
  499.         vtkIOMovie
  500.         vtkIONetCDF
  501.         vtkIOXMLParser
  502. --  * vtkIOEnSight, needed by 3 modules:
  503.         vtkIOEnSight-Test-Python
  504.         vtkPVServerManagerApplication
  505.         vtkPVVTKExtensionsDefault
  506. --  * vtkIOExodus, needed by 4 modules:
  507.         vtkIOExodus-Test-Cxx
  508.         vtkIOParallelExodus
  509.         vtkIOParallelExodus
  510.         vtkPVServerManagerApplication
  511. --  * vtkIOExport, needed by 7 modules:
  512.         vtkChartsCore-Test-Cxx
  513.         vtkChartsCore-Test-Python
  514.         vtkIOExport-Test-Cxx
  515.         vtkPVServerManagerApplication
  516.         vtkPVVTKExtensionsRendering
  517.         vtkPVVTKExtensionsWebGLExporter
  518.         vtkRenderingMatplotlib-Test-Cxx
  519. --  * vtkIOFFMPEG, needed by 2 modules:
  520.         vtkIOFFMPEG-Test-Cxx
  521.         vtkPVServerManagerDefault
  522. --  * vtkIOGeometry, needed by 13 modules:
  523.         VisItLib
  524.         vtkCommonDataModel-Test-Cxx
  525.         vtkCommonDataModel-Test-Python
  526.         vtkFiltersParallelFlowPaths-Test-Cxx
  527.         vtkIOGeometry-Test-Cxx
  528.         vtkIOGeometry-Test-Python
  529.         vtkIOPLY
  530.         vtkIOXML
  531.         vtkPVServerManagerApplication
  532.         vtkPVServerManagerApplication
  533.         vtkRenderingAnnotation-Test-Cxx
  534.         vtkRenderingAnnotation-Test-Python
  535.         vtkRenderingMatplotlib-Test-Cxx
  536. --  * vtkIOImage, needed by 10 modules:
  537.         VisItLib
  538.         vtkCommonColor-Test-Cxx
  539.         vtkIOMPIImage
  540.         vtkIOMPIImage
  541.         vtkIOPLY-Test-Cxx
  542.         vtkIOPLY-Test-Python
  543.         vtkImagingHybrid
  544.         vtkPVServerManagerApplication
  545.         vtkPVServerManagerApplication
  546.         vtkRenderingCore
  547. --  * vtkIOImport, needed by 4 modules:
  548.         vtkIOImport-Test-Cxx
  549.         vtkIOImport-Test-Python
  550.         vtkPVServerManagerApplication
  551.         vtkPVVTKExtensionsDefault
  552. --  * vtkIOInfovis, needed by 3 modules:
  553.         vtkChartsCore-Test-Cxx
  554.         vtkChartsCore-Test-Python
  555.         vtkPVServerManagerApplication
  556. --  * vtkIOLSDyna, needed by 2 modules:
  557.         vtkIOLSDyna-Test-Cxx
  558.         vtkIOParallelLSDyna
  559. --  * vtkIOLegacy, needed by 32 modules:
  560.         VisItLib
  561.         vtkCommonDataModel-Test-Cxx
  562.         vtkCommonDataModel-Test-Python
  563.         vtkCommonExecutionModel-Test-Cxx
  564.         vtkFiltersCore-Test-Cxx
  565.         vtkFiltersCore-Test-Python
  566.         vtkFiltersExtraction-Test-Cxx
  567.         vtkFiltersExtraction-Test-Python
  568.         vtkFiltersGeneral-Test-Cxx
  569.         vtkFiltersGeneral-Test-Python
  570.         vtkFiltersGeneric-Test-Cxx
  571.         vtkFiltersHybrid-Test-Cxx
  572.         vtkFiltersHybrid-Test-Python
  573.         vtkFiltersHyperTree-Test-Cxx
  574.         vtkFiltersParallel-Test-Cxx
  575.         vtkFiltersParallel-Test-Python
  576.         vtkFiltersParallelImaging
  577.         vtkFiltersVerdict-Test-Cxx
  578.         vtkFiltersVerdict-Test-Python
  579.         vtkIOGeometry-Test-Cxx
  580.         vtkIOGeometry-Test-Python
  581.         vtkIOInfovis
  582.         vtkIOLegacy-Test-Cxx
  583.         vtkIOXML-Test-Cxx
  584.         vtkIOXML-Test-Python
  585.         vtkIOXdmf2
  586.         vtkPVServerManagerApplication
  587.         vtkParallelCore
  588.         vtkRenderingHybridOpenGL
  589.         vtkRenderingHybridOpenGL-Test-Cxx
  590.         vtkRenderingVolume-Test-Cxx
  591.         vtkRenderingVolume-Test-Python
  592. --  * vtkIOMPIImage, needed by 3 modules:
  593.         vtkIOMPIImage-Test-Cxx
  594.         vtkPVServerManagerApplication
  595.         vtkPVServerManagerDefault
  596. --  * vtkIOMovie, needed by 4 modules:
  597.         vtkIOFFMPEG
  598.         vtkIOMovie-Test-Cxx
  599.         vtkPVServerManagerApplication
  600.         vtkPVServerManagerDefault
  601. --  * vtkIONetCDF, needed by 4 modules:
  602.         vtkIONetCDF-Test-Cxx
  603.         vtkIONetCDF-Test-Python
  604.         vtkIOParallel
  605.         vtkPVServerManagerApplication
  606. --  * vtkIOPLY, needed by 3 modules:
  607.         vtkIOPLY-Test-Cxx
  608.         vtkIOPLY-Test-Python
  609.         vtkPVServerManagerApplication
  610. --  * vtkIOParallel, needed by 5 modules:
  611.         vtkIOParallel-Test-Cxx
  612.         vtkIOParallel-Test-Python
  613.         vtkPVServerManagerApplication
  614.         vtkPVServerManagerApplication
  615.         vtkPVVTKExtensionsDefault
  616. --  * vtkIOParallelExodus, needed by 4 modules:
  617.         vtkIOParallelExodus-Test-Cxx
  618.         vtkPVServerManagerApplication
  619.         vtkPVServerManagerDefault
  620.         vtkPVVTKExtensionsDefault
  621. --  * vtkIOParallelLSDyna, needed by 2 modules:
  622.         vtkIOParallelLSDyna-Test-Cxx
  623.         vtkPVServerManagerApplication
  624. --  * vtkIOParallelNetCDF, needed by 2 modules:
  625.         vtkIOParallelNetCDF-Test-Cxx
  626.         vtkPVServerManagerApplication
  627. --  * vtkIOVPIC, needed by vtkPVServerManagerApplication.
  628. --  * vtkIOVisItBridge, needed by vtkPVServerManagerApplication.
  629. --  * vtkIOXML, needed by 35 modules:
  630.         vtkCommonDataModel-Test-Cxx
  631.         vtkCommonDataModel-Test-Python
  632.         vtkDomainsChemistry
  633.         vtkFiltersCore-Test-Cxx
  634.         vtkFiltersCore-Test-Python
  635.         vtkFiltersExtraction-Test-Cxx
  636.         vtkFiltersExtraction-Test-Python
  637.         vtkFiltersGeneral-Test-Cxx
  638.         vtkFiltersGeneral-Test-Python
  639.         vtkFiltersGeneric-Test-Cxx
  640.         vtkFiltersGeometry-Test-Cxx
  641.         vtkFiltersGeometry-Test-Python
  642.         vtkFiltersHybrid-Test-Cxx
  643.         vtkFiltersHybrid-Test-Python
  644.         vtkFiltersHyperTree-Test-Cxx
  645.         vtkFiltersModeling-Test-Cxx
  646.         vtkFiltersModeling-Test-Python
  647.         vtkFiltersSources-Test-Cxx
  648.         vtkFiltersSources-Test-Python
  649.         vtkIOAMR-Test-Cxx
  650.         vtkIOExodus
  651.         vtkIOLSDyna
  652.         vtkIOParallel
  653.         vtkIOXML-Test-Cxx
  654.         vtkIOXML-Test-Python
  655.         vtkIOXdmf2
  656.         vtkPVServerManagerApplication
  657.         vtkPVServerManagerApplication
  658.         vtkPVVTKExtensionsRendering
  659.         vtkPVVTKExtensionsRendering-Test-Cxx
  660.         vtkRenderingCore-Test-Cxx
  661.         vtkRenderingCore-Test-Python
  662.         vtkRenderingHybridOpenGL-Test-Cxx
  663.         vtkRenderingVolume-Test-Cxx
  664.         vtkRenderingVolume-Test-Python
  665. --  * vtkIOXMLParser, needed by 3 modules:
  666.         vtkIOXML
  667.         vtkPVCommon
  668.         vtkRenderingCore
  669. --  * vtkIOXdmf2, needed by 2 modules:
  670.         vtkIOXdmf2-Test-Cxx
  671.         vtkPVServerManagerApplication
  672. --  * vtkImagingColor, needed by 2 modules:
  673.         vtkInteractionImage
  674.         vtkRenderingAnnotation
  675. --  * vtkImagingCore, needed by 19 modules:
  676.         vtkFiltersAMR-Test-Cxx
  677.         vtkFiltersAMR-Test-Python
  678.         vtkFiltersCore-Test-Cxx
  679.         vtkFiltersCore-Test-Python
  680.         vtkFiltersHybrid-Test-Cxx
  681.         vtkFiltersHybrid-Test-Python
  682.         vtkFiltersParallelImaging
  683.         vtkGUISupportQt
  684.         vtkIOExport
  685.         vtkIOMovie-Test-Cxx
  686.         vtkImagingColor
  687.         vtkImagingFourier
  688.         vtkImagingHybrid
  689.         vtkImagingMorphological
  690.         vtkImagingSources
  691.         vtkPVServerManagerApplication
  692.         vtkRenderingMatplotlib
  693.         vtkRenderingVolume
  694.         vtkTestingRendering
  695. --  * vtkImagingFourier, needed by 3 modules:
  696.         vtkFiltersStatistics
  697.         vtkPVServerManagerApplication
  698.         vtkPVVTKExtensionsDefault
  699. --  * vtkImagingGeneral, needed by 5 modules:
  700.         vtkFiltersImaging
  701.         vtkImagingMorphological
  702.         vtkInteractionWidgets
  703.         vtkRenderingVolume-Test-Cxx
  704.         vtkRenderingVolume-Test-Python
  705. --  * vtkImagingHybrid, needed by 9 modules:
  706.         VisItLib
  707.         vtkImagingHybrid-Test-Cxx
  708.         vtkImagingHybrid-Test-Python
  709.         vtkInteractionWidgets
  710.         vtkPVServerManagerApplication
  711.         vtkRenderingHybridOpenGL
  712.         vtkRenderingOpenGL
  713.         vtkRenderingVolume-Test-Cxx
  714.         vtkRenderingVolume-Test-Python
  715. --  * vtkImagingMorphological, needed by vtkPVServerManagerApplication.
  716. --  * vtkImagingSources, needed by 15 modules:
  717.         vtkFiltersHybrid
  718.         vtkFiltersImaging
  719.         vtkIOFFMPEG-Test-Cxx
  720.         vtkIOMovie-Test-Cxx
  721.         vtkIOXML-Test-Cxx
  722.         vtkIOXML-Test-Python
  723.         vtkImagingGeneral
  724.         vtkPVServerManagerApplication
  725.         vtkPVVTKExtensionsDefault
  726.         vtkParallelMPI-Test-Cxx
  727.         vtkParallelMPI-Test-Python
  728.         vtkRenderingHybridOpenGL
  729.         vtkRenderingParallel-Test-Cxx
  730.         vtkRenderingVolume-Test-Cxx
  731.         vtkRenderingVolume-Test-Python
  732. --  * vtkInfovisCore, needed by 4 modules:
  733.         vtkChartsCore
  734.         vtkIOInfovis
  735.         vtkIOXML-Test-Cxx
  736.         vtkIOXML-Test-Python
  737. --  * vtkInteractionImage, needed by 3 modules:
  738.         vtkIOExport-Test-Cxx
  739.         vtkPVServerManagerApplication
  740.         vtkRenderingMatplotlib-Test-Cxx
  741. --  * vtkInteractionStyle, needed by 18 modules:
  742.         vtkDomainsChemistry-Test-Cxx
  743.         vtkFiltersExtraction-Test-Cxx
  744.         vtkFiltersExtraction-Test-Python
  745.         vtkFiltersHyperTree-Test-Cxx
  746.         vtkGUISupportQt
  747.         vtkIOExodus-Test-Cxx
  748.         vtkIOLegacy-Test-Cxx
  749.         vtkIOMPIImage-Test-Cxx
  750.         vtkInteractionImage
  751.         vtkInteractionStyle-Test-Python
  752.         vtkInteractionWidgets
  753.         vtkPVServerManagerApplication
  754.         vtkPVVTKExtensionsRendering
  755.         vtkPVVTKExtensionsRendering-Test-Cxx
  756.         vtkRenderingAnnotation-Test-Cxx
  757.         vtkRenderingAnnotation-Test-Python
  758.         vtkRenderingVolume-Test-Cxx
  759.         vtkRenderingVolume-Test-Python
  760. --  * vtkInteractionWidgets, needed by 7 modules:
  761.         vtkInteractionImage
  762.         vtkPVServerManagerApplication
  763.         vtkPVVTKExtensionsDefault
  764.         vtkPVVTKExtensionsRendering
  765.         vtkPVVTKExtensionsWebGLExporter
  766.         vtkRenderingMatplotlib-Test-Cxx
  767.         vtkViewsCore
  768. --  * vtkMetaIO, needed by vtkIOImage.
  769. --  * vtkPVClientServerCoreCore, needed by 3 modules:
  770.         VTK_Group_ParaViewCore
  771.         vtkPVClientServerCoreRendering
  772.         vtkPVServerImplementationCore
  773. --  * vtkPVClientServerCoreDefault, needed by 2 modules:
  774.         vtkPVClientServerCoreDefault-Test-Cxx
  775.         vtkPVServerImplementationDefault
  776. --  * vtkPVClientServerCoreRendering, needed by 3 modules:
  777.         VTK_Group_ParaViewRendering
  778.         vtkPVClientServerCoreDefault
  779.         vtkPVServerImplementationRendering
  780. --  * vtkPVCommon, needed by 5 modules:
  781.         VTK_Group_ParaViewCore
  782.         vtkPVClientServerCoreCore
  783.         vtkPVClientServerCoreCore
  784.         vtkPVCommon-Test-Cxx
  785.         vtkPVVTKExtensionsCore
  786. --  * vtkPVPythonSupport, needed by 5 modules:
  787.         VTK_Group_ParaViewPython
  788.         pqCore
  789.         pqPython
  790.         vtkCoProcessorImplementation
  791.         vtkPVClientServerCoreCore
  792. --  * vtkPVServerImplementationCore, needed by 3 modules:
  793.         VTK_Group_ParaViewCore
  794.         vtkPVServerImplementationRendering
  795.         vtkPVServerManagerCore
  796. --  * vtkPVServerImplementationDefault, needed by 2 modules:
  797.         vtkPVServerImplementationDefault-Test-Cxx
  798.         vtkPVServerManagerDefault
  799. --  * vtkPVServerImplementationRendering, needed by 3 modules:
  800.         VTK_Group_ParaViewRendering
  801.         vtkPVServerImplementationDefault
  802.         vtkPVServerManagerRendering
  803. --  * vtkPVServerManagerApplication, needed by 4 modules:
  804.         pqCore
  805.         vtkCoProcessorImplementation
  806.         vtkPVServerManagerDefault-Test-Cxx
  807.         vtkPVServerManagerDefault-Test-Python
  808. --  * vtkPVServerManagerCore, needed by 5 modules:
  809.         VTK_Group_ParaViewCore
  810.         pqWidgets
  811.         vtkCoProcessor
  812.         vtkPVServerManagerApplication
  813.         vtkPVServerManagerRendering
  814. --  * vtkPVServerManagerDefault, needed by 4 modules:
  815.         pqCore
  816.         vtkPVServerManagerApplication
  817.         vtkPVServerManagerDefault-Test-Cxx
  818.         vtkPVServerManagerDefault-Test-Python
  819. --  * vtkPVServerManagerRendering, needed by 2 modules:
  820.         VTK_Group_ParaViewRendering
  821.         vtkPVServerManagerDefault
  822. --  * vtkPVVTKExtensionsCore, needed by 4 modules:
  823.         VTK_Group_ParaViewCore
  824.         vtkPVClientServerCoreCore
  825.         vtkPVVTKExtensionsDefault
  826.         vtkPVVTKExtensionsRendering
  827. --  * vtkPVVTKExtensionsDefault, needed by vtkPVClientServerCoreDefault.
  828. --  * vtkPVVTKExtensionsRendering, needed by 4 modules:
  829.         VTK_Group_ParaViewRendering
  830.         vtkPVClientServerCoreRendering
  831.         vtkPVVTKExtensionsDefault
  832.         vtkPVVTKExtensionsRendering-Test-Cxx
  833. --  * vtkPVVTKExtensionsWebGLExporter, needed by 2 modules:
  834.         VTK_Group_ParaViewRendering
  835.         vtkPVClientServerCoreRendering
  836. --  * vtkParallelCore, needed by 18 modules:
  837.         VisItLib
  838.         vtkFiltersAMR
  839.         vtkFiltersCosmo
  840.         vtkFiltersParallel
  841.         vtkFiltersParallelFlowPaths
  842.         vtkFiltersParallelImaging
  843.         vtkFiltersParallelStatistics
  844.         vtkIOAMR
  845.         vtkIOParallel
  846.         vtkIOParallelExodus
  847.         vtkIOParallelLSDyna
  848.         vtkIOVPIC
  849.         vtkPVVTKExtensionsCore
  850.         vtkParallelCore-Test-Cxx
  851.         vtkParallelCore-Test-Python
  852.         vtkParallelMPI
  853.         vtkRenderingParallel
  854.         vtkRenderingVolumeAMR
  855. --  * vtkParallelMPI, needed by 15 modules:
  856.         vtkFiltersParallel-Test-Cxx
  857.         vtkFiltersParallel-Test-Python
  858.         vtkFiltersParallelFlowPaths
  859.         vtkFiltersParallelMPI
  860.         vtkFiltersParallelStatistics-Test-Cxx
  861.         vtkIOMPIImage
  862.         vtkIOParallel-Test-Cxx
  863.         vtkIOParallel-Test-Python
  864.         vtkIOParallelLSDyna-Test-Cxx
  865.         vtkIOParallelNetCDF
  866.         vtkPVClientServerCoreCore
  867.         vtkPVServerManagerApplication
  868.         vtkParallelMPI-Test-Cxx
  869.         vtkParallelMPI-Test-Python
  870.         vtkRenderingParallel-Test-Cxx
  871. --  * vtkParseOGLExt, needed by vtkRenderingOpenGL.
  872. --  * vtkRenderingAnnotation, needed by 8 modules:
  873.         vtkFiltersGeneral-Test-Cxx
  874.         vtkFiltersGeneral-Test-Python
  875.         vtkIOExport-Test-Cxx
  876.         vtkInteractionWidgets
  877.         vtkPVServerManagerApplication
  878.         vtkPVVTKExtensionsRendering
  879.         vtkRenderingAnnotation-Test-Cxx
  880.         vtkRenderingAnnotation-Test-Python
  881. --  * vtkRenderingContext2D, needed by 7 modules:
  882.         vtkChartsCore
  883.         vtkIOExport
  884.         vtkPVServerManagerApplication
  885.         vtkRenderingCore-Test-Cxx
  886.         vtkRenderingCore-Test-Python
  887.         vtkRenderingGL2PS
  888.         vtkViewsContext2D
  889. --  * vtkRenderingCore, needed by 21 modules:
  890.         vtkCommonDataModel-Test-Cxx
  891.         vtkCommonDataModel-Test-Python
  892.         vtkDomainsChemistry
  893.         vtkFiltersHybrid
  894.         vtkFiltersParallel
  895.         vtkIOExport
  896.         vtkIOImport
  897.         vtkInteractionImage
  898.         vtkInteractionStyle
  899.         vtkPVVTKExtensionsWebGLExporter
  900.         vtkRenderingContext2D
  901.         vtkRenderingCore-Test-Cxx
  902.         vtkRenderingCore-Test-Python
  903.         vtkRenderingFreeType
  904.         vtkRenderingFreeTypeOpenGL
  905.         vtkRenderingLOD
  906.         vtkRenderingMatplotlib
  907.         vtkRenderingOpenGL
  908.         vtkRenderingVolume
  909.         vtkTestingRendering
  910.         vtkViewsCore
  911. --  * vtkRenderingFreeType, needed by 14 modules:
  912.         vtkIOExport
  913.         vtkInteractionImage
  914.         vtkInteractionWidgets
  915.         vtkPVServerManagerApplication
  916.         vtkPVServerManagerApplication
  917.         vtkRenderingAnnotation
  918.         vtkRenderingContext2D
  919.         vtkRenderingFreeType-Test-Cxx
  920.         vtkRenderingFreeType-Test-Python
  921.         vtkRenderingFreeTypeOpenGL
  922.         vtkRenderingLabel
  923.         vtkRenderingMatplotlib
  924.         vtkRenderingVolume-Test-Cxx
  925.         vtkRenderingVolume-Test-Python
  926. --  * vtkRenderingFreeTypeOpenGL, needed by 12 modules:
  927.         VisItLib
  928.         vtkFiltersGeneral-Test-Cxx
  929.         vtkFiltersGeneral-Test-Python
  930.         vtkFiltersGeneric-Test-Cxx
  931.         vtkFiltersSources-Test-Cxx
  932.         vtkFiltersSources-Test-Python
  933.         vtkIOExport-Test-Cxx
  934.         vtkPVServerManagerApplication
  935.         vtkPVVTKExtensionsRendering
  936.         vtkRenderingAnnotation-Test-Cxx
  937.         vtkRenderingAnnotation-Test-Python
  938.         vtkRenderingMatplotlib-Test-Cxx
  939. --  * vtkRenderingGL2PS, needed by 3 modules:
  940.         vtkIOExport
  941.         vtkRenderingGL2PS-Test-Cxx
  942.         vtkRenderingMatplotlib-Test-Cxx
  943. --  * vtkRenderingHybridOpenGL, needed by 2 modules:
  944.         vtkPVServerManagerApplication
  945.         vtkRenderingHybridOpenGL-Test-Cxx
  946. --  * vtkRenderingLOD, needed by 4 modules:
  947.         vtkPVServerManagerApplication
  948.         vtkRenderingAnnotation-Test-Cxx
  949.         vtkRenderingAnnotation-Test-Python
  950.         vtkRenderingLOD-Test-Python
  951. --  * vtkRenderingLabel, needed by 4 modules:
  952.         vtkFiltersGeneric-Test-Cxx
  953.         vtkPVClientServerCoreRendering
  954.         vtkPVServerManagerApplication
  955.         vtkRenderingLabel-Test-Python
  956. --  * vtkRenderingMatplotlib, needed by 3 modules:
  957.         vtkPVServerManagerApplication
  958.         vtkPVServerManagerDefault
  959.         vtkRenderingMatplotlib-Test-Cxx
  960. --  * vtkRenderingOpenGL, needed by 51 modules:
  961.         vtkCommonColor-Test-Cxx
  962.         vtkCommonDataModel-Test-Cxx
  963.         vtkCommonDataModel-Test-Python
  964.         vtkDomainsChemistry-Test-Cxx
  965.         vtkFiltersCore-Test-Cxx
  966.         vtkFiltersCore-Test-Python
  967.         vtkFiltersExtraction-Test-Cxx
  968.         vtkFiltersExtraction-Test-Python
  969.         vtkFiltersFlowPaths-Test-Cxx
  970.         vtkFiltersGeneral-Test-Cxx
  971.         vtkFiltersGeneral-Test-Python
  972.         vtkFiltersGeneric-Test-Cxx
  973.         vtkFiltersGeometry-Test-Cxx
  974.         vtkFiltersGeometry-Test-Python
  975.         vtkFiltersHybrid-Test-Cxx
  976.         vtkFiltersHybrid-Test-Python
  977.         vtkFiltersHyperTree-Test-Cxx
  978.         vtkFiltersModeling-Test-Cxx
  979.         vtkFiltersModeling-Test-Python
  980.         vtkFiltersParallel-Test-Cxx
  981.         vtkFiltersParallel-Test-Python
  982.         vtkFiltersProgrammable-Test-Cxx
  983.         vtkFiltersProgrammable-Test-Python
  984.         vtkFiltersSources-Test-Cxx
  985.         vtkFiltersSources-Test-Python
  986.         vtkGUISupportQt
  987.         vtkIOExodus-Test-Cxx
  988.         vtkIOExport
  989.         vtkIOGeometry-Test-Cxx
  990.         vtkIOGeometry-Test-Python
  991.         vtkIOImport-Test-Cxx
  992.         vtkIOImport-Test-Python
  993.         vtkIOLSDyna-Test-Cxx
  994.         vtkIOLegacy-Test-Cxx
  995.         vtkIOMPIImage-Test-Cxx
  996.         vtkIONetCDF-Test-Cxx
  997.         vtkIONetCDF-Test-Python
  998.         vtkIOPLY-Test-Cxx
  999.         vtkIOPLY-Test-Python
  1000.         vtkIOParallelLSDyna-Test-Cxx
  1001.         vtkIOParallelNetCDF-Test-Cxx
  1002.         vtkPVServerManagerApplication
  1003.         vtkPVVTKExtensionsRendering
  1004.         vtkPVVTKExtensionsRendering-Test-Cxx
  1005.         vtkRenderingContext2D
  1006.         vtkRenderingFreeTypeOpenGL
  1007.         vtkRenderingHybridOpenGL
  1008.         vtkRenderingMatplotlib-Test-Cxx
  1009.         vtkRenderingParallel
  1010.         vtkRenderingParallel-Test-Cxx
  1011.         vtkRenderingVolumeOpenGL
  1012. --  * vtkRenderingParallel, needed by 11 modules:
  1013.         vtkFiltersParallel-Test-Cxx
  1014.         vtkFiltersParallel-Test-Python
  1015.         vtkFiltersParallelFlowPaths-Test-Cxx
  1016.         vtkIOParallel-Test-Cxx
  1017.         vtkIOParallel-Test-Python
  1018.         vtkIOParallelLSDyna-Test-Cxx
  1019.         vtkPVServerManagerApplication
  1020.         vtkPVVTKExtensionsRendering
  1021.         vtkParallelMPI-Test-Cxx
  1022.         vtkParallelMPI-Test-Python
  1023.         vtkRenderingParallel-Test-Cxx
  1024. --  * vtkRenderingVolume, needed by 6 modules:
  1025.         vtkInteractionWidgets
  1026.         vtkPVServerManagerApplication
  1027.         vtkRenderingVolume-Test-Cxx
  1028.         vtkRenderingVolume-Test-Python
  1029.         vtkRenderingVolumeAMR
  1030.         vtkRenderingVolumeOpenGL
  1031. --  * vtkRenderingVolumeAMR, needed by vtkPVClientServerCoreRendering.
  1032. --  * vtkRenderingVolumeOpenGL, needed by 7 modules:
  1033.         VisItLib
  1034.         vtkIOExport-Test-Cxx
  1035.         vtkPVClientServerCoreRendering
  1036.         vtkPVServerManagerApplication
  1037.         vtkPVServerManagerDefault
  1038.         vtkRenderingVolume-Test-Cxx
  1039.         vtkRenderingVolume-Test-Python
  1040. --  * vtkTestingCore, needed by 42 modules:
  1041.         vtkChartsCore-Test-Cxx
  1042.         vtkChartsCore-Test-Python
  1043.         vtkCommonColor-Test-Cxx
  1044.         vtkCommonComputationalGeometry-Test-Python
  1045.         vtkCommonCore-Test-Cxx
  1046.         vtkCommonCore-Test-Python
  1047.         vtkCommonDataModel-Test-Cxx
  1048.         vtkCommonDataModel-Test-Python
  1049.         vtkCommonExecutionModel-Test-Cxx
  1050.         vtkCommonMath-Test-Cxx
  1051.         vtkCommonMisc-Test-Cxx
  1052.         vtkCommonSystem-Test-Cxx
  1053.         vtkDomainsChemistry-Test-Cxx
  1054.         vtkFiltersAMR-Test-Cxx
  1055.         vtkFiltersAMR-Test-Python
  1056.         vtkFiltersFlowPaths-Test-Cxx
  1057.         vtkFiltersSources-Test-Cxx
  1058.         vtkFiltersSources-Test-Python
  1059.         vtkFiltersStatistics-Test-Cxx
  1060.         vtkFiltersStatistics-Test-Python
  1061.         vtkFiltersVerdict-Test-Cxx
  1062.         vtkFiltersVerdict-Test-Python
  1063.         vtkGUISupportQt-Test-Cxx
  1064.         vtkIOAMR-Test-Cxx
  1065.         vtkIOCore-Test-Cxx
  1066.         vtkIOCore-Test-Python
  1067.         vtkIOFFMPEG-Test-Cxx
  1068.         vtkIOMPIImage-Test-Cxx
  1069.         vtkIOMovie-Test-Cxx
  1070.         vtkIOParallel-Test-Cxx
  1071.         vtkIOParallel-Test-Python
  1072.         vtkIOXML-Test-Cxx
  1073.         vtkIOXML-Test-Python
  1074.         vtkImagingHybrid-Test-Cxx
  1075.         vtkImagingHybrid-Test-Python
  1076.         vtkPVCommon-Test-Cxx
  1077.         vtkRenderingCore-Test-Cxx
  1078.         vtkRenderingCore-Test-Python
  1079.         vtkRenderingHybridOpenGL-Test-Cxx
  1080.         vtkRenderingVolume-Test-Cxx
  1081.         vtkRenderingVolume-Test-Python
  1082.         vtkTestingRendering
  1083. --  * vtkTestingGenericBridge, needed by vtkFiltersGeneric-Test-Cxx.
  1084. --  * vtkTestingRendering, needed by 70 modules:
  1085.         vtkChartsCore-Test-Cxx
  1086.         vtkChartsCore-Test-Python
  1087.         vtkCoProcessorImplementation-Test-Cxx
  1088.         vtkCoProcessorImplementation-Test-Python
  1089.         vtkCommonColor-Test-Cxx
  1090.         vtkCommonDataModel-Test-Cxx
  1091.         vtkCommonDataModel-Test-Python
  1092.         vtkDomainsChemistry-Test-Cxx
  1093.         vtkFiltersAMR-Test-Cxx
  1094.         vtkFiltersAMR-Test-Python
  1095.         vtkFiltersCore-Test-Cxx
  1096.         vtkFiltersCore-Test-Python
  1097.         vtkFiltersExtraction-Test-Cxx
  1098.         vtkFiltersExtraction-Test-Python
  1099.         vtkFiltersFlowPaths-Test-Cxx
  1100.         vtkFiltersGeneral-Test-Cxx
  1101.         vtkFiltersGeneral-Test-Python
  1102.         vtkFiltersGeneric-Test-Cxx
  1103.         vtkFiltersGeometry-Test-Cxx
  1104.         vtkFiltersGeometry-Test-Python
  1105.         vtkFiltersHybrid-Test-Cxx
  1106.         vtkFiltersHybrid-Test-Python
  1107.         vtkFiltersHyperTree-Test-Cxx
  1108.         vtkFiltersModeling-Test-Cxx
  1109.         vtkFiltersModeling-Test-Python
  1110.         vtkFiltersParallel-Test-Cxx
  1111.         vtkFiltersParallel-Test-Python
  1112.         vtkFiltersParallelFlowPaths-Test-Cxx
  1113.         vtkFiltersProgrammable-Test-Cxx
  1114.         vtkFiltersProgrammable-Test-Python
  1115.         vtkFiltersSources-Test-Cxx
  1116.         vtkFiltersSources-Test-Python
  1117.         vtkIOAMR-Test-Cxx
  1118.         vtkIOExodus-Test-Cxx
  1119.         vtkIOExport-Test-Cxx
  1120.         vtkIOGeometry-Test-Cxx
  1121.         vtkIOGeometry-Test-Python
  1122.         vtkIOImport-Test-Cxx
  1123.         vtkIOImport-Test-Python
  1124.         vtkIOLSDyna-Test-Cxx
  1125.         vtkIOLegacy-Test-Cxx
  1126.         vtkIOMPIImage-Test-Cxx
  1127.         vtkIONetCDF-Test-Cxx
  1128.         vtkIONetCDF-Test-Python
  1129.         vtkIOPLY-Test-Cxx
  1130.         vtkIOPLY-Test-Python
  1131.         vtkIOParallel-Test-Cxx
  1132.         vtkIOParallel-Test-Python
  1133.         vtkIOParallelExodus-Test-Cxx
  1134.         vtkIOParallelLSDyna-Test-Cxx
  1135.         vtkIOParallelNetCDF-Test-Cxx
  1136.         vtkPVServerManagerApplication
  1137.         vtkPVServerManagerDefault
  1138.         vtkPVVTKExtensionsRendering-Test-Cxx
  1139.         vtkParallelCore-Test-Cxx
  1140.         vtkParallelCore-Test-Python
  1141.         vtkParallelMPI-Test-Cxx
  1142.         vtkParallelMPI-Test-Python
  1143.         vtkRenderingAnnotation-Test-Cxx
  1144.         vtkRenderingAnnotation-Test-Python
  1145.         vtkRenderingCore-Test-Cxx
  1146.         vtkRenderingCore-Test-Python
  1147.         vtkRenderingFreeType-Test-Cxx
  1148.         vtkRenderingFreeType-Test-Python
  1149.         vtkRenderingGL2PS-Test-Cxx
  1150.         vtkRenderingHybridOpenGL-Test-Cxx
  1151.         vtkRenderingMatplotlib-Test-Cxx
  1152.         vtkRenderingParallel-Test-Cxx
  1153.         vtkRenderingVolume-Test-Cxx
  1154.         vtkRenderingVolume-Test-Python
  1155. --  * vtkUtilitiesEncodeString, needed by 4 modules:
  1156.         vtkCoProcessor
  1157.         vtkPVVTKExtensionsRendering
  1158.         vtkPVVTKExtensionsWebGLExporter
  1159.         vtkRenderingOpenGL
  1160. --  * vtkUtilitiesHashSource, needed by vtkParallelCore.
  1161. --  * vtkUtilitiesMaterialLibrary, needed by vtkRenderingCore.
  1162. --  * vtkUtilitiesProcessXML, needed by vtkPVServerManagerApplication.
  1163. --  * vtkUtilitiesWrapClientServer, needed by vtkPVClientServerCoreCore.
  1164. --  * vtkVPIC, needed by vtkIOVPIC.
  1165. --  * vtkViewsContext2D, needed by 8 modules:
  1166.         vtkChartsCore-Test-Cxx
  1167.         vtkChartsCore-Test-Python
  1168.         vtkIOExport-Test-Cxx
  1169.         vtkPVClientServerCoreRendering
  1170.         vtkPVServerManagerApplication
  1171.         vtkRenderingFreeType-Test-Cxx
  1172.         vtkRenderingFreeType-Test-Python
  1173.         vtkRenderingMatplotlib-Test-Cxx
  1174. --  * vtkViewsCore, needed by 2 modules:
  1175.         vtkPVClientServerCoreRendering
  1176.         vtkViewsContext2D
  1177. --  * vtkWrappingTools, needed by 2 modules:
  1178.         vtkUtilitiesWrapClientServer
  1179.         vtkWrappingPython
  1180. --  * vtkalglib, needed by 2 modules:
  1181.         vtkFiltersParallelStatistics
  1182.         vtkFiltersStatistics
  1183. --  * vtkexodusII, needed by 3 modules:
  1184.         vtkIOExodus
  1185.         vtkIOParallel
  1186.         vtkIOParallelExodus
  1187. --  * vtkexpat, needed by vtkIOXMLParser.
  1188. --  * vtkfreetype, needed by 2 modules:
  1189.         vtkRenderingFreeType
  1190.         vtkftgl
  1191. --  * vtkftgl, needed by vtkRenderingFreeType.
  1192. --  * vtkgl2ps, needed by vtkRenderingGL2PS.
  1193. --  * vtkhdf5, needed by 4 modules:
  1194.         vtkIOAMR
  1195.         vtkIOVisItBridge
  1196.         vtknetcdf
  1197.         vtkxdmf2
  1198. --  * vtkicet, needed by vtkPVVTKExtensionsRendering.
  1199. --  * vtkjpeg, needed by 2 modules:
  1200.         vtkIOImage
  1201.         vtktiff
  1202. --  * vtklibxml2, needed by 3 modules:
  1203.         vtkIOInfovis
  1204.         vtkPVServerManagerApplication
  1205.         vtkxdmf2
  1206. --  * vtknetcdf, needed by 4 modules:
  1207.         vtkIONetCDF
  1208.         vtkIOParallelNetCDF
  1209.         vtkIOVisItBridge
  1210.         vtkexodusII
  1211. --  * vtkoggtheora, needed by vtkIOMovie.
  1212. --  * vtkpng, needed by 2 modules:
  1213.         vtkIOImage
  1214.         vtkgl2ps
  1215. --  * vtkprotobuf, needed by vtkPVServerImplementationCore.
  1216. --  * vtkqttesting, needed by pqWidgets.
  1217. --  * vtksys, needed by 14 modules:
  1218.         smTestDriver
  1219.         vtkCommonCore
  1220.         vtkCommonSystem
  1221.         vtkCosmo
  1222.         vtkDICOMParser
  1223.         vtkIOCore
  1224.         vtkPVPythonSupport
  1225.         vtkUtilitiesEncodeString
  1226.         vtkUtilitiesHashSource
  1227.         vtkUtilitiesMaterialLibrary
  1228.         vtkUtilitiesProcessXML
  1229.         vtkVPIC
  1230.         vtkWrappingPython
  1231.         vtkWrappingTools
  1232. --  * vtktiff, needed by vtkIOImage.
  1233. --  * vtkverdict, needed by vtkFiltersVerdict.
  1234. --  * vtkxdmf2, needed by vtkIOXdmf2.
  1235. --  * vtkzlib, needed by 8 modules:
  1236.         vtkIOCore
  1237.         vtkIOGeometry
  1238.         vtkMetaIO
  1239.         vtkfreetype
  1240.         vtkgl2ps
  1241.         vtkhdf5
  1242.         vtkpng
  1243.         vtktiff
  1244. -- Checking whether header cstdio is available
  1245. -- Checking whether header cstdio is available - yes
  1246. -- Checking for Large File Support
  1247. -- Checking for Large File Support - yes
  1248. -- Checking whether STL classes are in std namespace
  1249. -- Checking whether STL classes are in std namespace - yes
  1250. -- Checking whether ANSI stream headers are available
  1251. -- Checking whether ANSI stream headers are available - yes
  1252. -- Checking whether ANSI streams are in std namespace
  1253. -- Checking whether ANSI streams are in std namespace - yes
  1254. -- Checking whether ANSI string stream is available
  1255. -- Checking whether ANSI string stream is available - yes
  1256. -- Checking whether header cstddef is available
  1257. -- Checking whether header cstddef is available - yes
  1258. -- Checking whether stl string has operator!= for char*
  1259. -- Checking whether stl string has operator!= for char* - yes
  1260. -- Checking whether stl has iterator_traits
  1261. -- Checking whether stl has iterator_traits - yes
  1262. -- Checking whether stl has standard template allocator
  1263. -- Checking whether stl has standard template allocator - yes
  1264. -- Checking for rebind member of stl allocator
  1265. -- Checking for rebind member of stl allocator - yes
  1266. -- Checking for non-standard argument to stl allocator<>::max_size
  1267. -- Checking for non-standard argument to stl allocator<>::max_size - no
  1268. -- Checking whether stl containers support allocator objects.
  1269. -- Checking whether stl containers support allocator objects. - yes
  1270. -- Checking whether ios has binary openmode
  1271. -- Checking whether ios has binary openmode - yes
  1272. -- Checking whether "<>" is needed for template friends
  1273. -- Checking whether "<>" is needed for template friends - yes
  1274. -- Checking for member template support
  1275. -- Checking for member template support - yes
  1276. -- Checking for standard template specialization syntax
  1277. -- Checking for standard template specialization syntax - yes
  1278. -- Checking whether argument dependent lookup is supported
  1279. -- Checking whether argument dependent lookup is supported - yes
  1280. -- Checking whether struct stat has st_mtim member
  1281. -- Checking whether struct stat has st_mtim member - yes
  1282. -- Checking whether C++ compiler has 'long long'
  1283. -- Checking whether C++ compiler has 'long long' - yes
  1284. -- Checking whether C++ compiler has '__int64'
  1285. -- Checking whether C++ compiler has '__int64' - no
  1286. -- Checking for C type size macros
  1287. -- Checking for C type size macros - compiled
  1288. -- Check size of char
  1289. -- Check size of char - done
  1290. -- Check size of __int64
  1291. -- Check size of __int64 - failed
  1292. -- Checking whether char is signed
  1293. -- Checking whether char is signed - yes
  1294. -- Checking whether C compiler has ptrdiff_t in stddef.h
  1295. -- Checking whether C compiler has ptrdiff_t in stddef.h - yes
  1296. -- Checking whether C compiler has ssize_t in unistd.h
  1297. -- Checking whether C compiler has ssize_t in unistd.h - yes
  1298. -- Checking whether CXX compiler has setenv
  1299. -- Checking whether CXX compiler has setenv - yes
  1300. -- Checking whether CXX compiler has unsetenv
  1301. -- Checking whether CXX compiler has unsetenv - yes
  1302. -- Checking whether CXX compiler has environ in stdlib.h
  1303. -- Checking whether CXX compiler has environ in stdlib.h - no
  1304. -- Looking for include files sys/types.h, ifaddrs.h
  1305. -- Looking for include files sys/types.h, ifaddrs.h - found
  1306. -- Checking whether CXX compiler has rlimit64
  1307. -- Checking whether CXX compiler has rlimit64 - yes
  1308. -- Checking whether CXX compiler has atol
  1309. -- Checking whether CXX compiler has atol - yes
  1310. -- Checking whether CXX compiler has atoll
  1311. -- Checking whether CXX compiler has atoll - yes
  1312. -- Checking whether CXX compiler has _atoi64
  1313. -- Checking whether CXX compiler has _atoi64 - no
  1314. -- Looking for float.h
  1315. -- Looking for float.h - found
  1316. -- Looking for isnan
  1317. -- Looking for isnan - not found
  1318. -- Looking for _isnan
  1319. -- Looking for _isnan - not found
  1320. -- Looking for isinf
  1321. -- Looking for isinf - not found
  1322. -- Looking for _isinf
  1323. -- Looking for _isinf - not found
  1324. -- Looking for fenv.h
  1325. -- Looking for fenv.h - found
  1326. -- Looking for feenableexcept
  1327. -- Looking for feenableexcept - found
  1328. -- Performing Test COMPILER_HAS_HIDDEN_VISIBILITY
  1329. -- Performing Test COMPILER_HAS_HIDDEN_VISIBILITY - Success
  1330. -- Performing Test COMPILER_HAS_HIDDEN_INLINE_VISIBILITY
  1331. -- Performing Test COMPILER_HAS_HIDDEN_INLINE_VISIBILITY - Success
  1332. -- Performing Test COMPILER_HAS_DEPRECATED_ATTR
  1333. -- Performing Test COMPILER_HAS_DEPRECATED_ATTR - Success
  1334. -- Found ZLIB: /usr/lib64/libz.so (found version "1.2.7")
  1335. -- Found JPEG: /usr/lib64/libjpeg.so  
  1336. -- Found PNG: /usr/lib64/libpng.so (found version "1.5.13")
  1337. -- Found TIFF: /usr/lib64/libtiff.so (found version "4.0.3")
  1338. -- Found EXPAT: /usr/lib64/libexpat.so (found version "2.1.0")
  1339. -- Found Freetype: /usr/lib64/libfreetype.so (found version "2.4.11")
  1340. -- Looking for XOpenDisplay in /usr/lib64/libX11.so;/usr/lib64/libXext.so
  1341. -- Looking for XOpenDisplay in /usr/lib64/libX11.so;/usr/lib64/libXext.so - found
  1342. -- Looking for gethostbyname
  1343. -- Looking for gethostbyname - found
  1344. -- Looking for connect
  1345. -- Looking for connect - found
  1346. -- Looking for remove
  1347. -- Looking for remove - found
  1348. -- Looking for shmat
  1349. -- Looking for shmat - found
  1350. -- Looking for IceConnectionNumber in ICE
  1351. -- Looking for IceConnectionNumber in ICE - found
  1352. -- Found X11: /usr/lib64/libX11.so
  1353. -- Found OpenGL: /usr/lib64/libGL.so  
  1354. -- Performing Test GLX_DEFINES_MACRO_GLX_VERSION_1_1
  1355. -- Performing Test GLX_DEFINES_MACRO_GLX_VERSION_1_1 - Success
  1356. -- Performing Test GLX_DEFINES_MACRO_GLX_VERSION_1_2
  1357. -- Performing Test GLX_DEFINES_MACRO_GLX_VERSION_1_2 - Success
  1358. -- Performing Test GLX_DEFINES_MACRO_GLX_VERSION_1_3
  1359. -- Performing Test GLX_DEFINES_MACRO_GLX_VERSION_1_3 - Success
  1360. -- Performing Test GLX_DEFINES_MACRO_GLX_VERSION_1_4
  1361. -- Performing Test GLX_DEFINES_MACRO_GLX_VERSION_1_4 - Success
  1362. -- Performing Test GLX_DEFINES_MACRO_GLX_ARB_get_proc_address
  1363. -- Performing Test GLX_DEFINES_MACRO_GLX_ARB_get_proc_address - Success
  1364. -- Performing Test GLX_INCLUDES_GLXEXT
  1365. -- Performing Test GLX_INCLUDES_GLXEXT - Success
  1366. -- Performing Test GLX_DEFINES_TYPE_GLXextFuncPtr
  1367. -- Performing Test GLX_DEFINES_TYPE_GLXextFuncPtr - Success
  1368. -- Performing Test GLX_DEFINES_TYPE_GLXextFuncPtr_AS_EMPTY
  1369. -- Performing Test GLX_DEFINES_TYPE_GLXextFuncPtr_AS_EMPTY - Failed
  1370. -- Performing Test GLX_DECLARES_FUNCTION_glXGetProcAddressARB
  1371. -- Performing Test GLX_DECLARES_FUNCTION_glXGetProcAddressARB - Success
  1372. -- Performing Test GLX_DECLARES_FUNCTION_glXGetProcAddress
  1373. -- Performing Test GLX_DECLARES_FUNCTION_glXGetProcAddress - Success
  1374. -- Performing Test GLX_DECLARES_FUNCTION_glXGetProcAddressARB_AS_EMPTY
  1375. -- Performing Test GLX_DECLARES_FUNCTION_glXGetProcAddressARB_AS_EMPTY - Failed
  1376. -- Performing Test GLX_DECLARES_FUNCTION_glXGetProcAddress_AS_EMPTY
  1377. -- Performing Test GLX_DECLARES_FUNCTION_glXGetProcAddress_AS_EMPTY - Failed
  1378. -- Performing Test GLX_DEFINES_TYPE_GLXFBConfig
  1379. -- Performing Test GLX_DEFINES_TYPE_GLXFBConfig - Success
  1380. -- GLX_DEFINES_MACRO_GLX_VERSION_1_1=1
  1381. -- GLX_DEFINES_MACRO_GLX_VERSION_1_2=1
  1382. -- GLX_DEFINES_MACRO_GLX_VERSION_1_3=1
  1383. -- GLX_DEFINES_MACRO_GLX_VERSION_1_4=1
  1384. -- GLX_DEFINES_MACRO_GLX_ARB_get_proc_address=1
  1385. -- GLX_INCLUDES_GLXEXT=1
  1386. -- GLX_USES_MACRO_GLX_GLXEXT_LEGACY=TRUE
  1387. -- GLX_DEFINES_TYPE_GLXextFuncPtr=1
  1388. -- GLX_DEFINES_TYPE_GLXextFuncPtr_AS_EMPTY=
  1389. -- GLX_DECLARES_FUNCTION_glXGetProcAddressARB=1
  1390. -- GLX_DECLARES_FUNCTION_glXGetProcAddress=1
  1391. -- GLX_DECLARES_FUNCTION_glXGetProcAddressARB_AS_EMPTY=
  1392. -- GLX_DECLARES_FUNCTION_glXGetProcAddress_AS_EMPTY=
  1393. -- GLX_DEFINES_TYPE_GLXFBConfig=1
  1394. -- Looking for glXGetProcAddressARB
  1395. -- Looking for glXGetProcAddressARB - found
  1396. -- Looking for glXGetProcAddressARB in GL/glx.h
  1397. -- Looking for glXGetProcAddressARB in GL/glx.h - TRUE
  1398. -- Found MPI_C: /usr/lib64/openmpi/libmpi.so;/usr/lib64/libdl.so;/usr/lib64/libhwloc.so  
  1399. -- Found MPI_CXX: /usr/lib64/openmpi/libmpi_cxx.so;/usr/lib64/openmpi/libmpi.so;/usr/lib64/libdl.so;/usr/lib64/libhwloc.so  
  1400. -- Boost version: 1.52.0
  1401. -- Check size of int
  1402. -- Check size of int - done
  1403. -- Check size of long
  1404. -- Check size of long - done
  1405. -- Check size of void*
  1406. -- Check size of void* - done
  1407. -- Check size of char
  1408. -- Check size of char - done
  1409. -- Check size of short
  1410. -- Check size of short - done
  1411. -- Check size of float
  1412. -- Check size of float - done
  1413. -- Check size of double
  1414. -- Check size of double - done
  1415. -- Looking for limits.h
  1416. -- Looking for limits.h - found
  1417. -- Looking for unistd.h
  1418. -- Looking for unistd.h - found
  1419. -- Looking for include files sys/types.h, sys/prctl.h
  1420. -- Looking for include files sys/types.h, sys/prctl.h - found
  1421. -- Looking for include file fcntl.h
  1422. -- Looking for include file fcntl.h - found
  1423. -- Looking for include file inttypes.h
  1424. -- Looking for include file inttypes.h - found
  1425. -- Looking for include file malloc.h
  1426. -- Looking for include file malloc.h - found
  1427. -- Looking for include file limits.h
  1428. -- Looking for include file limits.h - found
  1429. -- Looking for include file memory.h
  1430. -- Looking for include file memory.h - found
  1431. -- Looking for include file stdlib.h
  1432. -- Looking for include file stdlib.h - found
  1433. -- Looking for include file strings.h
  1434. -- Looking for include file strings.h - found
  1435. -- Looking for include file string.h
  1436. -- Looking for include file string.h - found
  1437. -- Looking for include file sys/time.h
  1438. -- Looking for include file sys/time.h - found
  1439. -- Looking for include file sys/stat.h
  1440. -- Looking for include file sys/stat.h - found
  1441. -- Looking for include file unistd.h
  1442. -- Looking for include file unistd.h - found
  1443. -- Looking for include file stdbool.h
  1444. -- Looking for include file stdbool.h - found
  1445. -- Check size of off64_t
  1446. -- Check size of off64_t - done
  1447. -- Check if the system is big endian
  1448. -- Searching 16 bit integer
  1449. -- Using unsigned short
  1450. -- Check if the system is big endian - little endian
  1451. -- Looking for dlfcn.h
  1452. -- Looking for dlfcn.h - found
  1453. -- Found HDF5: debug;/usr/lib64/libpthread.so;debug;/usr/lib64/libz.so;debug;/usr/lib64/librt.so;debug;/usr/lib64/libm.so;debug;/usr/lib64/libhdf5_hl.so;debug;/usr/lib64/libhdf5.so;optimized;/usr/lib64/libpthread.so;optimized;/usr/lib64/libz.so;optimized;/usr/lib64/librt.so;optimized;/usr/lib64/libm.so;optimized;/usr/lib64/libhdf5_hl.so;optimized;/usr/lib64/libhdf5.so  
  1454. -- Looking for 4 include files stdlib.h, ..., float.h
  1455. -- Looking for 4 include files stdlib.h, ..., float.h - found
  1456. -- Looking for include file alloca.h
  1457. -- Looking for include file alloca.h - found
  1458. -- Looking for 7 include files alloca.h, ..., stdio.h
  1459. -- Looking for 7 include files alloca.h, ..., stdio.h - found
  1460. -- Looking for alloca
  1461. -- Looking for alloca - found
  1462. -- Looking for strerror
  1463. -- Looking for strerror - found
  1464. -- Check size of size_t
  1465. -- Check size of size_t - done
  1466. -- Check size of ssize_t
  1467. -- Check size of ssize_t - done
  1468. -- Check size of ptrdiff_t
  1469. -- Check size of ptrdiff_t - done
  1470. -- Check size of off_t
  1471. -- Check size of off_t - done
  1472. -- Check size of double
  1473. -- Check size of double - done
  1474. -- Check size of float
  1475. -- Check size of float - done
  1476. -- Check size of int
  1477. -- Check size of int - done
  1478. -- Check size of long
  1479. -- Check size of long - done
  1480. -- Check size of short
  1481. -- Check size of short - done
  1482. -- Check size of uchar
  1483. -- Check size of uchar - failed
  1484. -- Check size of _Bool
  1485. -- Check size of _Bool - done
  1486. -- Performing NetCDF Test HAVE_ST_BLKSIZE
  1487. -- Performing NetCDF Test HAVE_ST_BLKSIZE - Success
  1488. -- Performing NetCDF Test HAVE_FTRUNCATE
  1489. -- Performing NetCDF Test HAVE_FTRUNCATE - Success
  1490. -- Looking for malloc.h
  1491. -- Looking for malloc.h - found
  1492. -- Found LibXml2: /usr/lib64/libxml2.so (found version "2.8.0")
  1493. -- Found OGGTHEORA: /usr/lib64/libogg.so  
  1494. -- Boost version: 1.52.0
  1495. -- Check size of long long
  1496. -- Check size of long long - done
  1497. -- Looking for malloc.h
  1498. -- Looking for malloc.h - found
  1499. -- Looking for strtoll
  1500. -- Looking for strtoll - found
  1501. -- Check if system supports 64 bit streams
  1502. -- Check if system supports 64 bit streams - yes
  1503. -- Checking if FFMPEG uses old style header files - no
  1504. -- Checking if FFMPEG has img_convert - not found
  1505. -- Checking if FFMPEG uses old API for url_fclose - not found
  1506. -- Checking if FFMPEG has avformat_alloc_context - found
  1507. -- Check size of char
  1508. -- Check size of char - done
  1509. -- Check size of short
  1510. -- Check size of short - done
  1511. -- Check size of int
  1512. -- Check size of int - done
  1513. -- Check size of long
  1514. -- Check size of long - done
  1515. -- Check size of long long
  1516. -- Check size of long long - done
  1517. -- Check size of __int64
  1518. -- Check size of __int64 - failed
  1519. -- Check size of float
  1520. -- Check size of float - done
  1521. -- Check size of double
  1522. -- Check size of double - done
  1523. -- Check size of void*
  1524. -- Check size of void* - done
  1525. -- Found GLUT: /usr/lib64/libglut.so  
  1526. -- Found Qt4: /usr/bin/qmake (found suitable version "4.8.4", minimum required is "4.7.0")
  1527. Matplotlib not found! MathText rendering will not be available until it is installed. Disabling tests.
  1528. -- Plugin: SLACTools - SLAC Tools : Enabled
  1529. -- Plugin: CoProcessingScriptGenerator - Plugin for creating python coprocessing scripts : Enabled
  1530. -- Plugin: SciberQuestToolKit - SciberQuestToolKit - Domain specific visualization tools for magnetospheric sciences. : Enabled
  1531. -- Plugin: SurfaceLIC - Add Surface-LIC vector visualization support : Enabled
  1532. -- Plugin: H5PartReader - Reader for h5part files : Enabled
  1533. -- Plugin: ForceTime - Override time requests : Disabled
  1534. -- Plugin: MantaView - Manta Ray-Cast View : Disabled
  1535. -- Plugin: SierraPlotTools - Sierra Plotting Tools : Enabled
  1536. -- Plugin: PrismPlugin - Filters for Flux and Circulation Fields : Enabled
  1537. -- Plugin: NonOrthogonalSource - Non Orthogonal Source code sample : Enabled
  1538. -- Plugin: VRPlugin - Virtual Reality Devices and Interactor styles : Disabled
  1539. -- Plugin: GMVReader - Reader for binary or ASCII files stored in General Mesh Viewer file format : Enabled
  1540. -- Performing Test Wno-unused-result
  1541. -- Performing Test Wno-unused-result - Success
  1542. -- Plugin: EyeDomeLighting - Add 3D View with eye-dome Lighting support : Enabled
  1543. -- Plugin: Nektar - Nektar Reader Plugin : Disabled
  1544. -- Plugin: AdiosReader - Reader for *.bp files based on Adios : Disabled
  1545. -- Plugin: QuadView - Add a Quad view to explore data by slicing it along 3 axis. : Enabled
  1546. -- Plugin: AnalyzeNIfTIIO - Reader/Writer for Analyze and NifTI files : Enabled
  1547. -- Plugin: ArrowGlyph - Glyph with customizable Arrows : Enabled
  1548. -- Plugin: UncertaintyRendering - Add uncertainty visualization support : Enabled
  1549. -- Plugin: pvblot - PVBLOT Plugin : Enabled
  1550. -- Plugin: PacMan - Testing plugin : Enabled
  1551. -- Plugin: PointSprite - Point Sprites : Enabled
  1552. -- Plugin: Moments - Filters for Flux and Circulation Fields : Enabled
  1553. -- Plugin: VaporPlugin - Plugin to read NCAR VDR files : Disabled
  1554. -- Configuring done
  1555. -- Generating done
  1556. -- Build files have been written to: /home/martin/temp/paraview/src/build
  1557. Scanning dependencies of target vtkWrappingTools
  1558. [  0%] Scanning dependencies of target vtksys
  1559. Building C object VTK/Wrapping/Tools/CMakeFiles/vtkWrappingTools.dir/vtkParse.tab.c.o
  1560. [  0%] Building C object VTK/Utilities/KWSys/vtksys/CMakeFiles/vtksys.dir/ProcessUNIX.c.o
  1561. [  0%] Building C object VTK/Utilities/KWSys/vtksys/CMakeFiles/vtksys.dir/Base64.c.o
  1562. [  0%] Building C object VTK/Utilities/KWSys/vtksys/CMakeFiles/vtksys.dir/MD5.c.o
  1563. [  0%] Building C object VTK/Utilities/KWSys/vtksys/CMakeFiles/vtksys.dir/System.c.o
  1564. [  0%] Building CXX object VTK/Utilities/KWSys/vtksys/CMakeFiles/vtksys.dir/Directory.cxx.o
  1565. [  0%] Building CXX object VTK/Utilities/KWSys/vtksys/CMakeFiles/vtksys.dir/DynamicLoader.cxx.o
  1566. [  0%] Building CXX object VTK/Utilities/KWSys/vtksys/CMakeFiles/vtksys.dir/Glob.cxx.o
  1567. [  0%] Building CXX object VTK/Utilities/KWSys/vtksys/CMakeFiles/vtksys.dir/RegularExpression.cxx.o
  1568. [  0%] Building C object VTK/Wrapping/Tools/CMakeFiles/vtkWrappingTools.dir/vtkParseData.c.o
  1569. [  0%] Building CXX object VTK/Utilities/KWSys/vtksys/CMakeFiles/vtksys.dir/SystemTools.cxx.o
  1570. [  0%] Building C object VTK/Wrapping/Tools/CMakeFiles/vtkWrappingTools.dir/vtkParseMain.c.o
  1571. [  0%] Building C object VTK/Wrapping/Tools/CMakeFiles/vtkWrappingTools.dir/vtkParseExtras.c.o
  1572. [  0%] Building C object VTK/Wrapping/Tools/CMakeFiles/vtkWrappingTools.dir/vtkParseMangle.c.o
  1573. [  0%] Building C object VTK/Wrapping/Tools/CMakeFiles/vtkWrappingTools.dir/vtkParseString.c.o
  1574. [  0%] Building C object VTK/Wrapping/Tools/CMakeFiles/vtkWrappingTools.dir/vtkParseHierarchy.c.o
  1575. [  0%] Building C object VTK/Wrapping/Tools/CMakeFiles/vtkWrappingTools.dir/vtkParsePreprocess.c.o
  1576. [  0%] Building CXX object VTK/Utilities/KWSys/vtksys/CMakeFiles/vtksys.dir/CommandLineArguments.cxx.o
  1577. [  0%] Building C object VTK/Wrapping/Tools/CMakeFiles/vtkWrappingTools.dir/vtkWrap.c.o
  1578. [  0%] Building C object VTK/Wrapping/Tools/CMakeFiles/vtkWrappingTools.dir/vtkWrapText.c.o
  1579. Linking C static library ../../../lib/libvtkWrappingTools-pv3.98.a
  1580. [  0%] Built target vtkWrappingTools
  1581. Scanning dependencies of target vtkWrapPythonInit
  1582. [  0%] Building C object VTK/Wrapping/Tools/CMakeFiles/vtkWrapPythonInit.dir/vtkWrapPythonInit.c.o
  1583. Linking C executable ../../../bin/vtkWrapPythonInit-pv3.98
  1584. [  0%] Built target vtkWrapPythonInit
  1585. Scanning dependencies of target vtkWrapPython
  1586. [  0%] Building C object VTK/Wrapping/Tools/CMakeFiles/vtkWrapPython.dir/vtkWrapPython.c.o
  1587. [  0%] Building CXX object VTK/Utilities/KWSys/vtksys/CMakeFiles/vtksys.dir/SystemInformation.cxx.o
  1588. Linking C executable ../../../bin/vtkWrapPython-pv3.98
  1589. [  0%] Built target vtkWrapPython
  1590. Scanning dependencies of target vtkDICOMParser
  1591. [  0%] Building CXX object VTK/Utilities/DICOMParser/CMakeFiles/vtkDICOMParser.dir/DICOMFile.cxx.o
  1592. Linking CXX shared library ../../../../lib/libvtksys-pv3.98.so
  1593. [  0%] Building CXX object VTK/Utilities/DICOMParser/CMakeFiles/vtkDICOMParser.dir/DICOMParser.cxx.o
  1594. [  0%] Built target vtksys
  1595. Scanning dependencies of target vtkmetaio
  1596. [  0%] Building CXX object VTK/Utilities/MetaIO/vtkmetaio/CMakeFiles/vtkmetaio.dir/metaUtils.cxx.o
  1597. [  0%] Building CXX object VTK/Utilities/DICOMParser/CMakeFiles/vtkDICOMParser.dir/DICOMAppHelper.cxx.o
  1598. [  0%] Building CXX object VTK/Utilities/MetaIO/vtkmetaio/CMakeFiles/vtkmetaio.dir/metaArrow.cxx.o
  1599. [  0%] Building CXX object VTK/Utilities/MetaIO/vtkmetaio/CMakeFiles/vtkmetaio.dir/metaBlob.cxx.o
  1600. [  0%] Building CXX object VTK/Utilities/MetaIO/vtkmetaio/CMakeFiles/vtkmetaio.dir/metaCommand.cxx.o
  1601. Linking CXX shared library ../../../lib/libvtkDICOMParser-pv3.98.so
  1602. [  0%] Built target vtkDICOMParser
  1603. Scanning dependencies of target ProcessShader
  1604. [  0%] Building CXX object VTK/Utilities/MaterialLibrary/CMakeFiles/ProcessShader.dir/ProcessShader.cxx.o
  1605. Linking CXX executable ../../../bin/vtkProcessShader-pv3.98
  1606. [  0%] Built target ProcessShader
  1607. Scanning dependencies of target vtkMaterialLibraryConfiguredFiles
  1608. [  0%] Built target vtkMaterialLibraryConfiguredFiles
  1609. Scanning dependencies of target vtkftgl
  1610. [  0%] Building CXX object VTK/ThirdParty/ftgl/CMakeFiles/vtkftgl.dir/src/FTBitmapGlyph.cpp.o
  1611. [  0%] Building CXX object VTK/ThirdParty/ftgl/CMakeFiles/vtkftgl.dir/src/FTBitmapGlyphRenderOpenGL.cpp.o
  1612. [  0%] Building CXX object VTK/ThirdParty/ftgl/CMakeFiles/vtkftgl.dir/src/FTCharmap.cpp.o
  1613. [  0%] Building CXX object VTK/ThirdParty/ftgl/CMakeFiles/vtkftgl.dir/src/FTFace.cpp.o
  1614. [  0%] Building CXX object VTK/Utilities/MetaIO/vtkmetaio/CMakeFiles/vtkmetaio.dir/metaContour.cxx.o
  1615. [  0%] Building CXX object VTK/ThirdParty/ftgl/CMakeFiles/vtkftgl.dir/src/FTFont.cpp.o
  1616. [  0%] Building CXX object VTK/ThirdParty/ftgl/CMakeFiles/vtkftgl.dir/src/FTGLBitmapFont.cpp.o
  1617. [  0%] Building CXX object VTK/ThirdParty/ftgl/CMakeFiles/vtkftgl.dir/src/FTGLBitmapFontRenderOpenGL.cpp.o
  1618. [  0%] Building CXX object VTK/ThirdParty/ftgl/CMakeFiles/vtkftgl.dir/src/FTGLPixmapFont.cpp.o
  1619. [  0%] Building CXX object VTK/ThirdParty/ftgl/CMakeFiles/vtkftgl.dir/src/FTGLPixmapFontRenderOpenGL.cpp.o
  1620. [  0%] Building CXX object VTK/ThirdParty/ftgl/CMakeFiles/vtkftgl.dir/src/FTGlyph.cpp.o
  1621. [  0%] Building CXX object VTK/ThirdParty/ftgl/CMakeFiles/vtkftgl.dir/src/FTGlyphContainer.cpp.o
  1622. [  0%] Building CXX object VTK/ThirdParty/ftgl/CMakeFiles/vtkftgl.dir/src/FTLibrary.cpp.o
  1623. [  0%] Building CXX object VTK/Utilities/MetaIO/vtkmetaio/CMakeFiles/vtkmetaio.dir/metaDTITube.cxx.o
  1624. [  0%] Building CXX object VTK/ThirdParty/ftgl/CMakeFiles/vtkftgl.dir/src/FTPixmapGlyph.cpp.o
  1625. [  0%] Building CXX object VTK/ThirdParty/ftgl/CMakeFiles/vtkftgl.dir/src/FTPixmapGlyphRenderOpenGL.cpp.o
  1626. [  0%] Building CXX object VTK/ThirdParty/ftgl/CMakeFiles/vtkftgl.dir/src/FTSize.cpp.o
  1627. Linking CXX shared library ../../../lib/libvtkftgl-pv3.98.so
  1628. [  0%] Built target vtkftgl
  1629. Scanning dependencies of target vtkParseOGLExt
  1630. [  0%] Building CXX object VTK/Utilities/ParseOGLExt/CMakeFiles/vtkParseOGLExt.dir/Tokenizer.cxx.o
  1631. [  0%] Building CXX object VTK/Utilities/ParseOGLExt/CMakeFiles/vtkParseOGLExt.dir/ParseOGLExt.cxx.o
  1632. [  0%] Building CXX object VTK/Utilities/MetaIO/vtkmetaio/CMakeFiles/vtkmetaio.dir/metaEllipse.cxx.o
  1633. [  0%] Building CXX object VTK/Utilities/MetaIO/vtkmetaio/CMakeFiles/vtkmetaio.dir/metaGroup.cxx.o
  1634. [  0%] Building CXX object VTK/Utilities/MetaIO/vtkmetaio/CMakeFiles/vtkmetaio.dir/metaGaussian.cxx.o
  1635. [  0%] Building CXX object VTK/Utilities/MetaIO/vtkmetaio/CMakeFiles/vtkmetaio.dir/metaImage.cxx.o
  1636. Linking CXX executable ../../../bin/vtkParseOGLExt-pv3.98
  1637. [  0%] Built target vtkParseOGLExt
  1638. Scanning dependencies of target vtkEncodeString
  1639. [  0%] Building CXX object VTK/Utilities/EncodeString/CMakeFiles/vtkEncodeString.dir/vtkEncodeString.cxx.o
  1640. Linking CXX executable ../../../bin/vtkEncodeString-pv3.98
  1641. [  0%] Built target vtkEncodeString
  1642. [  0%] Building CXX object VTK/Utilities/MetaIO/vtkmetaio/CMakeFiles/vtkmetaio.dir/metaImageUtils.cxx.o
  1643. Scanning dependencies of target visitcommon
  1644. [  0%] Building CXX object Utilities/VisItBridge/Library/VisItLib/common/CMakeFiles/visitcommon.dir/comm/BadHostException.C.o
  1645. [  0%] Building CXX object VTK/Utilities/MetaIO/vtkmetaio/CMakeFiles/vtkmetaio.dir/metaLandmark.cxx.o
  1646. [  0%] Building CXX object Utilities/VisItBridge/Library/VisItLib/common/CMakeFiles/visitcommon.dir/comm/BufferConnection.C.o
  1647. [  0%] Building CXX object Utilities/VisItBridge/Library/VisItLib/common/CMakeFiles/visitcommon.dir/comm/CommunicationHeader.C.o
  1648. [  0%] Building CXX object VTK/Utilities/MetaIO/vtkmetaio/CMakeFiles/vtkmetaio.dir/metaLine.cxx.o
  1649. [  1%] Building CXX object Utilities/VisItBridge/Library/VisItLib/common/CMakeFiles/visitcommon.dir/comm/Connection.C.o
  1650. [  1%] Building CXX object Utilities/VisItBridge/Library/VisItLib/common/CMakeFiles/visitcommon.dir/comm/ConnectionGroup.C.o
  1651. [  1%] Building CXX object VTK/Utilities/MetaIO/vtkmetaio/CMakeFiles/vtkmetaio.dir/metaMesh.cxx.o
  1652. [  1%] Building CXX object Utilities/VisItBridge/Library/VisItLib/common/CMakeFiles/visitcommon.dir/comm/DConvert.C.o
  1653. [  1%] Building CXX object Utilities/VisItBridge/Library/VisItLib/common/CMakeFiles/visitcommon.dir/comm/ExistingRemoteProcess.C.o
  1654. [  1%] Building CXX object Utilities/VisItBridge/Library/VisItLib/common/CMakeFiles/visitcommon.dir/comm/FConvert.C.o
  1655. [  1%] Building CXX object Utilities/VisItBridge/Library/VisItLib/common/CMakeFiles/visitcommon.dir/comm/FileConnection.C.o
  1656. [  1%] Building CXX object Utilities/VisItBridge/Library/VisItLib/common/CMakeFiles/visitcommon.dir/comm/IConvert.C.o
  1657. [  1%] Building CXX object Utilities/VisItBridge/Library/VisItLib/common/CMakeFiles/visitcommon.dir/comm/LConvert.C.o
  1658. [  1%] Building CXX object Utilities/VisItBridge/Library/VisItLib/common/CMakeFiles/visitcommon.dir/comm/ParentProcess.C.o
  1659. [  1%] Building CXX object VTK/Utilities/MetaIO/vtkmetaio/CMakeFiles/vtkmetaio.dir/metaObject.cxx.o
  1660. [  1%] Building CXX object Utilities/VisItBridge/Library/VisItLib/common/CMakeFiles/visitcommon.dir/comm/RemoteProcess.C.o
  1661. [  1%] Building CXX object VTK/Utilities/MetaIO/vtkmetaio/CMakeFiles/vtkmetaio.dir/metaOutput.cxx.o
  1662. [  1%] Building CXX object Utilities/VisItBridge/Library/VisItLib/common/CMakeFiles/visitcommon.dir/comm/SocketConnection.C.o
  1663. [  1%] Building CXX object Utilities/VisItBridge/Library/VisItLib/common/CMakeFiles/visitcommon.dir/comm/TypeRepresentation.C.o
  1664. [  1%] Building CXX object Utilities/VisItBridge/Library/VisItLib/common/CMakeFiles/visitcommon.dir/Exceptions/Database/BadPermissionException.C.o
  1665. [  1%] Building CXX object Utilities/VisItBridge/Library/VisItLib/common/CMakeFiles/visitcommon.dir/Exceptions/Database/FileDoesNotExistException.C.o
  1666. [  1%] Building CXX object VTK/Utilities/MetaIO/vtkmetaio/CMakeFiles/vtkmetaio.dir/metaScene.cxx.o
  1667. [  1%] Building CXX object Utilities/VisItBridge/Library/VisItLib/common/CMakeFiles/visitcommon.dir/Exceptions/Database/InvalidDBTypeException.C.o
  1668. [  1%] Building CXX object Utilities/VisItBridge/Library/VisItLib/common/CMakeFiles/visitcommon.dir/Exceptions/Database/InvalidFilesException.C.o
  1669. [  1%] Building CXX object VTK/Utilities/MetaIO/vtkmetaio/CMakeFiles/vtkmetaio.dir/metaSurface.cxx.o
  1670. [  1%] Building CXX object Utilities/VisItBridge/Library/VisItLib/common/CMakeFiles/visitcommon.dir/Exceptions/Database/InvalidSourceException.C.o
  1671. [  1%] Building CXX object Utilities/VisItBridge/Library/VisItLib/common/CMakeFiles/visitcommon.dir/Exceptions/Database/InvalidTimeStepException.C.o
  1672. [  1%] Building CXX object VTK/Utilities/MetaIO/vtkmetaio/CMakeFiles/vtkmetaio.dir/metaTube.cxx.o
  1673. [  1%] Building CXX object Utilities/VisItBridge/Library/VisItLib/common/CMakeFiles/visitcommon.dir/Exceptions/Database/InvalidVariableException.C.o
  1674. [  1%] Building CXX object Utilities/VisItBridge/Library/VisItLib/common/CMakeFiles/visitcommon.dir/Exceptions/Database/InvalidZoneTypeException.C.o
  1675. [  1%] Building CXX object VTK/Utilities/MetaIO/vtkmetaio/CMakeFiles/vtkmetaio.dir/metaVesselTube.cxx.o
  1676. [  1%] Building CXX object Utilities/VisItBridge/Library/VisItLib/common/CMakeFiles/visitcommon.dir/Exceptions/Database/NonCompliantFileException.C.o
  1677. [  1%] Building CXX object Utilities/VisItBridge/Library/VisItLib/common/CMakeFiles/visitcommon.dir/Exceptions/Database/PointerNotInCacheException.C.o
  1678. [  1%] Building CXX object Utilities/VisItBridge/Library/VisItLib/common/CMakeFiles/visitcommon.dir/Exceptions/Database/SiloException.C.o
  1679. [  1%] Building CXX object VTK/Utilities/MetaIO/vtkmetaio/CMakeFiles/vtkmetaio.dir/metaTransform.cxx.o
  1680. [  1%] Building CXX object Utilities/VisItBridge/Library/VisItLib/common/CMakeFiles/visitcommon.dir/Exceptions/Pipeline/AbortException.C.o
  1681. [  1%] Building CXX object Utilities/VisItBridge/Library/VisItLib/common/CMakeFiles/visitcommon.dir/Exceptions/Pipeline/BadCellException.C.o
  1682. [  1%] Building CXX object VTK/Utilities/MetaIO/vtkmetaio/CMakeFiles/vtkmetaio.dir/metaTubeGraph.cxx.o
  1683. [  1%] Building CXX object Utilities/VisItBridge/Library/VisItLib/common/CMakeFiles/visitcommon.dir/Exceptions/Pipeline/BadDomainException.C.o
  1684. [  1%] Building CXX object Utilities/VisItBridge/Library/VisItLib/common/CMakeFiles/visitcommon.dir/Exceptions/Pipeline/BadIndexException.C.o
  1685. [  1%] Building CXX object VTK/Utilities/MetaIO/vtkmetaio/CMakeFiles/vtkmetaio.dir/metaForm.cxx.o
  1686. [  1%] Building CXX object Utilities/VisItBridge/Library/VisItLib/common/CMakeFiles/visitcommon.dir/Exceptions/Pipeline/BadNodeException.C.o
  1687. [  1%] Building CXX object Utilities/VisItBridge/Library/VisItLib/common/CMakeFiles/visitcommon.dir/Exceptions/Pipeline/BadVectorException.C.o
  1688. [  1%] Building CXX object VTK/Utilities/MetaIO/vtkmetaio/CMakeFiles/vtkmetaio.dir/metaArray.cxx.o
  1689. [  1%] Building CXX object Utilities/VisItBridge/Library/VisItLib/common/CMakeFiles/visitcommon.dir/Exceptions/Pipeline/ExpressionException.C.o
  1690. [  1%] Building CXX object Utilities/VisItBridge/Library/VisItLib/common/CMakeFiles/visitcommon.dir/Exceptions/Pipeline/GhostCellException.C.o
  1691. [  1%] Building CXX object VTK/Utilities/MetaIO/vtkmetaio/CMakeFiles/vtkmetaio.dir/metaFEMObject.cxx.o
  1692. [  1%] Building CXX object Utilities/VisItBridge/Library/VisItLib/common/CMakeFiles/visitcommon.dir/Exceptions/Pipeline/ImproperUseException.C.o
  1693. [  1%] Building CXX object Utilities/VisItBridge/Library/VisItLib/common/CMakeFiles/visitcommon.dir/Exceptions/Pipeline/IncompatibleDomainListsException.C.o
  1694. [  1%] Building CXX object Utilities/VisItBridge/Library/VisItLib/common/CMakeFiles/visitcommon.dir/Exceptions/Pipeline/IntervalTreeNotCalculatedException.C.o
  1695. [  1%] Building CXX object Utilities/VisItBridge/Library/VisItLib/common/CMakeFiles/visitcommon.dir/Exceptions/Pipeline/InvalidCategoryException.C.o
  1696. [  1%] Building CXX object Utilities/VisItBridge/Library/VisItLib/common/CMakeFiles/visitcommon.dir/Exceptions/Pipeline/InvalidCellTypeException.C.o
  1697. Linking CXX shared library ../../../../lib/libvtkmetaio-pv3.98.so
  1698. [  1%] Built target vtkmetaio
  1699. [  1%] Generating moc_Q4VTKWidgetPlugin.cxx
  1700. [  1%] Building CXX object Utilities/VisItBridge/Library/VisItLib/common/CMakeFiles/visitcommon.dir/Exceptions/Pipeline/InvalidDimensionsException.C.o
  1701. Scanning dependencies of target QVTKWidgetPlugin
  1702. [  1%] Building CXX object VTK/GUISupport/Qt/CMakeFiles/QVTKWidgetPlugin.dir/Q4VTKWidgetPlugin.cxx.o
  1703. [  1%] Building CXX object Utilities/VisItBridge/Library/VisItLib/common/CMakeFiles/visitcommon.dir/Exceptions/Pipeline/InvalidLimitsException.C.o
  1704. [  1%] Building CXX object Utilities/VisItBridge/Library/VisItLib/common/CMakeFiles/visitcommon.dir/Exceptions/Pipeline/InvalidMergeException.C.o
  1705. [  1%] Building CXX object VTK/GUISupport/Qt/CMakeFiles/QVTKWidgetPlugin.dir/moc_Q4VTKWidgetPlugin.cxx.o
  1706. [  1%] Building CXX object Utilities/VisItBridge/Library/VisItLib/common/CMakeFiles/visitcommon.dir/Exceptions/Pipeline/InvalidSetException.C.o
  1707. [  1%] Building CXX object Utilities/VisItBridge/Library/VisItLib/common/CMakeFiles/visitcommon.dir/Exceptions/Pipeline/LogicalIndexException.C.o
  1708. Linking CXX shared library ../../../lib/libQVTKWidgetPlugin.so
  1709. [  1%] Building CXX object Utilities/VisItBridge/Library/VisItLib/common/CMakeFiles/visitcommon.dir/Exceptions/Pipeline/NoCurveException.C.o
  1710. [  1%] Built target QVTKWidgetPlugin
  1711. Scanning dependencies of target vtkParseJava
  1712. [  1%] Building C object VTK/Wrapping/Tools/CMakeFiles/vtkParseJava.dir/vtkParseJava.c.o
  1713. [  1%] Building CXX object Utilities/VisItBridge/Library/VisItLib/common/CMakeFiles/visitcommon.dir/Exceptions/Pipeline/NoDefaultVariableException.C.o
  1714. Linking C executable ../../../bin/vtkParseJava-pv3.98
  1715. [  1%] Built target vtkParseJava
  1716. Scanning dependencies of target vtkWrapJava
  1717. [  1%] Building C object VTK/Wrapping/Tools/CMakeFiles/vtkWrapJava.dir/vtkWrapJava.c.o
  1718. [  1%] Building CXX object Utilities/VisItBridge/Library/VisItLib/common/CMakeFiles/visitcommon.dir/Exceptions/Pipeline/NoInputException.C.o
  1719. Linking C executable ../../../bin/vtkWrapJava-pv3.98
  1720. [  1%] Built target vtkWrapJava
  1721. Scanning dependencies of target vtkWrapTcl
  1722. [  1%] Building C object VTK/Wrapping/Tools/CMakeFiles/vtkWrapTcl.dir/vtkWrapTcl.c.o
  1723. [  1%] Building CXX object Utilities/VisItBridge/Library/VisItLib/common/CMakeFiles/visitcommon.dir/Exceptions/Pipeline/NonQueryableInputException.C.o
  1724. Linking C executable ../../../bin/vtkWrapTcl-pv3.98
  1725. [  1%] Building CXX object Utilities/VisItBridge/Library/VisItLib/common/CMakeFiles/visitcommon.dir/Exceptions/Pipeline/StubReferencedException.C.o
  1726. [  1%] Built target vtkWrapTcl
  1727. Scanning dependencies of target vtkWrapTclInit
  1728. [  1%] Building C object VTK/Wrapping/Tools/CMakeFiles/vtkWrapTclInit.dir/vtkWrapTclInit.c.o
  1729. Linking C executable ../../../bin/vtkWrapTclInit-pv3.98
  1730. [  1%] Built target vtkWrapTclInit
  1731. Scanning dependencies of target vtkWrapClientServer
  1732. [  1%] Building C object Utilities/WrapClientServer/CMakeFiles/vtkWrapClientServer.dir/vtkWrapClientServer.c.o
  1733. [  1%] Building CXX object Utilities/VisItBridge/Library/VisItLib/common/CMakeFiles/visitcommon.dir/Exceptions/Pipeline/UnexpectedValueException.C.o
  1734. Linking C executable ../../bin/vtkWrapClientServer-pv3.98
  1735. [  1%] Built target vtkWrapClientServer
  1736. Scanning dependencies of target protobuf
  1737. [  1%] Building CXX object ThirdParty/protobuf/vtkprotobuf/src/CMakeFiles/protobuf.dir/google/protobuf/stubs/common.cc.o
  1738. [  1%] Building CXX object Utilities/VisItBridge/Library/VisItLib/common/CMakeFiles/visitcommon.dir/Exceptions/Plotter/InvalidColortableException.C.o
  1739. [  1%] Building CXX object ThirdParty/protobuf/vtkprotobuf/src/CMakeFiles/protobuf.dir/google/protobuf/stubs/once.cc.o
  1740. [  1%] Building CXX object Utilities/VisItBridge/Library/VisItLib/common/CMakeFiles/visitcommon.dir/Exceptions/Plotter/LibraryNotFoundException.C.o
  1741. [  1%] Building CXX object ThirdParty/protobuf/vtkprotobuf/src/CMakeFiles/protobuf.dir/google/protobuf/stubs/hash.cc.o
  1742. [  1%] Building CXX object ThirdParty/protobuf/vtkprotobuf/src/CMakeFiles/protobuf.dir/google/protobuf/extension_set.cc.o
  1743. [  1%] Building CXX object Utilities/VisItBridge/Library/VisItLib/common/CMakeFiles/visitcommon.dir/expr/ExprGrammar.C.o
  1744. [  1%] Building CXX object Utilities/VisItBridge/Library/VisItLib/common/CMakeFiles/visitcommon.dir/expr/ExprInit.C.o
  1745. [  1%] Building CXX object ThirdParty/protobuf/vtkprotobuf/src/CMakeFiles/protobuf.dir/google/protobuf/generated_message_util.cc.o
  1746. [  1%] Building CXX object ThirdParty/protobuf/vtkprotobuf/src/CMakeFiles/protobuf.dir/google/protobuf/message_lite.cc.o
  1747. [  1%] Building CXX object ThirdParty/protobuf/vtkprotobuf/src/CMakeFiles/protobuf.dir/google/protobuf/repeated_field.cc.o
  1748. [  1%] Building CXX object ThirdParty/protobuf/vtkprotobuf/src/CMakeFiles/protobuf.dir/google/protobuf/wire_format_lite.cc.o
  1749. [  1%] Building CXX object ThirdParty/protobuf/vtkprotobuf/src/CMakeFiles/protobuf.dir/google/protobuf/io/coded_stream.cc.o
  1750. [  1%] Building CXX object ThirdParty/protobuf/vtkprotobuf/src/CMakeFiles/protobuf.dir/google/protobuf/io/zero_copy_stream.cc.o
  1751. [  1%] Building CXX object ThirdParty/protobuf/vtkprotobuf/src/CMakeFiles/protobuf.dir/google/protobuf/io/zero_copy_stream_impl_lite.cc.o
  1752. [  1%] Building CXX object ThirdParty/protobuf/vtkprotobuf/src/CMakeFiles/protobuf.dir/google/protobuf/stubs/strutil.cc.o
  1753. [  1%] Building CXX object ThirdParty/protobuf/vtkprotobuf/src/CMakeFiles/protobuf.dir/google/protobuf/stubs/substitute.cc.o
  1754. [  1%] Building CXX object ThirdParty/protobuf/vtkprotobuf/src/CMakeFiles/protobuf.dir/google/protobuf/stubs/structurally_valid.cc.o
  1755. [  1%] Building CXX object ThirdParty/protobuf/vtkprotobuf/src/CMakeFiles/protobuf.dir/google/protobuf/descriptor.cc.o
  1756. [  1%] Building CXX object Utilities/VisItBridge/Library/VisItLib/common/CMakeFiles/visitcommon.dir/expr/ExprNode.C.o
  1757. [  1%] Building CXX object Utilities/VisItBridge/Library/VisItLib/common/CMakeFiles/visitcommon.dir/expr/ExprParser.C.o
  1758. [  1%] Building CXX object ThirdParty/protobuf/vtkprotobuf/src/CMakeFiles/protobuf.dir/google/protobuf/descriptor.pb.cc.o
  1759. [  1%] Building CXX object Utilities/VisItBridge/Library/VisItLib/common/CMakeFiles/visitcommon.dir/expr/ExprParseTreeNode.C.o
  1760. [  1%] Building CXX object Utilities/VisItBridge/Library/VisItLib/common/CMakeFiles/visitcommon.dir/expr/ExprScanner.C.o
  1761. [  1%] Building CXX object Utilities/VisItBridge/Library/VisItLib/common/CMakeFiles/visitcommon.dir/expr/InvalidExpressionException.C.o
  1762. [  1%] Building CXX object Utilities/VisItBridge/Library/VisItLib/common/CMakeFiles/visitcommon.dir/expr/ParsingExprList.C.o
  1763. [  1%] Building CXX object Utilities/VisItBridge/Library/VisItLib/common/CMakeFiles/visitcommon.dir/expr/RecursiveExpressionException.C.o
  1764. [  1%] Building CXX object Utilities/VisItBridge/Library/VisItLib/common/CMakeFiles/visitcommon.dir/misc/DebugStreamFull.C.o
  1765. [  1%] Building CXX object Utilities/VisItBridge/Library/VisItLib/common/CMakeFiles/visitcommon.dir/misc/Environment.C.o
  1766. [  1%] Building CXX object ThirdParty/protobuf/vtkprotobuf/src/CMakeFiles/protobuf.dir/google/protobuf/descriptor_database.cc.o
  1767. [  1%] Building CXX object Utilities/VisItBridge/Library/VisItLib/common/CMakeFiles/visitcommon.dir/misc/FileFunctions.C.o
  1768. [  1%] Building CXX object Utilities/VisItBridge/Library/VisItLib/common/CMakeFiles/visitcommon.dir/misc/InstallationFunctions.C.o
  1769. [  1%] Building CXX object Utilities/VisItBridge/Library/VisItLib/common/CMakeFiles/visitcommon.dir/misc/ConfigureInfo.C.o
  1770. [  1%] Building CXX object Utilities/VisItBridge/Library/VisItLib/common/CMakeFiles/visitcommon.dir/misc/PTY.C.o
  1771. [  1%] Building CXX object Utilities/VisItBridge/Library/VisItLib/common/CMakeFiles/visitcommon.dir/misc/RuntimeSetting.C.o
  1772. [  1%] Building CXX object Utilities/VisItBridge/Library/VisItLib/common/CMakeFiles/visitcommon.dir/misc/StackTimer.C.o
  1773. [  1%] Building CXX object ThirdParty/protobuf/vtkprotobuf/src/CMakeFiles/protobuf.dir/google/protobuf/dynamic_message.cc.o
  1774. [  1%] Building CXX object Utilities/VisItBridge/Library/VisItLib/common/CMakeFiles/visitcommon.dir/misc/TimingsManager.C.o
  1775. [  1%] Building CXX object ThirdParty/protobuf/vtkprotobuf/src/CMakeFiles/protobuf.dir/google/protobuf/extension_set_heavy.cc.o
  1776. [  1%] Building CXX object Utilities/VisItBridge/Library/VisItLib/common/CMakeFiles/visitcommon.dir/misc/VisItException.C.o
  1777. [  1%] Building CXX object Utilities/VisItBridge/Library/VisItLib/common/CMakeFiles/visitcommon.dir/misc/VisItInit.C.o
  1778. [  1%] Building CXX object ThirdParty/protobuf/vtkprotobuf/src/CMakeFiles/protobuf.dir/google/protobuf/generated_message_reflection.cc.o
  1779. [  1%] Building CXX object Utilities/VisItBridge/Library/VisItLib/common/CMakeFiles/visitcommon.dir/parser/ConfiguratingItem.C.o
  1780. [  1%] Building CXX object Utilities/VisItBridge/Library/VisItLib/common/CMakeFiles/visitcommon.dir/parser/ConfiguratingSet.C.o
  1781. [  1%] Building CXX object Utilities/VisItBridge/Library/VisItLib/common/CMakeFiles/visitcommon.dir/parser/Dictionary.C.o
  1782. [  1%] Building CXX object ThirdParty/protobuf/vtkprotobuf/src/CMakeFiles/protobuf.dir/google/protobuf/message.cc.o
  1783. [  1%] Building CXX object Utilities/VisItBridge/Library/VisItLib/common/CMakeFiles/visitcommon.dir/parser/Grammar.C.o
  1784. [  1%] Building CXX object ThirdParty/protobuf/vtkprotobuf/src/CMakeFiles/protobuf.dir/google/protobuf/reflection_ops.cc.o
  1785. [  1%] Building CXX object ThirdParty/protobuf/vtkprotobuf/src/CMakeFiles/protobuf.dir/google/protobuf/service.cc.o
  1786. [  1%] Building CXX object ThirdParty/protobuf/vtkprotobuf/src/CMakeFiles/protobuf.dir/google/protobuf/text_format.cc.o
  1787. [  1%] Building CXX object Utilities/VisItBridge/Library/VisItLib/common/CMakeFiles/visitcommon.dir/parser/Parser.C.o
  1788. [  1%] Building CXX object Utilities/VisItBridge/Library/VisItLib/common/CMakeFiles/visitcommon.dir/parser/ParseTreeNode.C.o
  1789. [  1%] Building CXX object Utilities/VisItBridge/Library/VisItLib/common/CMakeFiles/visitcommon.dir/parser/Rule.C.o
  1790. [  1%] Building CXX object Utilities/VisItBridge/Library/VisItLib/common/CMakeFiles/visitcommon.dir/parser/Scanner.C.o
  1791. [  1%] Building CXX object ThirdParty/protobuf/vtkprotobuf/src/CMakeFiles/protobuf.dir/google/protobuf/unknown_field_set.cc.o
  1792. [  1%] Building CXX object Utilities/VisItBridge/Library/VisItLib/common/CMakeFiles/visitcommon.dir/parser/Sequence.C.o
  1793. [  1%] Building CXX object Utilities/VisItBridge/Library/VisItLib/common/CMakeFiles/visitcommon.dir/parser/Symbol.C.o
  1794. [  2%] Building CXX object ThirdParty/protobuf/vtkprotobuf/src/CMakeFiles/protobuf.dir/google/protobuf/wire_format.cc.o
  1795. [  2%] Building CXX object Utilities/VisItBridge/Library/VisItLib/common/CMakeFiles/visitcommon.dir/parser/Token.C.o
  1796. [  2%] Building CXX object Utilities/VisItBridge/Library/VisItLib/common/CMakeFiles/visitcommon.dir/plugin/DatabasePluginInfo.C.o
  1797. [  2%] Building CXX object ThirdParty/protobuf/vtkprotobuf/src/CMakeFiles/protobuf.dir/google/protobuf/io/printer.cc.o
  1798. [  2%] Building CXX object Utilities/VisItBridge/Library/VisItLib/common/CMakeFiles/visitcommon.dir/plugin/DatabasePluginManager.C.o
  1799. [  2%] Building CXX object ThirdParty/protobuf/vtkprotobuf/src/CMakeFiles/protobuf.dir/google/protobuf/io/tokenizer.cc.o
  1800. [  2%] Building CXX object ThirdParty/protobuf/vtkprotobuf/src/CMakeFiles/protobuf.dir/google/protobuf/io/zero_copy_stream_impl.cc.o
  1801. [  2%] Building CXX object ThirdParty/protobuf/vtkprotobuf/src/CMakeFiles/protobuf.dir/google/protobuf/compiler/importer.cc.o
  1802. [  2%] Building CXX object Utilities/VisItBridge/Library/VisItLib/common/CMakeFiles/visitcommon.dir/plugin/InvalidDirectoryException.C.o
  1803. [  2%] Building CXX object Utilities/VisItBridge/Library/VisItLib/common/CMakeFiles/visitcommon.dir/plugin/InvalidPluginException.C.o
  1804. [  2%] Building CXX object Utilities/VisItBridge/Library/VisItLib/common/CMakeFiles/visitcommon.dir/plugin/OperatorPluginManager.C.o
  1805. [  2%] Building CXX object ThirdParty/protobuf/vtkprotobuf/src/CMakeFiles/protobuf.dir/google/protobuf/compiler/parser.cc.o
  1806. [  2%] Building CXX object Utilities/VisItBridge/Library/VisItLib/common/CMakeFiles/visitcommon.dir/plugin/PlotPluginManager.C.o
  1807. [  2%] Building CXX object ThirdParty/protobuf/vtkprotobuf/src/CMakeFiles/protobuf.dir/google/protobuf/io/gzip_stream.cc.o
  1808. Linking CXX shared library ../../../../lib/libprotobuf.so
  1809. [  2%] Built target protobuf
  1810. Scanning dependencies of target protobuf-lite
  1811. [  2%] Building CXX object ThirdParty/protobuf/vtkprotobuf/src/CMakeFiles/protobuf-lite.dir/google/protobuf/stubs/common.cc.o
  1812. [  2%] Building CXX object ThirdParty/protobuf/vtkprotobuf/src/CMakeFiles/protobuf-lite.dir/google/protobuf/stubs/once.cc.o
  1813. [  2%] Building CXX object ThirdParty/protobuf/vtkprotobuf/src/CMakeFiles/protobuf-lite.dir/google/protobuf/stubs/hash.cc.o
  1814. [  2%] Building CXX object ThirdParty/protobuf/vtkprotobuf/src/CMakeFiles/protobuf-lite.dir/google/protobuf/extension_set.cc.o
  1815. [  2%] Building CXX object Utilities/VisItBridge/Library/VisItLib/common/CMakeFiles/visitcommon.dir/plugin/PluginBroadcaster.C.o
  1816. [  2%] Building CXX object Utilities/VisItBridge/Library/VisItLib/common/CMakeFiles/visitcommon.dir/plugin/PluginManager.C.o
  1817. [  2%] Building CXX object ThirdParty/protobuf/vtkprotobuf/src/CMakeFiles/protobuf-lite.dir/google/protobuf/generated_message_util.cc.o
  1818. [  2%] Building CXX object ThirdParty/protobuf/vtkprotobuf/src/CMakeFiles/protobuf-lite.dir/google/protobuf/message_lite.cc.o
  1819. [  2%] Building CXX object ThirdParty/protobuf/vtkprotobuf/src/CMakeFiles/protobuf-lite.dir/google/protobuf/repeated_field.cc.o
  1820. [  2%] Building CXX object ThirdParty/protobuf/vtkprotobuf/src/CMakeFiles/protobuf-lite.dir/google/protobuf/wire_format_lite.cc.o
  1821. [  2%] Building CXX object Utilities/VisItBridge/Library/VisItLib/common/CMakeFiles/visitcommon.dir/proxybase/RemoteProxyBase.C.o
  1822. [  2%] Building CXX object ThirdParty/protobuf/vtkprotobuf/src/CMakeFiles/protobuf-lite.dir/google/protobuf/io/coded_stream.cc.o
  1823. [  2%] Building CXX object ThirdParty/protobuf/vtkprotobuf/src/CMakeFiles/protobuf-lite.dir/google/protobuf/io/zero_copy_stream.cc.o
  1824. [  2%] Building CXX object Utilities/VisItBridge/Library/VisItLib/common/CMakeFiles/visitcommon.dir/state/AnimationAttributes.C.o
  1825. [  2%] Building CXX object ThirdParty/protobuf/vtkprotobuf/src/CMakeFiles/protobuf-lite.dir/google/protobuf/io/zero_copy_stream_impl_lite.cc.o
  1826. Linking CXX shared library ../../../../lib/libprotobuf-lite.so
  1827. [  2%] Built target protobuf-lite
  1828. Scanning dependencies of target protoc_compiler
  1829. [  2%] Building CXX object ThirdParty/protobuf/vtkprotobuf/src/CMakeFiles/protoc_compiler.dir/google/protobuf/compiler/main.cc.o
  1830. [  2%] Building CXX object Utilities/VisItBridge/Library/VisItLib/common/CMakeFiles/visitcommon.dir/state/AnnotationAttributes.C.o
  1831. [  2%] Building CXX object ThirdParty/protobuf/vtkprotobuf/src/CMakeFiles/protoc_compiler.dir/google/protobuf/compiler/code_generator.cc.o
  1832. [  2%] Building CXX object ThirdParty/protobuf/vtkprotobuf/src/CMakeFiles/protoc_compiler.dir/google/protobuf/compiler/command_line_interface.cc.o
  1833. [  2%] Building CXX object Utilities/VisItBridge/Library/VisItLib/common/CMakeFiles/visitcommon.dir/state/AnnotationObject.C.o
  1834. [  2%] Building CXX object Utilities/VisItBridge/Library/VisItLib/common/CMakeFiles/visitcommon.dir/state/AnnotationObjectList.C.o
  1835. [  2%] Building CXX object Utilities/VisItBridge/Library/VisItLib/common/CMakeFiles/visitcommon.dir/state/AppearanceAttributes.C.o
  1836. [  2%] Building CXX object ThirdParty/protobuf/vtkprotobuf/src/CMakeFiles/protoc_compiler.dir/google/protobuf/compiler/cpp/cpp_enum.cc.o
  1837. [  2%] Building CXX object Utilities/VisItBridge/Library/VisItLib/common/CMakeFiles/visitcommon.dir/state/AttributeGroup.C.o
  1838. [  2%] Building CXX object ThirdParty/protobuf/vtkprotobuf/src/CMakeFiles/protoc_compiler.dir/google/protobuf/compiler/cpp/cpp_enum_field.cc.o
  1839. [  2%] Building CXX object ThirdParty/protobuf/vtkprotobuf/src/CMakeFiles/protoc_compiler.dir/google/protobuf/compiler/cpp/cpp_extension.cc.o
  1840. [  2%] Building CXX object ThirdParty/protobuf/vtkprotobuf/src/CMakeFiles/protoc_compiler.dir/google/protobuf/compiler/cpp/cpp_field.cc.o
  1841. [  2%] Building CXX object Utilities/VisItBridge/Library/VisItLib/common/CMakeFiles/visitcommon.dir/state/AttributeSubject.C.o
  1842. [  2%] Building CXX object Utilities/VisItBridge/Library/VisItLib/common/CMakeFiles/visitcommon.dir/state/AttributeSubjectMap.C.o
  1843. [  2%] Building CXX object ThirdParty/protobuf/vtkprotobuf/src/CMakeFiles/protoc_compiler.dir/google/protobuf/compiler/cpp/cpp_file.cc.o
  1844. [  2%] Building CXX object Utilities/VisItBridge/Library/VisItLib/common/CMakeFiles/visitcommon.dir/state/Axes2D.C.o
  1845. [  2%] Building CXX object ThirdParty/protobuf/vtkprotobuf/src/CMakeFiles/protoc_compiler.dir/google/protobuf/compiler/cpp/cpp_generator.cc.o
  1846. [  2%] Building CXX object Utilities/VisItBridge/Library/VisItLib/common/CMakeFiles/visitcommon.dir/state/Axes3D.C.o
  1847. [  2%] Building CXX object ThirdParty/protobuf/vtkprotobuf/src/CMakeFiles/protoc_compiler.dir/google/protobuf/compiler/cpp/cpp_helpers.cc.o
  1848. [  2%] Building CXX object Utilities/VisItBridge/Library/VisItLib/common/CMakeFiles/visitcommon.dir/state/AxesArray.C.o
  1849. [  2%] Building CXX object Utilities/VisItBridge/Library/VisItLib/common/CMakeFiles/visitcommon.dir/state/AxisAttributes.C.o
  1850. [  2%] Building CXX object ThirdParty/protobuf/vtkprotobuf/src/CMakeFiles/protoc_compiler.dir/google/protobuf/compiler/cpp/cpp_message.cc.o
  1851. [  2%] Building CXX object Utilities/VisItBridge/Library/VisItLib/common/CMakeFiles/visitcommon.dir/state/AxisLabels.C.o
  1852. [  2%] Building CXX object Utilities/VisItBridge/Library/VisItLib/common/CMakeFiles/visitcommon.dir/state/AxisRestrictionAttributes.C.o
  1853. [  2%] Building CXX object Utilities/VisItBridge/Library/VisItLib/common/CMakeFiles/visitcommon.dir/state/AxisTickMarks.C.o
  1854. [  2%] Building CXX object Utilities/VisItBridge/Library/VisItLib/common/CMakeFiles/visitcommon.dir/state/AxisTitles.C.o
  1855. [  2%] Building CXX object ThirdParty/protobuf/vtkprotobuf/src/CMakeFiles/protoc_compiler.dir/google/protobuf/compiler/cpp/cpp_message_field.cc.o
  1856. [  2%] Building CXX object Utilities/VisItBridge/Library/VisItLib/common/CMakeFiles/visitcommon.dir/state/BoxExtents.C.o
  1857. [  2%] Building CXX object ThirdParty/protobuf/vtkprotobuf/src/CMakeFiles/protoc_compiler.dir/google/protobuf/compiler/cpp/cpp_primitive_field.cc.o
  1858. [  2%] Building CXX object Utilities/VisItBridge/Library/VisItLib/common/CMakeFiles/visitcommon.dir/state/ClientInformation.C.o
  1859. [  2%] Building CXX object ThirdParty/protobuf/vtkprotobuf/src/CMakeFiles/protoc_compiler.dir/google/protobuf/compiler/cpp/cpp_service.cc.o
  1860. [  2%] Building CXX object Utilities/VisItBridge/Library/VisItLib/common/CMakeFiles/visitcommon.dir/state/ClientInformationList.C.o
  1861. [  2%] Building CXX object Utilities/VisItBridge/Library/VisItLib/common/CMakeFiles/visitcommon.dir/state/ClientMethod.C.o
  1862. [  2%] Building CXX object Utilities/VisItBridge/Library/VisItLib/common/CMakeFiles/visitcommon.dir/state/ColorAttribute.C.o
  1863. [  2%] Building CXX object ThirdParty/protobuf/vtkprotobuf/src/CMakeFiles/protoc_compiler.dir/google/protobuf/compiler/cpp/cpp_string_field.cc.o
  1864. [  2%] Building CXX object Utilities/VisItBridge/Library/VisItLib/common/CMakeFiles/visitcommon.dir/state/ColorAttributeList.C.o
  1865. [  2%] Building CXX object ThirdParty/protobuf/vtkprotobuf/src/CMakeFiles/protoc_compiler.dir/google/protobuf/compiler/plugin.cc.o
  1866. [  2%] Building CXX object Utilities/VisItBridge/Library/VisItLib/common/CMakeFiles/visitcommon.dir/state/ColorControlPoint.C.o
  1867. [  2%] Building CXX object ThirdParty/protobuf/vtkprotobuf/src/CMakeFiles/protoc_compiler.dir/google/protobuf/compiler/plugin.pb.cc.o
  1868. [  2%] Building CXX object Utilities/VisItBridge/Library/VisItLib/common/CMakeFiles/visitcommon.dir/state/ColorControlPointList.C.o
  1869. [  2%] Building CXX object Utilities/VisItBridge/Library/VisItLib/common/CMakeFiles/visitcommon.dir/state/ColorTableAttributes.C.o
  1870. [  2%] Building CXX object ThirdParty/protobuf/vtkprotobuf/src/CMakeFiles/protoc_compiler.dir/google/protobuf/compiler/subprocess.cc.o
  1871. [  2%] Building CXX object ThirdParty/protobuf/vtkprotobuf/src/CMakeFiles/protoc_compiler.dir/google/protobuf/compiler/zip_writer.cc.o
  1872. [  2%] Building CXX object ThirdParty/protobuf/vtkprotobuf/src/CMakeFiles/protoc_compiler.dir/google/protobuf/stubs/common.cc.o
  1873. [  2%] Building CXX object ThirdParty/protobuf/vtkprotobuf/src/CMakeFiles/protoc_compiler.dir/google/protobuf/stubs/once.cc.o
  1874. [  2%] Building CXX object Utilities/VisItBridge/Library/VisItLib/common/CMakeFiles/visitcommon.dir/state/ColorTableManager.C.o
  1875. [  2%] Building CXX object ThirdParty/protobuf/vtkprotobuf/src/CMakeFiles/protoc_compiler.dir/google/protobuf/stubs/hash.cc.o
  1876. [  2%] Building CXX object ThirdParty/protobuf/vtkprotobuf/src/CMakeFiles/protoc_compiler.dir/google/protobuf/extension_set.cc.o
  1877. [  2%] Building CXX object Utilities/VisItBridge/Library/VisItLib/common/CMakeFiles/visitcommon.dir/state/CompactSILRestrictionAttributes.C.o
  1878. [  2%] Building CXX object Utilities/VisItBridge/Library/VisItLib/common/CMakeFiles/visitcommon.dir/state/ConfigManager.C.o
  1879. [  2%] Building CXX object Utilities/VisItBridge/Library/VisItLib/common/CMakeFiles/visitcommon.dir/state/ConstructDDFAttributes.C.o
  1880. [  2%] Building CXX object ThirdParty/protobuf/vtkprotobuf/src/CMakeFiles/protoc_compiler.dir/google/protobuf/generated_message_util.cc.o
  1881. [  2%] Building CXX object ThirdParty/protobuf/vtkprotobuf/src/CMakeFiles/protoc_compiler.dir/google/protobuf/message_lite.cc.o
  1882. [  2%] Building CXX object ThirdParty/protobuf/vtkprotobuf/src/CMakeFiles/protoc_compiler.dir/google/protobuf/repeated_field.cc.o
  1883. [  2%] Building CXX object Utilities/VisItBridge/Library/VisItLib/common/CMakeFiles/visitcommon.dir/state/ContourOpAttributes.C.o
  1884. [  2%] Building CXX object ThirdParty/protobuf/vtkprotobuf/src/CMakeFiles/protoc_compiler.dir/google/protobuf/wire_format_lite.cc.o
  1885. [  2%] Building CXX object ThirdParty/protobuf/vtkprotobuf/src/CMakeFiles/protoc_compiler.dir/google/protobuf/io/coded_stream.cc.o
  1886. [  2%] Building CXX object Utilities/VisItBridge/Library/VisItLib/common/CMakeFiles/visitcommon.dir/state/DatabaseAttributes.C.o
  1887. [  2%] [  2%] Building CXX object ThirdParty/protobuf/vtkprotobuf/src/CMakeFiles/protoc_compiler.dir/google/protobuf/io/zero_copy_stream.cc.o
  1888. Building CXX object Utilities/VisItBridge/Library/VisItLib/common/CMakeFiles/visitcommon.dir/state/DatabaseCorrelation.C.o
  1889. [  2%] Building CXX object ThirdParty/protobuf/vtkprotobuf/src/CMakeFiles/protoc_compiler.dir/google/protobuf/io/zero_copy_stream_impl_lite.cc.o
  1890. [  2%] Building CXX object ThirdParty/protobuf/vtkprotobuf/src/CMakeFiles/protoc_compiler.dir/google/protobuf/stubs/strutil.cc.o
  1891. [  2%] Building CXX object ThirdParty/protobuf/vtkprotobuf/src/CMakeFiles/protoc_compiler.dir/google/protobuf/stubs/substitute.cc.o
  1892. [  2%] Building CXX object ThirdParty/protobuf/vtkprotobuf/src/CMakeFiles/protoc_compiler.dir/google/protobuf/stubs/structurally_valid.cc.o
  1893. [  2%] Building CXX object Utilities/VisItBridge/Library/VisItLib/common/CMakeFiles/visitcommon.dir/state/DatabaseCorrelationList.C.o
  1894. [  2%] Building CXX object ThirdParty/protobuf/vtkprotobuf/src/CMakeFiles/protoc_compiler.dir/google/protobuf/descriptor.cc.o
  1895. [  2%] Building CXX object Utilities/VisItBridge/Library/VisItLib/common/CMakeFiles/visitcommon.dir/state/DataNode.C.o
  1896. [  2%] Building CXX object Utilities/VisItBridge/Library/VisItLib/common/CMakeFiles/visitcommon.dir/state/DBOptionsAttributes.C.o
  1897. [  2%] Building CXX object Utilities/VisItBridge/Library/VisItLib/common/CMakeFiles/visitcommon.dir/state/DBPluginInfoAttributes.C.o
  1898. [  2%] Building CXX object Utilities/VisItBridge/Library/VisItLib/common/CMakeFiles/visitcommon.dir/state/EngineList.C.o
  1899. [  2%] Building CXX object Utilities/VisItBridge/Library/VisItLib/common/CMakeFiles/visitcommon.dir/state/ExportDBAttributes.C.o
  1900. [  2%] Building CXX object Utilities/VisItBridge/Library/VisItLib/common/CMakeFiles/visitcommon.dir/state/Expression.C.o
  1901. [  2%] Building CXX object ThirdParty/protobuf/vtkprotobuf/src/CMakeFiles/protoc_compiler.dir/google/protobuf/descriptor.pb.cc.o
  1902. [  2%] Building CXX object Utilities/VisItBridge/Library/VisItLib/common/CMakeFiles/visitcommon.dir/state/ExpressionList.C.o
  1903. [  2%] Building CXX object Utilities/VisItBridge/Library/VisItLib/common/CMakeFiles/visitcommon.dir/state/FileOpenOptions.C.o
  1904. [  2%] Building CXX object Utilities/VisItBridge/Library/VisItLib/common/CMakeFiles/visitcommon.dir/state/FontAttributes.C.o
  1905. [  2%] Building CXX object Utilities/VisItBridge/Library/VisItLib/common/CMakeFiles/visitcommon.dir/state/GaussianControlPoint.C.o
  1906. [  2%] Building CXX object Utilities/VisItBridge/Library/VisItLib/common/CMakeFiles/visitcommon.dir/state/GaussianControlPointList.C.o
  1907. [  2%] Building CXX object Utilities/VisItBridge/Library/VisItLib/common/CMakeFiles/visitcommon.dir/state/GlobalAttributes.C.o
  1908. [  2%] Building CXX object Utilities/VisItBridge/Library/VisItLib/common/CMakeFiles/visitcommon.dir/state/GlobalLineoutAttributes.C.o
  1909. [  2%] Building CXX object ThirdParty/protobuf/vtkprotobuf/src/CMakeFiles/protoc_compiler.dir/google/protobuf/descriptor_database.cc.o
  1910. [  2%] Building CXX object Utilities/VisItBridge/Library/VisItLib/common/CMakeFiles/visitcommon.dir/state/LaunchProfile.C.o
  1911. [  2%] Building CXX object Utilities/VisItBridge/Library/VisItLib/common/CMakeFiles/visitcommon.dir/state/MachineProfile.C.o
  1912. [  2%] Building CXX object ThirdParty/protobuf/vtkprotobuf/src/CMakeFiles/protoc_compiler.dir/google/protobuf/dynamic_message.cc.o
  1913. [  2%] Building CXX object Utilities/VisItBridge/Library/VisItLib/common/CMakeFiles/visitcommon.dir/state/HostProfileList.C.o
  1914. [  2%] Building CXX object ThirdParty/protobuf/vtkprotobuf/src/CMakeFiles/protoc_compiler.dir/google/protobuf/extension_set_heavy.cc.o
  1915. [  2%] Building CXX object Utilities/VisItBridge/Library/VisItLib/common/CMakeFiles/visitcommon.dir/state/InteractorAttributes.C.o
  1916. [  2%] [  2%] Building CXX object Utilities/VisItBridge/Library/VisItLib/common/CMakeFiles/visitcommon.dir/state/InternalResampleAttributes.C.o
  1917. Building CXX object ThirdParty/protobuf/vtkprotobuf/src/CMakeFiles/protoc_compiler.dir/google/protobuf/generated_message_reflection.cc.o
  1918. [  2%] Building CXX object Utilities/VisItBridge/Library/VisItLib/common/CMakeFiles/visitcommon.dir/state/KeepAliveRPC.C.o
  1919. [  2%] Building CXX object Utilities/VisItBridge/Library/VisItLib/common/CMakeFiles/visitcommon.dir/state/KeyframeAttributes.C.o
  1920. [  2%] Building CXX object Utilities/VisItBridge/Library/VisItLib/common/CMakeFiles/visitcommon.dir/state/LightAttributes.C.o
  1921. [  2%] Building CXX object ThirdParty/protobuf/vtkprotobuf/src/CMakeFiles/protoc_compiler.dir/google/protobuf/message.cc.o
  1922. [  2%] Building CXX object Utilities/VisItBridge/Library/VisItLib/common/CMakeFiles/visitcommon.dir/state/LightList.C.o
  1923. [  2%] Building CXX object ThirdParty/protobuf/vtkprotobuf/src/CMakeFiles/protoc_compiler.dir/google/protobuf/reflection_ops.cc.o
  1924. [  2%] Building CXX object Utilities/VisItBridge/Library/VisItLib/common/CMakeFiles/visitcommon.dir/state/Line.C.o
  1925. [  2%] Building CXX object ThirdParty/protobuf/vtkprotobuf/src/CMakeFiles/protoc_compiler.dir/google/protobuf/service.cc.o
  1926. [  2%] Building CXX object ThirdParty/protobuf/vtkprotobuf/src/CMakeFiles/protoc_compiler.dir/google/protobuf/text_format.cc.o
  1927. [  2%] Building CXX object Utilities/VisItBridge/Library/VisItLib/common/CMakeFiles/visitcommon.dir/state/LinearTransformAttributes.C.o
  1928. [  2%] Building CXX object Utilities/VisItBridge/Library/VisItLib/common/CMakeFiles/visitcommon.dir/state/MapNode.C.o
  1929. [  2%] Building CXX object Utilities/VisItBridge/Library/VisItLib/common/CMakeFiles/visitcommon.dir/state/MaterialAttributes.C.o
  1930. [  2%] Building CXX object Utilities/VisItBridge/Library/VisItLib/common/CMakeFiles/visitcommon.dir/state/MeshManagementAttributes.C.o
  1931. [  2%] Building CXX object ThirdParty/protobuf/vtkprotobuf/src/CMakeFiles/protoc_compiler.dir/google/protobuf/unknown_field_set.cc.o
  1932. [  2%] [  2%] Building CXX object ThirdParty/protobuf/vtkprotobuf/src/CMakeFiles/protoc_compiler.dir/google/protobuf/wire_format.cc.o
  1933. Building CXX object Utilities/VisItBridge/Library/VisItLib/common/CMakeFiles/visitcommon.dir/state/MessageAttributes.C.o
  1934. [  2%] Building CXX object Utilities/VisItBridge/Library/VisItLib/common/CMakeFiles/visitcommon.dir/state/MovieAttributes.C.o
  1935. [  2%] Building CXX object ThirdParty/protobuf/vtkprotobuf/src/CMakeFiles/protoc_compiler.dir/google/protobuf/io/printer.cc.o
  1936. [  2%] Building CXX object ThirdParty/protobuf/vtkprotobuf/src/CMakeFiles/protoc_compiler.dir/google/protobuf/io/tokenizer.cc.o
  1937. [  2%] Building CXX object Utilities/VisItBridge/Library/VisItLib/common/CMakeFiles/visitcommon.dir/state/NamespaceAttributes.C.o
  1938. [  2%] Building CXX object Utilities/VisItBridge/Library/VisItLib/common/CMakeFiles/visitcommon.dir/state/NameschemeAttributes.C.o
  1939. [  2%] Building CXX object ThirdParty/protobuf/vtkprotobuf/src/CMakeFiles/protoc_compiler.dir/google/protobuf/io/zero_copy_stream_impl.cc.o
  1940. [  2%] Building CXX object ThirdParty/protobuf/vtkprotobuf/src/CMakeFiles/protoc_compiler.dir/google/protobuf/compiler/importer.cc.o
  1941. [  2%] Building CXX object Utilities/VisItBridge/Library/VisItLib/common/CMakeFiles/visitcommon.dir/state/Observer.C.o
  1942. [  2%] Building CXX object Utilities/VisItBridge/Library/VisItLib/common/CMakeFiles/visitcommon.dir/state/ObserverToCallback.C.o
  1943. [  2%] Building CXX object Utilities/VisItBridge/Library/VisItLib/common/CMakeFiles/visitcommon.dir/state/PickAttributes.C.o
  1944. [  2%] Building CXX object ThirdParty/protobuf/vtkprotobuf/src/CMakeFiles/protoc_compiler.dir/google/protobuf/compiler/parser.cc.o
  1945. Linking CXX executable ../../../../bin/protoc
  1946. [  2%] Built target protoc_compiler
  1947. [  2%] Generating ui_pqRecordEventsDialog.h
  1948. [  2%] Generating moc_pq3DViewEventTranslator.cxx
  1949. [  2%] Generating moc_pqAbstractButtonEventTranslator.cxx
  1950. [  2%] Generating moc_pqAbstractItemViewEventTranslator.cxx
  1951. [  2%] Generating moc_pqAbstractSliderEventTranslator.cxx
  1952. [  2%] Generating moc_pqBasicWidgetEventTranslator.cxx
  1953. [  2%] Generating moc_pqComboBoxEventTranslator.cxx
  1954. [  2%] Generating moc_pqDoubleSpinBoxEventTranslator.cxx
  1955. [  2%] Generating moc_pqEventDispatcher.cxx
  1956. [  2%] Generating moc_pqEventObserver.cxx
  1957. [  3%] Generating moc_pqEventPlayer.cxx
  1958. [  3%] Generating moc_pqEventSource.cxx
  1959. [  3%] Generating moc_pqEventTranslator.cxx
  1960. [  3%] Generating moc_pqLineEditEventTranslator.cxx
  1961. [  3%] Generating moc_pqMenuEventTranslator.cxx
  1962. [  3%] Generating moc_pqNativeFileDialogEventPlayer.cxx
  1963. [  3%] Generating moc_pqNativeFileDialogEventTranslator.cxx
  1964. [  3%] Generating moc_pqRecordEventsDialog.cxx
  1965. [  3%] Generating moc_pqSpinBoxEventTranslator.cxx
  1966. [  3%] Generating moc_pqStdoutEventObserver.cxx
  1967. [  3%] Generating moc_pqTabBarEventTranslator.cxx
  1968. [  3%] Generating moc_pqTestUtility.cxx
  1969. [  3%] Generating moc_pqThreadedEventSource.cxx
  1970. [  3%] [  3%] Generating moc_pqTimer.cxx
  1971. Building CXX object Utilities/VisItBridge/Library/VisItLib/common/CMakeFiles/visitcommon.dir/state/PickVarInfo.C.o
  1972. [  3%] Generating moc_pqTreeViewEventPlayer.cxx
  1973. [  3%] Generating moc_pqTreeViewEventTranslator.cxx
  1974. [  3%] Generating moc_pqWidgetEventTranslator.cxx
  1975. [  3%] Generating moc_pqPythonEventObserver.cxx
  1976. [  3%] Generating moc_pqPythonEventSource.cxx
  1977. Scanning dependencies of target QtTesting
  1978. [  3%] Building CXX object ThirdParty/QtTesting/vtkqttesting/CMakeFiles/QtTesting.dir/pq3DViewEventPlayer.cxx.o
  1979. [  3%] Building CXX object Utilities/VisItBridge/Library/VisItLib/common/CMakeFiles/visitcommon.dir/state/PlaneAttributes.C.o
  1980. [  3%] Building CXX object ThirdParty/QtTesting/vtkqttesting/CMakeFiles/QtTesting.dir/pq3DViewEventTranslator.cxx.o
  1981. [  3%] Building CXX object Utilities/VisItBridge/Library/VisItLib/common/CMakeFiles/visitcommon.dir/state/Plot.C.o
  1982. [  3%] Building CXX object ThirdParty/QtTesting/vtkqttesting/CMakeFiles/QtTesting.dir/pqAbstractActivateEventPlayer.cxx.o
  1983. [  3%] Building CXX object Utilities/VisItBridge/Library/VisItLib/common/CMakeFiles/visitcommon.dir/state/PlotInfoAttributes.C.o
  1984. [  3%] Building CXX object Utilities/VisItBridge/Library/VisItLib/common/CMakeFiles/visitcommon.dir/state/PlotList.C.o
  1985. [  3%] Building CXX object ThirdParty/QtTesting/vtkqttesting/CMakeFiles/QtTesting.dir/pqAbstractBooleanEventPlayer.cxx.o
  1986. [  3%] Building CXX object Utilities/VisItBridge/Library/VisItLib/common/CMakeFiles/visitcommon.dir/state/PlotQueryInfo.C.o
  1987. [  3%] Building CXX object ThirdParty/QtTesting/vtkqttesting/CMakeFiles/QtTesting.dir/pqAbstractButtonEventTranslator.cxx.o
  1988. [  3%] Building CXX object Utilities/VisItBridge/Library/VisItLib/common/CMakeFiles/visitcommon.dir/state/PluginManagerAttributes.C.o
  1989. [  3%] Building CXX object ThirdParty/QtTesting/vtkqttesting/CMakeFiles/QtTesting.dir/pqAbstractDoubleEventPlayer.cxx.o
  1990. [  3%] Building CXX object Utilities/VisItBridge/Library/VisItLib/common/CMakeFiles/visitcommon.dir/state/Point.C.o
  1991. [  3%] Building CXX object Utilities/VisItBridge/Library/VisItLib/common/CMakeFiles/visitcommon.dir/state/PointAttributes.C.o
  1992. [  3%] Building CXX object ThirdParty/QtTesting/vtkqttesting/CMakeFiles/QtTesting.dir/pqAbstractIntEventPlayer.cxx.o
  1993. [  3%] Building CXX object Utilities/VisItBridge/Library/VisItLib/common/CMakeFiles/visitcommon.dir/state/PrinterAttributes.C.o
  1994. [  3%] Building CXX object Utilities/VisItBridge/Library/VisItLib/common/CMakeFiles/visitcommon.dir/state/ProcessAttributes.C.o
  1995. [  3%] Building CXX object ThirdParty/QtTesting/vtkqttesting/CMakeFiles/QtTesting.dir/pqAbstractItemViewEventPlayer.cxx.o
  1996. [  4%] Building CXX object Utilities/VisItBridge/Library/VisItLib/common/CMakeFiles/visitcommon.dir/state/QueryAttributes.C.o
  1997. [  4%] Building CXX object ThirdParty/QtTesting/vtkqttesting/CMakeFiles/QtTesting.dir/pqAbstractItemViewEventTranslator.cxx.o
  1998. [  4%] Building CXX object Utilities/VisItBridge/Library/VisItLib/common/CMakeFiles/visitcommon.dir/state/QueryList.C.o
  1999. [  4%] Building CXX object ThirdParty/QtTesting/vtkqttesting/CMakeFiles/QtTesting.dir/pqAbstractMiscellaneousEventPlayer.cxx.o
  2000. [  4%] Building CXX object Utilities/VisItBridge/Library/VisItLib/common/CMakeFiles/visitcommon.dir/state/QueryOverTimeAttributes.C.o
  2001. [  4%] Building CXX object ThirdParty/QtTesting/vtkqttesting/CMakeFiles/QtTesting.dir/pqAbstractSliderEventTranslator.cxx.o
  2002. [  4%] Building CXX object Utilities/VisItBridge/Library/VisItLib/common/CMakeFiles/visitcommon.dir/state/QuitRPC.C.o
  2003. [  4%] Building CXX object ThirdParty/QtTesting/vtkqttesting/CMakeFiles/QtTesting.dir/pqAbstractStringEventPlayer.cxx.o
  2004. [  4%] Building CXX object Utilities/VisItBridge/Library/VisItLib/common/CMakeFiles/visitcommon.dir/state/RenderingAttributes.C.o
  2005. [  4%] Building CXX object Utilities/VisItBridge/Library/VisItLib/common/CMakeFiles/visitcommon.dir/state/SaveWindowAttributes.C.o
  2006. [  4%] Building CXX object ThirdParty/QtTesting/vtkqttesting/CMakeFiles/QtTesting.dir/pqBasicWidgetEventPlayer.cxx.o
  2007. [  4%] Building CXX object Utilities/VisItBridge/Library/VisItLib/common/CMakeFiles/visitcommon.dir/state/SILArrayAttributes.C.o
  2008. [  4%] Building CXX object ThirdParty/QtTesting/vtkqttesting/CMakeFiles/QtTesting.dir/pqBasicWidgetEventTranslator.cxx.o
  2009. [  4%] Building CXX object Utilities/VisItBridge/Library/VisItLib/common/CMakeFiles/visitcommon.dir/state/SILAttributes.C.o
  2010. [  4%] Building CXX object ThirdParty/QtTesting/vtkqttesting/CMakeFiles/QtTesting.dir/pqComboBoxEventTranslator.cxx.o
  2011. [  4%] Building CXX object ThirdParty/QtTesting/vtkqttesting/CMakeFiles/QtTesting.dir/pqDoubleSpinBoxEventTranslator.cxx.o
  2012. [  4%] Building CXX object Utilities/VisItBridge/Library/VisItLib/common/CMakeFiles/visitcommon.dir/state/SILMatrixAttributes.C.o
  2013. [  4%] Building CXX object Utilities/VisItBridge/Library/VisItLib/common/CMakeFiles/visitcommon.dir/state/SILRestrictionAttributes.C.o
  2014. [  4%] Building CXX object ThirdParty/QtTesting/vtkqttesting/CMakeFiles/QtTesting.dir/pqEventDispatcher.cxx.o
  2015. [  4%] Building CXX object Utilities/VisItBridge/Library/VisItLib/common/CMakeFiles/visitcommon.dir/state/SimilarityTransformAttributes.C.o
  2016. [  4%] Building CXX object ThirdParty/QtTesting/vtkqttesting/CMakeFiles/QtTesting.dir/pqEventObserver.cxx.o
  2017. [  4%] Building CXX object Utilities/VisItBridge/Library/VisItLib/common/CMakeFiles/visitcommon.dir/state/SimpleObserver.C.o
  2018. [  4%] Building CXX object Utilities/VisItBridge/Library/VisItLib/common/CMakeFiles/visitcommon.dir/state/SimulationCommand.C.o
  2019. [  4%] Building CXX object ThirdParty/QtTesting/vtkqttesting/CMakeFiles/QtTesting.dir/pqEventPlayer.cxx.o
  2020. [  4%] Building CXX object Utilities/VisItBridge/Library/VisItLib/common/CMakeFiles/visitcommon.dir/state/SingleAttributeConfigManager.C.o
  2021. [  4%] Building CXX object Utilities/VisItBridge/Library/VisItLib/common/CMakeFiles/visitcommon.dir/state/SphereAttributes.C.o
  2022. [  4%] Building CXX object ThirdParty/QtTesting/vtkqttesting/CMakeFiles/QtTesting.dir/pqEventTranslator.cxx.o
  2023. [  4%] Building CXX object Utilities/VisItBridge/Library/VisItLib/common/CMakeFiles/visitcommon.dir/state/StatusAttributes.C.o
  2024. [  4%] Building CXX object Utilities/VisItBridge/Library/VisItLib/common/CMakeFiles/visitcommon.dir/state/Subject.C.o
  2025. [  4%] Building CXX object ThirdParty/QtTesting/vtkqttesting/CMakeFiles/QtTesting.dir/pqLineEditEventTranslator.cxx.o
  2026. [  4%] Building CXX object Utilities/VisItBridge/Library/VisItLib/common/CMakeFiles/visitcommon.dir/state/SurfaceFilterAttributes.C.o
  2027. [  4%] Building CXX object Utilities/VisItBridge/Library/VisItLib/common/CMakeFiles/visitcommon.dir/state/SyncAttributes.C.o
  2028. [  4%] Building CXX object ThirdParty/QtTesting/vtkqttesting/CMakeFiles/QtTesting.dir/pqMenuEventTranslator.cxx.o
  2029. [  4%] Building CXX object Utilities/VisItBridge/Library/VisItLib/common/CMakeFiles/visitcommon.dir/state/TimeFormat.C.o
  2030. [  4%] Building CXX object ThirdParty/QtTesting/vtkqttesting/CMakeFiles/QtTesting.dir/pqNativeFileDialogEventPlayer.cxx.o
  2031. [  4%] Building CXX object Utilities/VisItBridge/Library/VisItLib/common/CMakeFiles/visitcommon.dir/state/Variant.C.o
  2032. [  4%] Building CXX object ThirdParty/QtTesting/vtkqttesting/CMakeFiles/QtTesting.dir/pqNativeFileDialogEventTranslator.cxx.o
  2033. [  4%] Building CXX object ThirdParty/QtTesting/vtkqttesting/CMakeFiles/QtTesting.dir/pqObjectNaming.cxx.o
  2034. [  4%] Building CXX object Utilities/VisItBridge/Library/VisItLib/common/CMakeFiles/visitcommon.dir/state/View2DAttributes.C.o
  2035. [  4%] Building CXX object Utilities/VisItBridge/Library/VisItLib/common/CMakeFiles/visitcommon.dir/state/View3DAttributes.C.o
  2036. [  4%] Building CXX object ThirdParty/QtTesting/vtkqttesting/CMakeFiles/QtTesting.dir/pqRecordEventsDialog.cxx.o
  2037. [  4%] Building CXX object Utilities/VisItBridge/Library/VisItLib/common/CMakeFiles/visitcommon.dir/state/ViewAttributes.C.o
  2038. [  4%] Building CXX object ThirdParty/QtTesting/vtkqttesting/CMakeFiles/QtTesting.dir/pqSpinBoxEventTranslator.cxx.o
  2039. [  4%] Building CXX object Utilities/VisItBridge/Library/VisItLib/common/CMakeFiles/visitcommon.dir/state/ViewAxisArrayAttributes.C.o
  2040. [  4%] Building CXX object Utilities/VisItBridge/Library/VisItLib/common/CMakeFiles/visitcommon.dir/state/ViewCurveAttributes.C.o
  2041. [  4%] Building CXX object ThirdParty/QtTesting/vtkqttesting/CMakeFiles/QtTesting.dir/pqStdoutEventObserver.cxx.o
  2042. [  4%] [  4%] Building CXX object Utilities/VisItBridge/Library/VisItLib/common/CMakeFiles/visitcommon.dir/state/VisItRPC.C.o
  2043. Building CXX object ThirdParty/QtTesting/vtkqttesting/CMakeFiles/QtTesting.dir/pqTabBarEventPlayer.cxx.o
  2044. [  4%] Building CXX object Utilities/VisItBridge/Library/VisItLib/common/CMakeFiles/visitcommon.dir/state/VisualCueInfo.C.o
  2045. [  4%] Building CXX object ThirdParty/QtTesting/vtkqttesting/CMakeFiles/QtTesting.dir/pqTabBarEventTranslator.cxx.o
  2046. [  4%] Building CXX object Utilities/VisItBridge/Library/VisItLib/common/CMakeFiles/visitcommon.dir/state/VisualCueList.C.o
  2047. [  4%] Building CXX object ThirdParty/QtTesting/vtkqttesting/CMakeFiles/QtTesting.dir/pqTestUtility.cxx.o
  2048. [  4%] Building CXX object Utilities/VisItBridge/Library/VisItLib/common/CMakeFiles/visitcommon.dir/state/WindowAttributes.C.o
  2049. [  4%] Building CXX object Utilities/VisItBridge/Library/VisItLib/common/CMakeFiles/visitcommon.dir/state/WindowInformation.C.o
  2050. [  4%] Building CXX object ThirdParty/QtTesting/vtkqttesting/CMakeFiles/QtTesting.dir/pqThreadedEventSource.cxx.o
  2051. [  4%] Building CXX object ThirdParty/QtTesting/vtkqttesting/CMakeFiles/QtTesting.dir/pqTimer.cxx.o
  2052. [  4%] Building CXX object Utilities/VisItBridge/Library/VisItLib/common/CMakeFiles/visitcommon.dir/state/Xfer.C.o
  2053. [  4%] Building CXX object ThirdParty/QtTesting/vtkqttesting/CMakeFiles/QtTesting.dir/pqTreeViewEventPlayer.cxx.o
  2054. [  4%] Building CXX object Utilities/VisItBridge/Library/VisItLib/common/CMakeFiles/visitcommon.dir/state/XMLNode.C.o
  2055. [  4%] Building CXX object ThirdParty/QtTesting/vtkqttesting/CMakeFiles/QtTesting.dir/pqTreeViewEventTranslator.cxx.o
  2056. [  4%] Building CXX object Utilities/VisItBridge/Library/VisItLib/common/CMakeFiles/visitcommon.dir/utility/AtomicProperties.C.o
  2057. [  4%] Building CXX object ThirdParty/QtTesting/vtkqttesting/CMakeFiles/QtTesting.dir/pqWidgetEventPlayer.cxx.o
  2058. [  4%] Building CXX object ThirdParty/QtTesting/vtkqttesting/CMakeFiles/QtTesting.dir/moc_pq3DViewEventTranslator.cxx.o
  2059. [  4%] Building CXX object ThirdParty/QtTesting/vtkqttesting/CMakeFiles/QtTesting.dir/moc_pqAbstractButtonEventTranslator.cxx.o
  2060. [  4%] Building CXX object ThirdParty/QtTesting/vtkqttesting/CMakeFiles/QtTesting.dir/moc_pqAbstractItemViewEventTranslator.cxx.o
  2061. [  4%] Building CXX object Utilities/VisItBridge/Library/VisItLib/common/CMakeFiles/visitcommon.dir/utility/CoordUtils.C.o
  2062. [  4%] Building CXX object ThirdParty/QtTesting/vtkqttesting/CMakeFiles/QtTesting.dir/moc_pqAbstractSliderEventTranslator.cxx.o
  2063. [  4%] Building CXX object Utilities/VisItBridge/Library/VisItLib/common/CMakeFiles/visitcommon.dir/utility/GeometricHelpers.C.o
  2064. [  4%] Building CXX object Utilities/VisItBridge/Library/VisItLib/common/CMakeFiles/visitcommon.dir/utility/Namescheme.C.o
  2065. [  4%] Building CXX object ThirdParty/QtTesting/vtkqttesting/CMakeFiles/QtTesting.dir/moc_pqBasicWidgetEventTranslator.cxx.o
  2066. [  4%] Building CXX object Utilities/VisItBridge/Library/VisItLib/common/CMakeFiles/visitcommon.dir/utility/StringHelpers.C.o
  2067. [  4%] Building CXX object ThirdParty/QtTesting/vtkqttesting/CMakeFiles/QtTesting.dir/moc_pqComboBoxEventTranslator.cxx.o
  2068. [  4%] Building CXX object ThirdParty/QtTesting/vtkqttesting/CMakeFiles/QtTesting.dir/moc_pqDoubleSpinBoxEventTranslator.cxx.o
  2069. [  4%] Building CXX object ThirdParty/QtTesting/vtkqttesting/CMakeFiles/QtTesting.dir/moc_pqEventDispatcher.cxx.o
  2070. [  4%] Building CXX object ThirdParty/QtTesting/vtkqttesting/CMakeFiles/QtTesting.dir/moc_pqEventObserver.cxx.o
  2071. [  4%] Building CXX object Utilities/VisItBridge/Library/VisItLib/common/CMakeFiles/visitcommon.dir/utility/Utility.C.o
  2072. [  4%] Building CXX object ThirdParty/QtTesting/vtkqttesting/CMakeFiles/QtTesting.dir/moc_pqEventPlayer.cxx.o
  2073. [  4%] Building CXX object ThirdParty/QtTesting/vtkqttesting/CMakeFiles/QtTesting.dir/moc_pqEventSource.cxx.o
  2074. [  4%] Building CXX object Utilities/VisItBridge/Library/VisItLib/common/CMakeFiles/visitcommon.dir/utility/void_ref_ptr.C.o
  2075. [  4%] Building CXX object ThirdParty/QtTesting/vtkqttesting/CMakeFiles/QtTesting.dir/moc_pqEventTranslator.cxx.o
  2076. Linking CXX shared library ../../../../../lib/libvtkvisitcommon-pv3.98.so
  2077. [  4%] Building CXX object ThirdParty/QtTesting/vtkqttesting/CMakeFiles/QtTesting.dir/moc_pqLineEditEventTranslator.cxx.o
  2078. [  4%] Built target visitcommon
  2079. Scanning dependencies of target vtkalglib
  2080. [  4%] Building CXX object VTK/ThirdParty/alglib/CMakeFiles/vtkalglib.dir/ap.cpp.o
  2081. [  4%] Building CXX object ThirdParty/QtTesting/vtkqttesting/CMakeFiles/QtTesting.dir/moc_pqMenuEventTranslator.cxx.o
  2082. [  4%] Building CXX object VTK/ThirdParty/alglib/CMakeFiles/vtkalglib.dir/bdsvd.cpp.o
  2083. [  4%] Building CXX object ThirdParty/QtTesting/vtkqttesting/CMakeFiles/QtTesting.dir/moc_pqNativeFileDialogEventPlayer.cxx.o
  2084. [  4%] Building CXX object ThirdParty/QtTesting/vtkqttesting/CMakeFiles/QtTesting.dir/moc_pqNativeFileDialogEventTranslator.cxx.o
  2085. [  4%] Building CXX object ThirdParty/QtTesting/vtkqttesting/CMakeFiles/QtTesting.dir/moc_pqRecordEventsDialog.cxx.o
  2086. [  4%] Building CXX object VTK/ThirdParty/alglib/CMakeFiles/vtkalglib.dir/bidiagonal.cpp.o
  2087. [  4%] Building CXX object ThirdParty/QtTesting/vtkqttesting/CMakeFiles/QtTesting.dir/moc_pqSpinBoxEventTranslator.cxx.o
  2088. [  4%] Building CXX object ThirdParty/QtTesting/vtkqttesting/CMakeFiles/QtTesting.dir/moc_pqStdoutEventObserver.cxx.o
  2089. [  4%] Building CXX object VTK/ThirdParty/alglib/CMakeFiles/vtkalglib.dir/blas.cpp.o
  2090. [  4%] Building CXX object ThirdParty/QtTesting/vtkqttesting/CMakeFiles/QtTesting.dir/moc_pqTabBarEventTranslator.cxx.o
  2091. [  4%] Building CXX object ThirdParty/QtTesting/vtkqttesting/CMakeFiles/QtTesting.dir/moc_pqTestUtility.cxx.o
  2092. [  4%] Building CXX object VTK/ThirdParty/alglib/CMakeFiles/vtkalglib.dir/lq.cpp.o
  2093. [  4%] Building CXX object ThirdParty/QtTesting/vtkqttesting/CMakeFiles/QtTesting.dir/moc_pqThreadedEventSource.cxx.o
  2094. [  4%] Building CXX object VTK/ThirdParty/alglib/CMakeFiles/vtkalglib.dir/qr.cpp.o
  2095. [  4%] Building CXX object ThirdParty/QtTesting/vtkqttesting/CMakeFiles/QtTesting.dir/moc_pqTimer.cxx.o
  2096. [  4%] Building CXX object VTK/ThirdParty/alglib/CMakeFiles/vtkalglib.dir/reflections.cpp.o
  2097. [  4%] [  4%] Building CXX object VTK/ThirdParty/alglib/CMakeFiles/vtkalglib.dir/rotations.cpp.o
  2098. Building CXX object ThirdParty/QtTesting/vtkqttesting/CMakeFiles/QtTesting.dir/moc_pqTreeViewEventPlayer.cxx.o
  2099. [  4%] Building CXX object ThirdParty/QtTesting/vtkqttesting/CMakeFiles/QtTesting.dir/moc_pqTreeViewEventTranslator.cxx.o
  2100. [  4%] Building CXX object VTK/ThirdParty/alglib/CMakeFiles/vtkalglib.dir/svd.cpp.o
  2101. [  4%] Building CXX object ThirdParty/QtTesting/vtkqttesting/CMakeFiles/QtTesting.dir/moc_pqWidgetEventTranslator.cxx.o
  2102. [  4%] Building CXX object ThirdParty/QtTesting/vtkqttesting/CMakeFiles/QtTesting.dir/moc_pqPythonEventObserver.cxx.o
  2103. Linking CXX shared library ../../../lib/libvtkalglib-pv3.98.so
  2104. [  4%] Built target vtkalglib
  2105. Scanning dependencies of target verdict
  2106. [  4%] Building CXX object VTK/ThirdParty/verdict/vtkverdict/CMakeFiles/verdict.dir/V_EdgeMetric.cpp.o
  2107. [  4%] Building CXX object VTK/ThirdParty/verdict/vtkverdict/CMakeFiles/verdict.dir/V_GaussIntegration.cpp.o
  2108. [  4%] Building CXX object ThirdParty/QtTesting/vtkqttesting/CMakeFiles/QtTesting.dir/moc_pqPythonEventSource.cxx.o
  2109. [  4%] Building CXX object VTK/ThirdParty/verdict/vtkverdict/CMakeFiles/verdict.dir/V_HexMetric.cpp.o
  2110. [  4%] Building CXX object ThirdParty/QtTesting/vtkqttesting/CMakeFiles/QtTesting.dir/pqPythonEventObserver.cxx.o
  2111. [  4%] Building CXX object ThirdParty/QtTesting/vtkqttesting/CMakeFiles/QtTesting.dir/pqPythonEventSource.cxx.o
  2112. [  4%] Building CXX object VTK/ThirdParty/verdict/vtkverdict/CMakeFiles/verdict.dir/V_KnifeMetric.cpp.o
  2113. [  4%] Building CXX object VTK/ThirdParty/verdict/vtkverdict/CMakeFiles/verdict.dir/V_PyramidMetric.cpp.o
  2114. [  4%] Building CXX object VTK/ThirdParty/verdict/vtkverdict/CMakeFiles/verdict.dir/V_QuadMetric.cpp.o
  2115. Linking CXX shared library ../../../lib/libQtTesting.so
  2116. [  4%] Built target QtTesting
  2117. Scanning dependencies of target vtkNetCDF
  2118. [  4%] Building C object VTK/ThirdParty/netcdf/vtknetcdf/CMakeFiles/vtkNetCDF.dir/libsrc/string.c.o
  2119. [  4%] Building C object VTK/ThirdParty/netcdf/vtknetcdf/CMakeFiles/vtkNetCDF.dir/libsrc/v1hpg.c.o
  2120. [  4%] Building CXX object VTK/ThirdParty/verdict/vtkverdict/CMakeFiles/verdict.dir/V_TetMetric.cpp.o
  2121. [  4%] Building C object VTK/ThirdParty/netcdf/vtknetcdf/CMakeFiles/vtkNetCDF.dir/libsrc/utf8proc.c.o
  2122. [  4%] Building CXX object VTK/ThirdParty/verdict/vtkverdict/CMakeFiles/verdict.dir/V_TriMetric.cpp.o
  2123. [  4%] Building C object VTK/ThirdParty/netcdf/vtknetcdf/CMakeFiles/vtkNetCDF.dir/libsrc/nclistmgr.c.o
  2124. [  4%] Building C object VTK/ThirdParty/netcdf/vtknetcdf/CMakeFiles/vtkNetCDF.dir/libsrc/putget.c.o
  2125. [  4%] Building CXX object VTK/ThirdParty/verdict/vtkverdict/CMakeFiles/verdict.dir/VerdictVector.cpp.o
  2126. [  4%] Building CXX object VTK/ThirdParty/verdict/vtkverdict/CMakeFiles/verdict.dir/V_WedgeMetric.cpp.o
  2127. Linking CXX shared library ../../../../lib/libvtkverdict-pv3.98.so
  2128. [  4%] Built target verdict
  2129. Scanning dependencies of target vtkgl2ps
  2130. [  4%] Building C object VTK/ThirdParty/gl2ps/vtkgl2ps/CMakeFiles/vtkgl2ps.dir/gl2ps.c.o
  2131. [  4%] Building C object VTK/ThirdParty/netcdf/vtknetcdf/CMakeFiles/vtkNetCDF.dir/libsrc/attr.c.o
  2132. [  4%] Building C object VTK/ThirdParty/netcdf/vtknetcdf/CMakeFiles/vtkNetCDF.dir/libsrc/nc3dispatch.c.o
  2133. [  4%] Building C object VTK/ThirdParty/netcdf/vtknetcdf/CMakeFiles/vtkNetCDF.dir/libsrc/nc.c.o
  2134. [  4%] Building C object VTK/ThirdParty/netcdf/vtknetcdf/CMakeFiles/vtkNetCDF.dir/libsrc/var.c.o
  2135. [  4%] Building C object VTK/ThirdParty/netcdf/vtknetcdf/CMakeFiles/vtkNetCDF.dir/libsrc/dim.c.o
  2136. [  4%] Building C object VTK/ThirdParty/netcdf/vtknetcdf/CMakeFiles/vtkNetCDF.dir/libsrc/ncx.c.o
  2137. [  4%] Building C object VTK/ThirdParty/netcdf/vtknetcdf/CMakeFiles/vtkNetCDF.dir/libsrc/lookup3.c.o
  2138. [  4%] Building C object VTK/ThirdParty/netcdf/vtknetcdf/CMakeFiles/vtkNetCDF.dir/libsrc/posixio.c.o
  2139. Linking C shared library ../../../../lib/libvtkgl2ps-pv3.98.so
  2140. [  4%] Built target vtkgl2ps
  2141. Scanning dependencies of target VPIC
  2142. [  4%] Building CXX object VTK/ThirdParty/VPIC/CMakeFiles/VPIC.dir/VPICDataSet.cxx.o
  2143. [  4%] Building C object VTK/ThirdParty/netcdf/vtknetcdf/CMakeFiles/vtkNetCDF.dir/libsrc4/error4.c.o
  2144. [  4%] Building C object VTK/ThirdParty/netcdf/vtknetcdf/CMakeFiles/vtkNetCDF.dir/libsrc4/nc4dispatch.c.o
  2145. [  4%] Building C object VTK/ThirdParty/netcdf/vtknetcdf/CMakeFiles/vtkNetCDF.dir/libsrc4/nc4attr.c.o
  2146. [  4%] Building CXX object VTK/ThirdParty/VPIC/CMakeFiles/VPIC.dir/VPICDefinition.cxx.o
  2147. [  4%] Building C object VTK/ThirdParty/netcdf/vtknetcdf/CMakeFiles/vtkNetCDF.dir/libsrc4/nc4dim.c.o
  2148. [  4%] Building CXX object VTK/ThirdParty/VPIC/CMakeFiles/VPIC.dir/VPICGlobal.cxx.o
  2149. [  4%] Building C object VTK/ThirdParty/netcdf/vtknetcdf/CMakeFiles/vtkNetCDF.dir/libsrc4/nc4file.c.o
  2150. [  4%] Building C object VTK/ThirdParty/netcdf/vtknetcdf/CMakeFiles/vtkNetCDF.dir/libsrc4/nc4grp.c.o
  2151. [  4%] Building C object VTK/ThirdParty/netcdf/vtknetcdf/CMakeFiles/vtkNetCDF.dir/libsrc4/nc4type.c.o
  2152. [  4%] Building C object VTK/ThirdParty/netcdf/vtknetcdf/CMakeFiles/vtkNetCDF.dir/libsrc4/nc4var.c.o
  2153. [  4%] Building C object VTK/ThirdParty/netcdf/vtknetcdf/CMakeFiles/vtkNetCDF.dir/libsrc4/ncfunc.c.o
  2154. [  4%] Building C object VTK/ThirdParty/netcdf/vtknetcdf/CMakeFiles/vtkNetCDF.dir/libsrc4/nc4internal.c.o
  2155. [  4%] Building CXX object VTK/ThirdParty/VPIC/CMakeFiles/VPIC.dir/VPICHeader.cxx.o
  2156. [  4%] Building C object VTK/ThirdParty/netcdf/vtknetcdf/CMakeFiles/vtkNetCDF.dir/libsrc4/nc4hdf.c.o
  2157. [  4%] Building CXX object VTK/ThirdParty/VPIC/CMakeFiles/VPIC.dir/VPICPart.cxx.o
  2158. [  4%] Building CXX object VTK/ThirdParty/VPIC/CMakeFiles/VPIC.dir/VPICView.cxx.o
  2159. [  4%] Building CXX object VTK/ThirdParty/VPIC/CMakeFiles/VPIC.dir/GridExchange.cxx.o
  2160. [  4%] Building C object VTK/ThirdParty/netcdf/vtknetcdf/CMakeFiles/vtkNetCDF.dir/libdispatch/parallel.c.o
  2161. [  4%] Building C object VTK/ThirdParty/netcdf/vtknetcdf/CMakeFiles/vtkNetCDF.dir/libdispatch/copy.c.o
  2162. [  4%] Building C object VTK/ThirdParty/netcdf/vtknetcdf/CMakeFiles/vtkNetCDF.dir/libdispatch/file.c.o
  2163. [  4%] Building C object VTK/ThirdParty/netcdf/vtknetcdf/CMakeFiles/vtkNetCDF.dir/libdispatch/dim.c.o
  2164. [  4%] Building C object VTK/ThirdParty/netcdf/vtknetcdf/CMakeFiles/vtkNetCDF.dir/libdispatch/att.c.o
  2165. [  4%] Building C object VTK/ThirdParty/netcdf/vtknetcdf/CMakeFiles/vtkNetCDF.dir/libdispatch/error.c.o
  2166. Linking CXX shared library ../../../lib/libvtkVPIC-pv3.98.so
  2167. [  4%] Building C object VTK/ThirdParty/netcdf/vtknetcdf/CMakeFiles/vtkNetCDF.dir/libdispatch/var.c.o
  2168. [  4%] Built target VPIC
  2169. Scanning dependencies of target vtkxdmf2
  2170. [  4%] Building CXX object VTK/ThirdParty/xdmf2/vtkxdmf2/libsrc/CMakeFiles/vtkxdmf2.dir/XdmfArray.cxx.o
  2171. [  4%] Building C object VTK/ThirdParty/netcdf/vtknetcdf/CMakeFiles/vtkNetCDF.dir/libdispatch/dispatch.c.o
  2172. [  4%] Building C object VTK/ThirdParty/netcdf/vtknetcdf/CMakeFiles/vtkNetCDF.dir/libdispatch/nc_url.c.o
  2173. [  4%] Building C object VTK/ThirdParty/netcdf/vtknetcdf/CMakeFiles/vtkNetCDF.dir/libdispatch/nclist.c.o
  2174. [  4%] Building C object VTK/ThirdParty/netcdf/vtknetcdf/CMakeFiles/vtkNetCDF.dir/libdispatch/ncbytes.c.o
  2175. [  4%] Building C object VTK/ThirdParty/netcdf/vtknetcdf/CMakeFiles/vtkNetCDF.dir/libdispatch/nc4.c.o
  2176. [  4%] Building C object VTK/ThirdParty/netcdf/vtknetcdf/CMakeFiles/vtkNetCDF.dir/liblib/stub.c.o
  2177. Linking C shared library ../../../../lib/libvtkNetCDF-pv3.98.so
  2178. [  4%] Built target vtkNetCDF
  2179. Scanning dependencies of target IceTCore
  2180. [  4%] Building C object ThirdParty/IceT/vtkicet/src/ice-t/CMakeFiles/IceTCore.dir/porting.c.o
  2181. [  4%] Building C object ThirdParty/IceT/vtkicet/src/ice-t/CMakeFiles/IceTCore.dir/context.c.o
  2182. [  4%] Building C object ThirdParty/IceT/vtkicet/src/ice-t/CMakeFiles/IceTCore.dir/state.c.o
  2183. [  4%] Building C object ThirdParty/IceT/vtkicet/src/ice-t/CMakeFiles/IceTCore.dir/diagnostics.c.o
  2184. [  4%] Building C object ThirdParty/IceT/vtkicet/src/ice-t/CMakeFiles/IceTCore.dir/communication.c.o
  2185. [  4%] Building C object ThirdParty/IceT/vtkicet/src/ice-t/CMakeFiles/IceTCore.dir/tiles.c.o
  2186. [  4%] Building C object ThirdParty/IceT/vtkicet/src/ice-t/CMakeFiles/IceTCore.dir/timing.c.o
  2187. [  4%] Building C object ThirdParty/IceT/vtkicet/src/ice-t/CMakeFiles/IceTCore.dir/matrix.c.o
  2188. [  4%] Building C object ThirdParty/IceT/vtkicet/src/ice-t/CMakeFiles/IceTCore.dir/projections.c.o
  2189. [  4%] Building C object ThirdParty/IceT/vtkicet/src/ice-t/CMakeFiles/IceTCore.dir/draw.c.o
  2190. [  4%] Building CXX object VTK/ThirdParty/xdmf2/vtkxdmf2/libsrc/CMakeFiles/vtkxdmf2.dir/XdmfDOM.cxx.o
  2191. [  4%] Building C object ThirdParty/IceT/vtkicet/src/ice-t/CMakeFiles/IceTCore.dir/image.c.o
  2192. [  4%] Building CXX object VTK/ThirdParty/xdmf2/vtkxdmf2/libsrc/CMakeFiles/vtkxdmf2.dir/XdmfDataDesc.cxx.o
  2193. [  4%] Building C object ThirdParty/IceT/vtkicet/src/ice-t/CMakeFiles/IceTCore.dir/__/strategies/common.c.o
  2194. [  4%] Building C object ThirdParty/IceT/vtkicet/src/ice-t/CMakeFiles/IceTCore.dir/__/strategies/select.c.o
  2195. [  4%] Building C object ThirdParty/IceT/vtkicet/src/ice-t/CMakeFiles/IceTCore.dir/__/strategies/direct.c.o
  2196. [  4%] Building CXX object VTK/ThirdParty/xdmf2/vtkxdmf2/libsrc/CMakeFiles/vtkxdmf2.dir/XdmfExpression.cxx.o
  2197. [  4%] Building C object ThirdParty/IceT/vtkicet/src/ice-t/CMakeFiles/IceTCore.dir/__/strategies/sequential.c.o
  2198. [  4%] Building C object ThirdParty/IceT/vtkicet/src/ice-t/CMakeFiles/IceTCore.dir/__/strategies/split.c.o
  2199. [  4%] Building C object ThirdParty/IceT/vtkicet/src/ice-t/CMakeFiles/IceTCore.dir/__/strategies/reduce.c.o
  2200. [  4%] Building C object ThirdParty/IceT/vtkicet/src/ice-t/CMakeFiles/IceTCore.dir/__/strategies/vtree.c.o
  2201. [  4%] Building C object ThirdParty/IceT/vtkicet/src/ice-t/CMakeFiles/IceTCore.dir/__/strategies/bswap.c.o
  2202. [  4%] Building C object ThirdParty/IceT/vtkicet/src/ice-t/CMakeFiles/IceTCore.dir/__/strategies/radixk.c.o
  2203. [  4%] Building CXX object VTK/ThirdParty/xdmf2/vtkxdmf2/libsrc/CMakeFiles/vtkxdmf2.dir/XdmfValues.cxx.o
  2204. [  4%] Building C object ThirdParty/IceT/vtkicet/src/ice-t/CMakeFiles/IceTCore.dir/__/strategies/tree.c.o
  2205. [  4%] Building C object ThirdParty/IceT/vtkicet/src/ice-t/CMakeFiles/IceTCore.dir/__/strategies/automatic.c.o
  2206. Linking C shared library ../../../../../lib/libIceTCore.so
  2207. [  4%] Built target IceTCore
  2208. Scanning dependencies of target paraview_pyc
  2209. [  4%] Generating ../../lib/site-packages/paraview/pv_compile_complete
  2210. Listing /home/martin/temp/paraview/src/build/lib/site-packages/paraview ...
  2211. Compiling /home/martin/temp/paraview/src/build/lib/site-packages/paraview/__init__.py ...
  2212. Compiling /home/martin/temp/paraview/src/build/lib/site-packages/paraview/annotation.py ...
  2213. Compiling /home/martin/temp/paraview/src/build/lib/site-packages/paraview/benchmark.py ...
  2214. Compiling /home/martin/temp/paraview/src/build/lib/site-packages/paraview/collaboration.py ...
  2215. Compiling /home/martin/temp/paraview/src/build/lib/site-packages/paraview/compile_all_pv.py ...
  2216. Listing /home/martin/temp/paraview/src/build/lib/site-packages/paraview/demos ...
  2217. Compiling /home/martin/temp/paraview/src/build/lib/site-packages/paraview/demos/demo1.py ...
  2218. Compiling /home/martin/temp/paraview/src/build/lib/site-packages/paraview/demos/show_grid_as_background.py ...
  2219. Compiling /home/martin/temp/paraview/src/build/lib/site-packages/paraview/extract_selection.py ...
  2220. Compiling /home/martin/temp/paraview/src/build/lib/site-packages/paraview/numeric.py ...
  2221. Compiling /home/martin/temp/paraview/src/build/lib/site-packages/paraview/numpy_support.py ...
  2222. Compiling /home/martin/temp/paraview/src/build/lib/site-packages/paraview/pvfilters.py ...
  2223. Compiling /home/martin/temp/paraview/src/build/lib/site-packages/paraview/pvvtkextensions.py ...
  2224. Compiling /home/martin/temp/paraview/src/build/lib/site-packages/paraview/servermanager.py ...
  2225. Compiling /home/martin/temp/paraview/src/build/lib/site-packages/paraview/simple.py ...
  2226. Compiling /home/martin/temp/paraview/src/build/lib/site-packages/paraview/smstate.py ...
  2227. Compiling /home/martin/temp/paraview/src/build/lib/site-packages/paraview/smtrace.py ...
  2228. Compiling /home/martin/temp/paraview/src/build/lib/site-packages/paraview/util.py ...
  2229. Compiling /home/martin/temp/paraview/src/build/lib/site-packages/paraview/variant.py ...
  2230. Listing /home/martin/temp/paraview/src/build/lib/site-packages/paraview/vtk ...
  2231. Compiling /home/martin/temp/paraview/src/build/lib/site-packages/paraview/vtk/__init__.py ...
  2232. Compiling /home/martin/temp/paraview/src/build/lib/site-packages/paraview/vtk/algorithms.py ...
  2233. Compiling /home/martin/temp/paraview/src/build/lib/site-packages/paraview/vtk/dataset_adapter.py ...
  2234. Listing /home/martin/temp/paraview/src/build/lib/site-packages/paraview/vtk/gtk ...
  2235. Listing /home/martin/temp/paraview/src/build/lib/site-packages/paraview/vtk/qt ...
  2236. Listing /home/martin/temp/paraview/src/build/lib/site-packages/paraview/vtk/qt4 ...
  2237. Listing /home/martin/temp/paraview/src/build/lib/site-packages/paraview/vtk/test ...
  2238. Listing /home/martin/temp/paraview/src/build/lib/site-packages/paraview/vtk/tk ...
  2239. Listing /home/martin/temp/paraview/src/build/lib/site-packages/paraview/vtk/util ...
  2240. Compiling /home/martin/temp/paraview/src/build/lib/site-packages/paraview/vtk/vtkChartsCore.py ...
  2241. Compiling /home/martin/temp/paraview/src/build/lib/site-packages/paraview/vtk/vtkCommonColor.py ...
  2242. Compiling /home/martin/temp/paraview/src/build/lib/site-packages/paraview/vtk/vtkCommonComputationalGeometry.py ...
  2243. Compiling /home/martin/temp/paraview/src/build/lib/site-packages/paraview/vtk/vtkCommonCore.py ...
  2244. Compiling /home/martin/temp/paraview/src/build/lib/site-packages/paraview/vtk/vtkCommonDataModel.py ...
  2245. Compiling /home/martin/temp/paraview/src/build/lib/site-packages/paraview/vtk/vtkCommonExecutionModel.py ...
  2246. Compiling /home/martin/temp/paraview/src/build/lib/site-packages/paraview/vtk/vtkCommonMath.py ...
  2247. Compiling /home/martin/temp/paraview/src/build/lib/site-packages/paraview/vtk/vtkCommonMisc.py ...
  2248. Compiling /home/martin/temp/paraview/src/build/lib/site-packages/paraview/vtk/vtkCommonSystem.py ...
  2249. Compiling /home/martin/temp/paraview/src/build/lib/site-packages/paraview/vtk/vtkCommonTransforms.py ...
  2250. Compiling /home/martin/temp/paraview/src/build/lib/site-packages/paraview/vtk/vtkDomainsChemistry.py ...
  2251. Compiling /home/martin/temp/paraview/src/build/lib/site-packages/paraview/vtk/vtkFiltersAMR.py ...
  2252. Compiling /home/martin/temp/paraview/src/build/lib/site-packages/paraview/vtk/vtkFiltersCore.py ...
  2253. Compiling /home/martin/temp/paraview/src/build/lib/site-packages/paraview/vtk/vtkFiltersCosmo.py ...
  2254. Compiling /home/martin/temp/paraview/src/build/lib/site-packages/paraview/vtk/vtkFiltersExtraction.py ...
  2255. Compiling /home/martin/temp/paraview/src/build/lib/site-packages/paraview/vtk/vtkFiltersFlowPaths.py ...
  2256. Compiling /home/martin/temp/paraview/src/build/lib/site-packages/paraview/vtk/vtkFiltersGeneral.py ...
  2257. Compiling /home/martin/temp/paraview/src/build/lib/site-packages/paraview/vtk/vtkFiltersGeneric.py ...
  2258. Compiling /home/martin/temp/paraview/src/build/lib/site-packages/paraview/vtk/vtkFiltersGeometry.py ...
  2259. Compiling /home/martin/temp/paraview/src/build/lib/site-packages/paraview/vtk/vtkFiltersHybrid.py ...
  2260. Compiling /home/martin/temp/paraview/src/build/lib/site-packages/paraview/vtk/vtkFiltersHyperTree.py ...
  2261. Compiling /home/martin/temp/paraview/src/build/lib/site-packages/paraview/vtk/vtkFiltersImaging.py ...
  2262. Compiling /home/martin/temp/paraview/src/build/lib/site-packages/paraview/vtk/vtkFiltersModeling.py ...
  2263. Compiling /home/martin/temp/paraview/src/build/lib/site-packages/paraview/vtk/vtkFiltersParallel.py ...
  2264. Compiling /home/martin/temp/paraview/src/build/lib/site-packages/paraview/vtk/vtkFiltersParallelFlowPaths.py ...
  2265. Compiling /home/martin/temp/paraview/src/build/lib/site-packages/paraview/vtk/vtkFiltersParallelImaging.py ...
  2266. Compiling /home/martin/temp/paraview/src/build/lib/site-packages/paraview/vtk/vtkFiltersParallelMPI.py ...
  2267. Compiling /home/martin/temp/paraview/src/build/lib/site-packages/paraview/vtk/vtkFiltersParallelStatistics.py ...
  2268. Compiling /home/martin/temp/paraview/src/build/lib/site-packages/paraview/vtk/vtkFiltersProgrammable.py ...
  2269. Compiling /home/martin/temp/paraview/src/build/lib/site-packages/paraview/vtk/vtkFiltersSources.py ...
  2270. Compiling /home/martin/temp/paraview/src/build/lib/site-packages/paraview/vtk/vtkFiltersStatistics.py ...
  2271. Compiling /home/martin/temp/paraview/src/build/lib/site-packages/paraview/vtk/vtkFiltersTexture.py ...
  2272. Compiling /home/martin/temp/paraview/src/build/lib/site-packages/paraview/vtk/vtkFiltersVerdict.py ...
  2273. Compiling /home/martin/temp/paraview/src/build/lib/site-packages/paraview/vtk/vtkIOAMR.py ...
  2274. Compiling /home/martin/temp/paraview/src/build/lib/site-packages/paraview/vtk/vtkIOCore.py ...
  2275. Compiling /home/martin/temp/paraview/src/build/lib/site-packages/paraview/vtk/vtkIOEnSight.py ...
  2276. Compiling /home/martin/temp/paraview/src/build/lib/site-packages/paraview/vtk/vtkIOExodus.py ...
  2277. Compiling /home/martin/temp/paraview/src/build/lib/site-packages/paraview/vtk/vtkIOExport.py ...
  2278. Compiling /home/martin/temp/paraview/src/build/lib/site-packages/paraview/vtk/vtkIOFFMPEG.py ...
  2279. Compiling /home/martin/temp/paraview/src/build/lib/site-packages/paraview/vtk/vtkIOGeometry.py ...
  2280. Compiling /home/martin/temp/paraview/src/build/lib/site-packages/paraview/vtk/vtkIOImage.py ...
  2281. Compiling /home/martin/temp/paraview/src/build/lib/site-packages/paraview/vtk/vtkIOImport.py ...
  2282. Compiling /home/martin/temp/paraview/src/build/lib/site-packages/paraview/vtk/vtkIOInfovis.py ...
  2283. Compiling /home/martin/temp/paraview/src/build/lib/site-packages/paraview/vtk/vtkIOLSDyna.py ...
  2284. Compiling /home/martin/temp/paraview/src/build/lib/site-packages/paraview/vtk/vtkIOLegacy.py ...
  2285. Compiling /home/martin/temp/paraview/src/build/lib/site-packages/paraview/vtk/vtkIOMPIImage.py ...
  2286. Compiling /home/martin/temp/paraview/src/build/lib/site-packages/paraview/vtk/vtkIOMovie.py ...
  2287. Compiling /home/martin/temp/paraview/src/build/lib/site-packages/paraview/vtk/vtkIONetCDF.py ...
  2288. Compiling /home/martin/temp/paraview/src/build/lib/site-packages/paraview/vtk/vtkIOPLY.py ...
  2289. Compiling /home/martin/temp/paraview/src/build/lib/site-packages/paraview/vtk/vtkIOParallel.py ...
  2290. Compiling /home/martin/temp/paraview/src/build/lib/site-packages/paraview/vtk/vtkIOParallelExodus.py ...
  2291. Compiling /home/martin/temp/paraview/src/build/lib/site-packages/paraview/vtk/vtkIOParallelLSDyna.py ...
  2292. Compiling /home/martin/temp/paraview/src/build/lib/site-packages/paraview/vtk/vtkIOParallelNetCDF.py ...
  2293. Compiling /home/martin/temp/paraview/src/build/lib/site-packages/paraview/vtk/vtkIOVPIC.py ...
  2294. Compiling /home/martin/temp/paraview/src/build/lib/site-packages/paraview/vtk/vtkIOVisItBridge.py ...
  2295. Compiling /home/martin/temp/paraview/src/build/lib/site-packages/paraview/vtk/vtkIOXML.py ...
  2296. Compiling /home/martin/temp/paraview/src/build/lib/site-packages/paraview/vtk/vtkIOXMLParser.py ...
  2297. Compiling /home/martin/temp/paraview/src/build/lib/site-packages/paraview/vtk/vtkIOXdmf2.py ...
  2298. Compiling /home/martin/temp/paraview/src/build/lib/site-packages/paraview/vtk/vtkImagingColor.py ...
  2299. Compiling /home/martin/temp/paraview/src/build/lib/site-packages/paraview/vtk/vtkImagingCore.py ...
  2300. Compiling /home/martin/temp/paraview/src/build/lib/site-packages/paraview/vtk/vtkImagingFourier.py ...
  2301. Compiling /home/martin/temp/paraview/src/build/lib/site-packages/paraview/vtk/vtkImagingGeneral.py ...
  2302. Compiling /home/martin/temp/paraview/src/build/lib/site-packages/paraview/vtk/vtkImagingHybrid.py ...
  2303. Compiling /home/martin/temp/paraview/src/build/lib/site-packages/paraview/vtk/vtkImagingMorphological.py ...
  2304. Compiling /home/martin/temp/paraview/src/build/lib/site-packages/paraview/vtk/vtkImagingSources.py ...
  2305. Compiling /home/martin/temp/paraview/src/build/lib/site-packages/paraview/vtk/vtkInfovisCore.py ...
  2306. Compiling /home/martin/temp/paraview/src/build/lib/site-packages/paraview/vtk/vtkInteractionImage.py ...
  2307. Compiling /home/martin/temp/paraview/src/build/lib/site-packages/paraview/vtk/vtkInteractionStyle.py ...
  2308. Compiling /home/martin/temp/paraview/src/build/lib/site-packages/paraview/vtk/vtkInteractionWidgets.py ...
  2309. Compiling /home/martin/temp/paraview/src/build/lib/site-packages/paraview/vtk/vtkPVClientServerCoreCore.py ...
  2310. Compiling /home/martin/temp/paraview/src/build/lib/site-packages/paraview/vtk/vtkPVClientServerCoreDefault.py ...
  2311. Compiling /home/martin/temp/paraview/src/build/lib/site-packages/paraview/vtk/vtkPVClientServerCoreRendering.py ...
  2312. Compiling /home/martin/temp/paraview/src/build/lib/site-packages/paraview/vtk/vtkPVCommon.py ...
  2313. Compiling /home/martin/temp/paraview/src/build/lib/site-packages/paraview/vtk/vtkPVServerImplementationCore.py ...
  2314. Compiling /home/martin/temp/paraview/src/build/lib/site-packages/paraview/vtk/vtkPVServerImplementationDefault.py ...
  2315. Compiling /home/martin/temp/paraview/src/build/lib/site-packages/paraview/vtk/vtkPVServerImplementationRendering.py ...
  2316. Compiling /home/martin/temp/paraview/src/build/lib/site-packages/paraview/vtk/vtkPVServerManagerCore.py ...
  2317. Compiling /home/martin/temp/paraview/src/build/lib/site-packages/paraview/vtk/vtkPVServerManagerRendering.py ...
  2318. Compiling /home/martin/temp/paraview/src/build/lib/site-packages/paraview/vtk/vtkPVVTKExtensionsCore.py ...
  2319. Compiling /home/martin/temp/paraview/src/build/lib/site-packages/paraview/vtk/vtkPVVTKExtensionsDefault.py ...
  2320. Compiling /home/martin/temp/paraview/src/build/lib/site-packages/paraview/vtk/vtkPVVTKExtensionsRendering.py ...
  2321. Compiling /home/martin/temp/paraview/src/build/lib/site-packages/paraview/vtk/vtkPVVTKExtensionsWebGLExporter.py ...
  2322. Compiling /home/martin/temp/paraview/src/build/lib/site-packages/paraview/vtk/vtkParallelCore.py ...
  2323. Compiling /home/martin/temp/paraview/src/build/lib/site-packages/paraview/vtk/vtkParallelMPI.py ...
  2324. Compiling /home/martin/temp/paraview/src/build/lib/site-packages/paraview/vtk/vtkRenderingAnnotation.py ...
  2325. Compiling /home/martin/temp/paraview/src/build/lib/site-packages/paraview/vtk/vtkRenderingContext2D.py ...
  2326. Compiling /home/martin/temp/paraview/src/build/lib/site-packages/paraview/vtk/vtkRenderingCore.py ...
  2327. Compiling /home/martin/temp/paraview/src/build/lib/site-packages/paraview/vtk/vtkRenderingFreeType.py ...
  2328. Compiling /home/martin/temp/paraview/src/build/lib/site-packages/paraview/vtk/vtkRenderingFreeTypeOpenGL.py ...
  2329. Compiling /home/martin/temp/paraview/src/build/lib/site-packages/paraview/vtk/vtkRenderingGL2PS.py ...
  2330. Compiling /home/martin/temp/paraview/src/build/lib/site-packages/paraview/vtk/vtkRenderingLabel.py ...
  2331. Compiling /home/martin/temp/paraview/src/build/lib/site-packages/paraview/vtk/vtkRenderingOpenGL.py ...
  2332. Compiling /home/martin/temp/paraview/src/build/lib/site-packages/paraview/vtk/vtkRenderingParallel.py ...
  2333. Compiling /home/martin/temp/paraview/src/build/lib/site-packages/paraview/vtk/vtkRenderingVolume.py ...
  2334. Compiling /home/martin/temp/paraview/src/build/lib/site-packages/paraview/vtk/vtkRenderingVolumeAMR.py ...
  2335. Compiling /home/martin/temp/paraview/src/build/lib/site-packages/paraview/vtk/vtkRenderingVolumeOpenGL.py ...
  2336. Compiling /home/martin/temp/paraview/src/build/lib/site-packages/paraview/vtk/vtkViewsContext2D.py ...
  2337. Compiling /home/martin/temp/paraview/src/build/lib/site-packages/paraview/vtk/vtkViewsCore.py ...
  2338. Listing /home/martin/temp/paraview/src/build/lib/site-packages/paraview/vtk/wx ...
  2339. Compiling /home/martin/temp/paraview/src/build/lib/site-packages/paraview/vtkConstants.py ...
  2340. [  4%] Built target paraview_pyc
  2341. [  4%] Generating Documentation HTMLs from xmls
  2342. [  4%] Building CXX object VTK/ThirdParty/xdmf2/vtkxdmf2/libsrc/CMakeFiles/vtkxdmf2.dir/XdmfValuesXML.cxx.o
  2343. [  4%] Building CXX object VTK/ThirdParty/xdmf2/vtkxdmf2/libsrc/CMakeFiles/vtkxdmf2.dir/XdmfValuesHDF.cxx.o
  2344. [  4%] Building CXX object VTK/ThirdParty/xdmf2/vtkxdmf2/libsrc/CMakeFiles/vtkxdmf2.dir/XdmfValuesBinary.cxx.o
  2345. [  4%] Building CXX object VTK/ThirdParty/xdmf2/vtkxdmf2/libsrc/CMakeFiles/vtkxdmf2.dir/XdmfHeavyData.cxx.o
  2346. [  4%] Building CXX object VTK/ThirdParty/xdmf2/vtkxdmf2/libsrc/CMakeFiles/vtkxdmf2.dir/XdmfHDF.cxx.o
  2347. [  4%] Building CXX object VTK/ThirdParty/xdmf2/vtkxdmf2/libsrc/CMakeFiles/vtkxdmf2.dir/XdmfHDFSupport.cxx.o
  2348. Processing wiki sources
  2349. Processing wiki filters
  2350. [  4%] Building CXX object VTK/ThirdParty/xdmf2/vtkxdmf2/libsrc/CMakeFiles/vtkxdmf2.dir/XdmfLightData.cxx.o
  2351. [  4%] Building CXX object VTK/ThirdParty/xdmf2/vtkxdmf2/libsrc/CMakeFiles/vtkxdmf2.dir/XdmfInformation.cxx.o
  2352. Processing wiki writers
  2353. Processing wiki readers
  2354. [  4%] Building CXX object VTK/ThirdParty/xdmf2/vtkxdmf2/libsrc/CMakeFiles/vtkxdmf2.dir/XdmfDataItem.cxx.o
  2355. [  4%] Compiling Qt help project paraview.qhp
  2356. [  4%] Building CXX object VTK/ThirdParty/xdmf2/vtkxdmf2/libsrc/CMakeFiles/vtkxdmf2.dir/XdmfDataStructure.cxx.o
  2357. Dateistruktur wird erzeugt...
  2358. Benutzerdefinierte Filter einfügen...
  2359. Hilfe-Daten für Filter-Sektion (1 von 1) einfügen...
  2360. Dateien einfügen...
  2361. Warnung: Die Datei /home/martin/temp/paraview/src/build/Applications/ParaView/Documentation/*.jpg existiert nicht. Wird übersprungen.
  2362. Warnung: Die Datei /home/martin/temp/paraview/src/build/Applications/ParaView/Documentation/Book/*.css existiert nicht. Wird übersprungen.
  2363. Warnung: Die Datei /home/martin/temp/paraview/src/build/Applications/ParaView/Documentation/Book/*.jpg existiert nicht. Wird übersprungen.
  2364. Inhalt einfügen...
  2365. Indizes einfügen...
  2366. Dokumentation erfolgreich generiert.
  2367. [  4%] Generating qrc_paraview_documentation.cxx
  2368. [  4%] Building CXX object VTK/ThirdParty/xdmf2/vtkxdmf2/libsrc/CMakeFiles/vtkxdmf2.dir/XdmfDataTransform.cxx.o
  2369. [  4%] Building CXX object VTK/ThirdParty/xdmf2/vtkxdmf2/libsrc/CMakeFiles/vtkxdmf2.dir/XdmfElement.cxx.o
  2370. Scanning dependencies of target vtkParaViewDocumentation
  2371. [  4%] Building CXX object Applications/ParaView/Documentation/CMakeFiles/vtkParaViewDocumentation.dir/ParaViewDocumentationInitializer.cxx.o
  2372. [  4%] Building CXX object VTK/ThirdParty/xdmf2/vtkxdmf2/libsrc/CMakeFiles/vtkxdmf2.dir/XdmfObject.cxx.o
  2373. [  4%] Building CXX object Applications/ParaView/Documentation/CMakeFiles/vtkParaViewDocumentation.dir/qrc_paraview_documentation.cxx.o
  2374. [  4%] Building CXX object VTK/ThirdParty/xdmf2/vtkxdmf2/libsrc/CMakeFiles/vtkxdmf2.dir/XdmfExprLex.cxx.o
  2375. [  4%] Building CXX object VTK/ThirdParty/xdmf2/vtkxdmf2/libsrc/CMakeFiles/vtkxdmf2.dir/XdmfExprYacc.cxx.o
  2376. [  4%] Building CXX object VTK/ThirdParty/xdmf2/vtkxdmf2/libsrc/CMakeFiles/vtkxdmf2.dir/XdmfRoot.cxx.o
  2377. [  4%] Building CXX object VTK/ThirdParty/xdmf2/vtkxdmf2/libsrc/CMakeFiles/vtkxdmf2.dir/XdmfDomain.cxx.o
  2378. [  4%] Building CXX object VTK/ThirdParty/xdmf2/vtkxdmf2/libsrc/CMakeFiles/vtkxdmf2.dir/XdmfAttribute.cxx.o
  2379. [  4%] Building CXX object VTK/ThirdParty/xdmf2/vtkxdmf2/libsrc/CMakeFiles/vtkxdmf2.dir/XdmfGrid.cxx.o
  2380. [  4%] Building CXX object VTK/ThirdParty/xdmf2/vtkxdmf2/libsrc/CMakeFiles/vtkxdmf2.dir/XdmfTopology.cxx.o
  2381. [  4%] Building CXX object VTK/ThirdParty/xdmf2/vtkxdmf2/libsrc/CMakeFiles/vtkxdmf2.dir/XdmfTime.cxx.o
  2382. [  4%] Building CXX object VTK/ThirdParty/xdmf2/vtkxdmf2/libsrc/CMakeFiles/vtkxdmf2.dir/XdmfRegion.cxx.o
  2383. [  4%] Building CXX object VTK/ThirdParty/xdmf2/vtkxdmf2/libsrc/CMakeFiles/vtkxdmf2.dir/XdmfSet.cxx.o
  2384. Linking CXX static library ../../../lib/libvtkParaViewDocumentation.a
  2385. [  4%] Building CXX object VTK/ThirdParty/xdmf2/vtkxdmf2/libsrc/CMakeFiles/vtkxdmf2.dir/XdmfMap.cxx.o
  2386. [  4%] Built target vtkParaViewDocumentation
  2387. Scanning dependencies of target paraview_mpi_pyc
  2388. [  4%] source copy
  2389. [  4%] source copy
  2390. [  4%] source copy
  2391. [  4%] source copy
  2392. [  4%] source copy
  2393. [  4%] source copy
  2394. [  4%] source copy
  2395. [  4%] source copy
  2396. [  4%] source copy
  2397. [  4%] source copy
  2398. [  4%] source copy
  2399. [  4%] Generating mpi4py/pv_mpi_compile_complete
  2400. Listing /home/martin/temp/paraview/src/build/Utilities/mpi4py/mpi4py ...
  2401. Compiling /home/martin/temp/paraview/src/build/Utilities/mpi4py/mpi4py/MPI.py ...
  2402. Compiling /home/martin/temp/paraview/src/build/Utilities/mpi4py/mpi4py/__init__.py ...
  2403. Compiling /home/martin/temp/paraview/src/build/Utilities/mpi4py/mpi4py/compile_all_pv_mpi.py ...
  2404. Listing /home/martin/temp/paraview/src/build/Utilities/mpi4py/mpi4py/include ...
  2405. Listing /home/martin/temp/paraview/src/build/Utilities/mpi4py/mpi4py/include/mpi4py ...
  2406. Compiling /home/martin/temp/paraview/src/build/Utilities/mpi4py/mpi4py/rc.py ...
  2407. [  4%] Built target paraview_mpi_pyc
  2408. Scanning dependencies of target MPIPython
  2409. [  4%] [  4%] Building CXX object VTK/ThirdParty/xdmf2/vtkxdmf2/libsrc/CMakeFiles/vtkxdmf2.dir/XdmfGeometry.cxx.o
  2410. Building C object Utilities/mpi4py/Library/CMakeFiles/MPIPython.dir/MPI.c.o
  2411. [  4%] Building CXX object VTK/ThirdParty/xdmf2/vtkxdmf2/libsrc/CMakeFiles/vtkxdmf2.dir/XdmfH5Driver.cxx.o
  2412. [  4%] Building CXX object VTK/ThirdParty/xdmf2/vtkxdmf2/libsrc/CMakeFiles/vtkxdmf2.dir/XdmfDsm.cxx.o
  2413. [  4%] Building CXX object VTK/ThirdParty/xdmf2/vtkxdmf2/libsrc/CMakeFiles/vtkxdmf2.dir/XdmfDsmBuffer.cxx.o
  2414. [  4%] Building CXX object VTK/ThirdParty/xdmf2/vtkxdmf2/libsrc/CMakeFiles/vtkxdmf2.dir/XdmfDsmComm.cxx.o
  2415. [  5%] Building CXX object VTK/ThirdParty/xdmf2/vtkxdmf2/libsrc/CMakeFiles/vtkxdmf2.dir/XdmfDsmMsg.cxx.o
  2416. Linking CXX shared library ../../../../../lib/libvtkxdmf2-pv3.98.so
  2417. CMakeFiles/vtkxdmf2.dir/XdmfArray.cxx.o: In function `MPI::Win::Set_name(char const*)':
  2418. XdmfArray.cxx:(.text._ZN3MPI3Win8Set_nameEPKc[_ZN3MPI3Win8Set_nameEPKc]+0x5): undefined reference to `MPI_Win_set_name'
  2419. CMakeFiles/vtkxdmf2.dir/XdmfArray.cxx.o: In function `MPI::Win::Set_attr(int, void const*)':
  2420. XdmfArray.cxx:(.text._ZN3MPI3Win8Set_attrEiPKv[_ZN3MPI3Win8Set_attrEiPKv]+0x5): undefined reference to `MPI_Win_set_attr'
  2421. CMakeFiles/vtkxdmf2.dir/XdmfArray.cxx.o: In function `MPI::Win::Get_name(char*, int&) const':
  2422. XdmfArray.cxx:(.text._ZNK3MPI3Win8Get_nameEPcRi[_ZNK3MPI3Win8Get_nameEPcRi]+0x5): undefined reference to `MPI_Win_get_name'
  2423. CMakeFiles/vtkxdmf2.dir/XdmfArray.cxx.o: In function `MPI::Win::Delete_attr(int)':
  2424. XdmfArray.cxx:(.text._ZN3MPI3Win11Delete_attrEi[_ZN3MPI3Win11Delete_attrEi]+0x5): undefined reference to `MPI_Win_delete_attr'
  2425. CMakeFiles/vtkxdmf2.dir/XdmfArray.cxx.o: In function `MPI::Win::Call_errhandler(int) const':
  2426. XdmfArray.cxx:(.text._ZNK3MPI3Win15Call_errhandlerEi[_ZNK3MPI3Win15Call_errhandlerEi]+0x5): undefined reference to `MPI_Win_call_errhandler'
  2427. CMakeFiles/vtkxdmf2.dir/XdmfArray.cxx.o: In function `MPI::Win::Wait() const':
  2428. XdmfArray.cxx:(.text._ZNK3MPI3Win4WaitEv[_ZNK3MPI3Win4WaitEv]+0x5): undefined reference to `MPI_Win_wait'
  2429. CMakeFiles/vtkxdmf2.dir/XdmfArray.cxx.o: In function `MPI::Win::Unlock(int) const':
  2430. XdmfArray.cxx:(.text._ZNK3MPI3Win6UnlockEi[_ZNK3MPI3Win6UnlockEi]+0x9): undefined reference to `MPI_Win_unlock'
  2431. CMakeFiles/vtkxdmf2.dir/XdmfArray.cxx.o: In function `MPI::Win::Test() const':
  2432. XdmfArray.cxx:(.text._ZNK3MPI3Win4TestEv[_ZNK3MPI3Win4TestEv]+0xe): undefined reference to `MPI_Win_test'
  2433. CMakeFiles/vtkxdmf2.dir/XdmfArray.cxx.o: In function `MPI::Win::Start(MPI::Group const&, int) const':
  2434. XdmfArray.cxx:(.text._ZNK3MPI3Win5StartERKNS_5GroupEi[_ZNK3MPI3Win5StartERKNS_5GroupEi]+0xd): undefined reference to `MPI_Win_start'
  2435. CMakeFiles/vtkxdmf2.dir/XdmfArray.cxx.o: In function `MPI::Win::Put(void const*, int, MPI::Datatype const&, int, long, int, MPI::Datatype const&) const':
  2436. XdmfArray.cxx:(.text._ZNK3MPI3Win3PutEPKviRKNS_8DatatypeEiliS5_[_ZNK3MPI3Win3PutEPKviRKNS_8DatatypeEiliS5_]+0x32): undefined reference to `MPI_Put'
  2437. CMakeFiles/vtkxdmf2.dir/XdmfArray.cxx.o: In function `MPI::Win::Post(MPI::Group const&, int) const':
  2438. XdmfArray.cxx:(.text._ZNK3MPI3Win4PostERKNS_5GroupEi[_ZNK3MPI3Win4PostERKNS_5GroupEi]+0xd): undefined reference to `MPI_Win_post'
  2439. CMakeFiles/vtkxdmf2.dir/XdmfArray.cxx.o: In function `MPI::Win::Lock(int, int, int) const':
  2440. XdmfArray.cxx:(.text._ZNK3MPI3Win4LockEiii[_ZNK3MPI3Win4LockEiii]+0xd): undefined reference to `MPI_Win_lock'
  2441. CMakeFiles/vtkxdmf2.dir/XdmfArray.cxx.o: In function `MPI::Win::Get_group() const':
  2442. XdmfArray.cxx:(.text._ZNK3MPI3Win9Get_groupEv[_ZNK3MPI3Win9Get_groupEv]+0x12): undefined reference to `MPI_Win_get_group'
  2443. CMakeFiles/vtkxdmf2.dir/XdmfArray.cxx.o: In function `MPI::Win::Get(void const*, int, MPI::Datatype const&, int, long, int, MPI::Datatype const&) const':
  2444. XdmfArray.cxx:(.text._ZNK3MPI3Win3GetEPKviRKNS_8DatatypeEiliS5_[_ZNK3MPI3Win3GetEPKviRKNS_8DatatypeEiliS5_]+0x32): undefined reference to `MPI_Get'
  2445. CMakeFiles/vtkxdmf2.dir/XdmfArray.cxx.o: In function `MPI::Win::Fence(int) const':
  2446. XdmfArray.cxx:(.text._ZNK3MPI3Win5FenceEi[_ZNK3MPI3Win5FenceEi]+0x9): undefined reference to `MPI_Win_fence'
  2447. CMakeFiles/vtkxdmf2.dir/XdmfArray.cxx.o: In function `MPI::Win::Complete() const':
  2448. XdmfArray.cxx:(.text._ZNK3MPI3Win8CompleteEv[_ZNK3MPI3Win8CompleteEv]+0x5): undefined reference to `MPI_Win_complete'
  2449. CMakeFiles/vtkxdmf2.dir/XdmfArray.cxx.o: In function `MPI::Win::Accumulate(void const*, int, MPI::Datatype const&, int, long, int, MPI::Datatype const&, MPI::Op const&) const':
  2450. XdmfArray.cxx:(.text._ZNK3MPI3Win10AccumulateEPKviRKNS_8DatatypeEiliS5_RKNS_2OpE[_ZNK3MPI3Win10AccumulateEPKviRKNS_8DatatypeEiliS5_RKNS_2OpE]+0x42): undefined reference to `MPI_Accumulate'
  2451. CMakeFiles/vtkxdmf2.dir/XdmfArray.cxx.o: In function `MPI::Win::Set_errhandler(MPI::Errhandler const&) const':
  2452. XdmfArray.cxx:(.text._ZNK3MPI3Win14Set_errhandlerERKNS_10ErrhandlerE[_ZNK3MPI3Win14Set_errhandlerERKNS_10ErrhandlerE]+0x9): undefined reference to `MPI_Win_set_errhandler'
  2453. CMakeFiles/vtkxdmf2.dir/XdmfArray.cxx.o: In function `MPI::Win::Get_errhandler() const':
  2454. XdmfArray.cxx:(.text._ZNK3MPI3Win14Get_errhandlerEv[_ZNK3MPI3Win14Get_errhandlerEv]+0x12): undefined reference to `MPI_Win_get_errhandler'
  2455. CMakeFiles/vtkxdmf2.dir/XdmfArray.cxx.o: In function `MPI::Info::Set(char const*, char const*)':
  2456. XdmfArray.cxx:(.text._ZN3MPI4Info3SetEPKcS2_[_ZN3MPI4Info3SetEPKcS2_]+0x5): undefined reference to `MPI_Info_set'
  2457. CMakeFiles/vtkxdmf2.dir/XdmfArray.cxx.o: In function `MPI::Info::Get_valuelen(char const*, int&) const':
  2458. XdmfArray.cxx:(.text._ZNK3MPI4Info12Get_valuelenEPKcRi[_ZNK3MPI4Info12Get_valuelenEPKcRi]+0xe): undefined reference to `MPI_Info_get_valuelen'
  2459. CMakeFiles/vtkxdmf2.dir/XdmfArray.cxx.o: In function `MPI::Info::Get_nthkey(int, char*) const':
  2460. XdmfArray.cxx:(.text._ZNK3MPI4Info10Get_nthkeyEiPc[_ZNK3MPI4Info10Get_nthkeyEiPc]+0x5): undefined reference to `MPI_Info_get_nthkey'
  2461. CMakeFiles/vtkxdmf2.dir/XdmfArray.cxx.o: In function `MPI::Info::Get_nkeys() const':
  2462. XdmfArray.cxx:(.text._ZNK3MPI4Info9Get_nkeysEv[_ZNK3MPI4Info9Get_nkeysEv]+0xe): undefined reference to `MPI_Info_get_nkeys'
  2463. CMakeFiles/vtkxdmf2.dir/XdmfArray.cxx.o: In function `MPI::Info::Get(char const*, int, char*) const':
  2464. XdmfArray.cxx:(.text._ZNK3MPI4Info3GetEPKciPc[_ZNK3MPI4Info3GetEPKciPc]+0xe): undefined reference to `MPI_Info_get'
  2465. CMakeFiles/vtkxdmf2.dir/XdmfArray.cxx.o: In function `MPI::Info::Free()':
  2466. XdmfArray.cxx:(.text._ZN3MPI4Info4FreeEv[_ZN3MPI4Info4FreeEv]+0x5): undefined reference to `MPI_Info_free'
  2467. CMakeFiles/vtkxdmf2.dir/XdmfArray.cxx.o: In function `MPI::Info::Dup() const':
  2468. XdmfArray.cxx:(.text._ZNK3MPI4Info3DupEv[_ZNK3MPI4Info3DupEv]+0x12): undefined reference to `MPI_Info_dup'
  2469. CMakeFiles/vtkxdmf2.dir/XdmfArray.cxx.o: In function `MPI::Info::Delete(char const*)':
  2470. XdmfArray.cxx:(.text._ZN3MPI4Info6DeleteEPKc[_ZN3MPI4Info6DeleteEPKc]+0x5): undefined reference to `MPI_Info_delete'
  2471. CMakeFiles/vtkxdmf2.dir/XdmfArray.cxx.o: In function `MPI::Status::Set_cancelled(bool)':
  2472. XdmfArray.cxx:(.text._ZN3MPI6Status13Set_cancelledEb[_ZN3MPI6Status13Set_cancelledEb]+0x9): undefined reference to `MPI_Status_set_cancelled'
  2473. CMakeFiles/vtkxdmf2.dir/XdmfArray.cxx.o: In function `MPI::Status::Set_elements(MPI::Datatype const&, int)':
  2474. XdmfArray.cxx:(.text._ZN3MPI6Status12Set_elementsERKNS_8DatatypeEi[_ZN3MPI6Status12Set_elementsERKNS_8DatatypeEi]+0x9): undefined reference to `MPI_Status_set_elements'
  2475. CMakeFiles/vtkxdmf2.dir/XdmfArray.cxx.o: In function `MPI::Status::Get_elements(MPI::Datatype const&) const':
  2476. XdmfArray.cxx:(.text._ZNK3MPI6Status12Get_elementsERKNS_8DatatypeE[_ZNK3MPI6Status12Get_elementsERKNS_8DatatypeE]+0x12): undefined reference to `MPI_Get_elements'
  2477. CMakeFiles/vtkxdmf2.dir/XdmfArray.cxx.o: In function `MPI::Status::Is_cancelled() const':
  2478. XdmfArray.cxx:(.text._ZNK3MPI6Status12Is_cancelledEv[_ZNK3MPI6Status12Is_cancelledEv]+0xe): undefined reference to `MPI_Test_cancelled'
  2479. CMakeFiles/vtkxdmf2.dir/XdmfArray.cxx.o: In function `MPI::Status::Get_count(MPI::Datatype const&) const':
  2480. XdmfArray.cxx:(.text._ZNK3MPI6Status9Get_countERKNS_8DatatypeE[_ZNK3MPI6Status9Get_countERKNS_8DatatypeE]+0x12): undefined reference to `MPI_Get_count'
  2481. CMakeFiles/vtkxdmf2.dir/XdmfArray.cxx.o: In function `MPI::Errhandler::Free()':
  2482. XdmfArray.cxx:(.text._ZN3MPI10Errhandler4FreeEv[_ZN3MPI10Errhandler4FreeEv]+0x5): undefined reference to `MPI_Errhandler_free'
  2483. CMakeFiles/vtkxdmf2.dir/XdmfArray.cxx.o: In function `MPI::Op::Is_commutative() const':
  2484. XdmfArray.cxx:(.text._ZNK3MPI2Op14Is_commutativeEv[_ZNK3MPI2Op14Is_commutativeEv]+0xe): undefined reference to `MPI_Op_commutative'
  2485. CMakeFiles/vtkxdmf2.dir/XdmfArray.cxx.o: In function `MPI::Op::Reduce_local(void const*, void*, int, MPI::Datatype const&) const':
  2486. XdmfArray.cxx:(.text._ZNK3MPI2Op12Reduce_localEPKvPviRKNS_8DatatypeE[_ZNK3MPI2Op12Reduce_localEPKvPviRKNS_8DatatypeE]+0x14): undefined reference to `MPI_Reduce_local'
  2487. CMakeFiles/vtkxdmf2.dir/XdmfArray.cxx.o: In function `MPI::Op::Free()':
  2488. XdmfArray.cxx:(.text._ZN3MPI2Op4FreeEv[_ZN3MPI2Op4FreeEv]+0x5): undefined reference to `MPI_Op_free'
  2489. CMakeFiles/vtkxdmf2.dir/XdmfArray.cxx.o: In function `MPI::Op::Init(void (*)(void const*, void*, int, MPI::Datatype const&), bool)':
  2490. XdmfArray.cxx:(.text._ZN3MPI2Op4InitEPFvPKvPviRKNS_8DatatypeEEb[_ZN3MPI2Op4InitEPFvPKvPviRKNS_8DatatypeEEb]+0x18): undefined reference to `ompi_mpi_cxx_op_intercept'
  2491. XdmfArray.cxx:(.text._ZN3MPI2Op4InitEPFvPKvPviRKNS_8DatatypeEEb[_ZN3MPI2Op4InitEPFvPKvPviRKNS_8DatatypeEEb]+0x26): undefined reference to `MPI_Op_create'
  2492. XdmfArray.cxx:(.text._ZN3MPI2Op4InitEPFvPKvPviRKNS_8DatatypeEEb[_ZN3MPI2Op4InitEPFvPKvPviRKNS_8DatatypeEEb]+0x40): undefined reference to `ompi_op_set_cxx_callback'
  2493. CMakeFiles/vtkxdmf2.dir/XdmfArray.cxx.o: In function `MPI::Group::Free()':
  2494. XdmfArray.cxx:(.text._ZN3MPI5Group4FreeEv[_ZN3MPI5Group4FreeEv]+0x5): undefined reference to `MPI_Group_free'
  2495. CMakeFiles/vtkxdmf2.dir/XdmfArray.cxx.o: In function `MPI::Group::Range_excl(int, int const (*) [3]) const':
  2496. XdmfArray.cxx:(.text._ZNK3MPI5Group10Range_exclEiPA3_Ki[_ZNK3MPI5Group10Range_exclEiPA3_Ki]+0x19): undefined reference to `MPI_Group_range_excl'
  2497. CMakeFiles/vtkxdmf2.dir/XdmfArray.cxx.o: In function `MPI::Group::Range_incl(int, int const (*) [3]) const':
  2498. XdmfArray.cxx:(.text._ZNK3MPI5Group10Range_inclEiPA3_Ki[_ZNK3MPI5Group10Range_inclEiPA3_Ki]+0x19): undefined reference to `MPI_Group_range_incl'
  2499. CMakeFiles/vtkxdmf2.dir/XdmfArray.cxx.o: In function `MPI::Group::Excl(int, int const*) const':
  2500. XdmfArray.cxx:(.text._ZNK3MPI5Group4ExclEiPKi[_ZNK3MPI5Group4ExclEiPKi]+0x19): undefined reference to `MPI_Group_excl'
  2501. CMakeFiles/vtkxdmf2.dir/XdmfArray.cxx.o: In function `MPI::Group::Incl(int, int const*) const':
  2502. XdmfArray.cxx:(.text._ZNK3MPI5Group4InclEiPKi[_ZNK3MPI5Group4InclEiPKi]+0x19): undefined reference to `MPI_Group_incl'
  2503. CMakeFiles/vtkxdmf2.dir/XdmfArray.cxx.o: In function `MPI::Group::Get_rank() const':
  2504. XdmfArray.cxx:(.text._ZNK3MPI5Group8Get_rankEv[_ZNK3MPI5Group8Get_rankEv]+0xe): undefined reference to `MPI_Group_rank'
  2505. CMakeFiles/vtkxdmf2.dir/XdmfArray.cxx.o: In function `MPI::Group::Get_size() const':
  2506. XdmfArray.cxx:(.text._ZNK3MPI5Group8Get_sizeEv[_ZNK3MPI5Group8Get_sizeEv]+0xe): undefined reference to `MPI_Group_size'
  2507. CMakeFiles/vtkxdmf2.dir/XdmfArray.cxx.o: In function `MPI::Intercomm::Split(int, int) const':
  2508. XdmfArray.cxx:(.text._ZNK3MPI9Intercomm5SplitEii[_ZNK3MPI9Intercomm5SplitEii]+0x18): undefined reference to `MPI_Comm_split'
  2509. CMakeFiles/vtkxdmf2.dir/XdmfArray.cxx.o: In function `MPI::Intercomm::Create(MPI::Group const&) const':
  2510. XdmfArray.cxx:(.text._ZNK3MPI9Intercomm6CreateERKNS_5GroupE[_ZNK3MPI9Intercomm6CreateERKNS_5GroupE]+0x19): undefined reference to `MPI_Comm_create'
  2511. CMakeFiles/vtkxdmf2.dir/XdmfArray.cxx.o: In function `MPI::Comm::Is_inter() const':
  2512. XdmfArray.cxx:(.text._ZNK3MPI4Comm8Is_interEv[_ZNK3MPI4Comm8Is_interEv]+0xe): undefined reference to `MPI_Comm_test_inter'
  2513. CMakeFiles/vtkxdmf2.dir/XdmfArray.cxx.o: In function `MPI::Intercomm::Get_remote_group() const':
  2514. XdmfArray.cxx:(.text._ZNK3MPI9Intercomm16Get_remote_groupEv[_ZNK3MPI9Intercomm16Get_remote_groupEv]+0x12): undefined reference to `MPI_Comm_remote_group'
  2515. CMakeFiles/vtkxdmf2.dir/XdmfArray.cxx.o: In function `MPI::Intercomm::Get_remote_size() const':
  2516. XdmfArray.cxx:(.text._ZNK3MPI9Intercomm15Get_remote_sizeEv[_ZNK3MPI9Intercomm15Get_remote_sizeEv]+0xe): undefined reference to `MPI_Comm_remote_size'
  2517. CMakeFiles/vtkxdmf2.dir/XdmfArray.cxx.o: In function `MPI::Intercomm::Clone() const':
  2518. XdmfArray.cxx:(.text._ZNK3MPI9Intercomm5CloneEv[_ZNK3MPI9Intercomm5CloneEv]+0xe): undefined reference to `MPI_Comm_dup'
  2519. CMakeFiles/vtkxdmf2.dir/XdmfArray.cxx.o: In function `MPI::Comm::Get_topology() const':
  2520. XdmfArray.cxx:(.text._ZNK3MPI4Comm12Get_topologyEv[_ZNK3MPI4Comm12Get_topologyEv]+0xe): undefined reference to `MPI_Topo_test'
  2521. CMakeFiles/vtkxdmf2.dir/XdmfArray.cxx.o: In function `MPI::Graphcomm::Map(int, int const*, int const*) const':
  2522. XdmfArray.cxx:(.text._ZNK3MPI9Graphcomm3MapEiPKiS2_[_ZNK3MPI9Graphcomm3MapEiPKiS2_]+0xe): undefined reference to `MPI_Graph_map'
  2523. CMakeFiles/vtkxdmf2.dir/XdmfArray.cxx.o: In function `MPI::Graphcomm::Get_neighbors(int, int, int*) const':
  2524. XdmfArray.cxx:(.text._ZNK3MPI9Graphcomm13Get_neighborsEiiPi[_ZNK3MPI9Graphcomm13Get_neighborsEiiPi]+0x5): undefined reference to `MPI_Graph_neighbors'
  2525. CMakeFiles/vtkxdmf2.dir/XdmfArray.cxx.o: In function `MPI::Graphcomm::Get_neighbors_count(int) const':
  2526. XdmfArray.cxx:(.text._ZNK3MPI9Graphcomm19Get_neighbors_countEi[_ZNK3MPI9Graphcomm19Get_neighbors_countEi]+0xe): undefined reference to `MPI_Graph_neighbors_count'
  2527. CMakeFiles/vtkxdmf2.dir/XdmfArray.cxx.o: In function `MPI::Graphcomm::Get_topo(int, int, int*, int*) const':
  2528. XdmfArray.cxx:(.text._ZNK3MPI9Graphcomm8Get_topoEiiPiS1_[_ZNK3MPI9Graphcomm8Get_topoEiiPiS1_]+0x5): undefined reference to `MPI_Graph_get'
  2529. CMakeFiles/vtkxdmf2.dir/XdmfArray.cxx.o: In function `MPI::Graphcomm::Get_dims(int*, int*) const':
  2530. XdmfArray.cxx:(.text._ZNK3MPI9Graphcomm8Get_dimsEPiS1_[_ZNK3MPI9Graphcomm8Get_dimsEPiS1_]+0x5): undefined reference to `MPI_Graphdims_get'
  2531. CMakeFiles/vtkxdmf2.dir/XdmfArray.cxx.o: In function `MPI::Cartcomm::Map(int, int const*, bool const*) const':
  2532. XdmfArray.cxx:(.text._ZNK3MPI8Cartcomm3MapEiPKiPKb[_ZNK3MPI8Cartcomm3MapEiPKiPKb]+0x63): undefined reference to `MPI_Cart_map'
  2533. CMakeFiles/vtkxdmf2.dir/XdmfArray.cxx.o: In function `MPI::Cartcomm::Get_dim() const':
  2534. XdmfArray.cxx:(.text._ZNK3MPI8Cartcomm7Get_dimEv[_ZNK3MPI8Cartcomm7Get_dimEv]+0xe): undefined reference to `MPI_Cartdim_get'
  2535. CMakeFiles/vtkxdmf2.dir/XdmfArray.cxx.o: In function `MPI::Cartcomm::Shift(int, int, int&, int&) const':
  2536. XdmfArray.cxx:(.text._ZNK3MPI8Cartcomm5ShiftEiiRiS1_[_ZNK3MPI8Cartcomm5ShiftEiiRiS1_]+0x5): undefined reference to `MPI_Cart_shift'
  2537. CMakeFiles/vtkxdmf2.dir/XdmfArray.cxx.o: In function `MPI::Cartcomm::Get_coords(int, int, int*) const':
  2538. XdmfArray.cxx:(.text._ZNK3MPI8Cartcomm10Get_coordsEiiPi[_ZNK3MPI8Cartcomm10Get_coordsEiiPi]+0x5): undefined reference to `MPI_Cart_coords'
  2539. CMakeFiles/vtkxdmf2.dir/XdmfArray.cxx.o: In function `MPI::Cartcomm::Get_cart_rank(int const*) const':
  2540. XdmfArray.cxx:(.text._ZNK3MPI8Cartcomm13Get_cart_rankEPKi[_ZNK3MPI8Cartcomm13Get_cart_rankEPKi]+0xe): undefined reference to `MPI_Cart_rank'
  2541. CMakeFiles/vtkxdmf2.dir/XdmfArray.cxx.o: In function `MPI::Cartcomm::Get_topo(int, int*, bool*, int*) const':
  2542. XdmfArray.cxx:(.text._ZNK3MPI8Cartcomm8Get_topoEiPiPbS1_[_ZNK3MPI8Cartcomm8Get_topoEiPiPbS1_]+0x6a): undefined reference to `MPI_Cart_get'
  2543. XdmfArray.cxx:(.text._ZNK3MPI8Cartcomm8Get_topoEiPiPbS1_[_ZNK3MPI8Cartcomm8Get_topoEiPiPbS1_]+0x1c6): undefined reference to `MPI_Cart_get'
  2544. CMakeFiles/vtkxdmf2.dir/XdmfArray.cxx.o: In function `MPI::Intracomm::Spawn_multiple(int, char const**, char const***, int const*, MPI::Info const*, int, int*)':
  2545. XdmfArray.cxx:(.text._ZN3MPI9Intracomm14Spawn_multipleEiPPKcPS3_PKiPKNS_4InfoEiPi[_ZN3MPI9Intracomm14Spawn_multipleEiPPKcPS3_PKiPKNS_4InfoEiPi]+0xbb): undefined reference to `MPI_Comm_spawn_multiple'
  2546. CMakeFiles/vtkxdmf2.dir/XdmfArray.cxx.o: In function `MPI::Intracomm::Spawn(char const*, char const**, int, MPI::Info const&, int, int*) const':
  2547. XdmfArray.cxx:(.text._ZNK3MPI9Intracomm5SpawnEPKcPS2_iRKNS_4InfoEiPi[_ZNK3MPI9Intracomm5SpawnEPKcPS2_iRKNS_4InfoEiPi]+0x38): undefined reference to `MPI_Comm_spawn'
  2548. CMakeFiles/vtkxdmf2.dir/XdmfArray.cxx.o: In function `MPI::Intracomm::Spawn(char const*, char const**, int, MPI::Info const&, int) const':
  2549. XdmfArray.cxx:(.text._ZNK3MPI9Intracomm5SpawnEPKcPS2_iRKNS_4InfoEi[_ZNK3MPI9Intracomm5SpawnEPKcPS2_iRKNS_4InfoEi]+0x37): undefined reference to `MPI_Comm_spawn'
  2550. CMakeFiles/vtkxdmf2.dir/XdmfArray.cxx.o: In function `MPI::Intracomm::Connect(char const*, MPI::Info const&, int) const':
  2551. XdmfArray.cxx:(.text._ZNK3MPI9Intracomm7ConnectEPKcRKNS_4InfoEi[_ZNK3MPI9Intracomm7ConnectEPKcRKNS_4InfoEi]+0x1f): undefined reference to `MPI_Comm_connect'
  2552. CMakeFiles/vtkxdmf2.dir/XdmfArray.cxx.o: In function `MPI::Intracomm::Accept(char const*, MPI::Info const&, int) const':
  2553. XdmfArray.cxx:(.text._ZNK3MPI9Intracomm6AcceptEPKcRKNS_4InfoEi[_ZNK3MPI9Intracomm6AcceptEPKcRKNS_4InfoEi]+0x1f): undefined reference to `MPI_Comm_accept'
  2554. CMakeFiles/vtkxdmf2.dir/XdmfArray.cxx.o: In function `MPI::Intracomm::Create_intercomm(int, MPI::Comm const&, int, int) const':
  2555. XdmfArray.cxx:(.text._ZNK3MPI9Intracomm16Create_intercommEiRKNS_4CommEii[_ZNK3MPI9Intracomm16Create_intercommEiRKNS_4CommEii]+0x23): undefined reference to `MPI_Intercomm_create'
  2556. CMakeFiles/vtkxdmf2.dir/XdmfArray.cxx.o: In function `MPI::Intracomm::Exscan(void const*, void*, int, MPI::Datatype const&, MPI::Op const&) const':
  2557. XdmfArray.cxx:(.text._ZNK3MPI9Intracomm6ExscanEPKvPviRKNS_8DatatypeERKNS_2OpE[_ZNK3MPI9Intracomm6ExscanEPKvPviRKNS_8DatatypeERKNS_2OpE]+0x1b): undefined reference to `MPI_Exscan'
  2558. CMakeFiles/vtkxdmf2.dir/XdmfArray.cxx.o: In function `MPI::Intracomm::Scan(void const*, void*, int, MPI::Datatype const&, MPI::Op const&) const':
  2559. XdmfArray.cxx:(.text._ZNK3MPI9Intracomm4ScanEPKvPviRKNS_8DatatypeERKNS_2OpE[_ZNK3MPI9Intracomm4ScanEPKvPviRKNS_8DatatypeERKNS_2OpE]+0x1b): undefined reference to `MPI_Scan'
  2560. CMakeFiles/vtkxdmf2.dir/XdmfArray.cxx.o: In function `MPI::Comm::Delete_attr(int)':
  2561. XdmfArray.cxx:(.text._ZN3MPI4Comm11Delete_attrEi[_ZN3MPI4Comm11Delete_attrEi]+0x5): undefined reference to `MPI_Attr_delete'
  2562. CMakeFiles/vtkxdmf2.dir/XdmfArray.cxx.o: In function `MPI::Comm::Get_attr(int, void*) const':
  2563. XdmfArray.cxx:(.text._ZNK3MPI4Comm8Get_attrEiPv[_ZNK3MPI4Comm8Get_attrEiPv]+0xe): undefined reference to `MPI_Attr_get'
  2564. CMakeFiles/vtkxdmf2.dir/XdmfArray.cxx.o: In function `MPI::Comm::Set_attr(int, void const*) const':
  2565. XdmfArray.cxx:(.text._ZNK3MPI4Comm8Set_attrEiPKv[_ZNK3MPI4Comm8Set_attrEiPKv]+0x5): undefined reference to `MPI_Attr_put'
  2566. CMakeFiles/vtkxdmf2.dir/XdmfArray.cxx.o: In function `MPI::Comm::Set_errhandler(MPI::Errhandler const&)':
  2567. XdmfArray.cxx:(.text._ZN3MPI4Comm14Set_errhandlerERKNS_10ErrhandlerE[_ZN3MPI4Comm14Set_errhandlerERKNS_10ErrhandlerE]+0x9): undefined reference to `MPI_Comm_set_errhandler'
  2568. CMakeFiles/vtkxdmf2.dir/XdmfArray.cxx.o: In function `MPI::Comm::Get_errhandler() const':
  2569. XdmfArray.cxx:(.text._ZNK3MPI4Comm14Get_errhandlerEv[_ZNK3MPI4Comm14Get_errhandlerEv]+0x12): undefined reference to `MPI_Comm_get_errhandler'
  2570. CMakeFiles/vtkxdmf2.dir/XdmfArray.cxx.o: In function `MPI::Comm::Abort(int)':
  2571. XdmfArray.cxx:(.text._ZN3MPI4Comm5AbortEi[_ZN3MPI4Comm5AbortEi]+0x5): undefined reference to `MPI_Abort'
  2572. CMakeFiles/vtkxdmf2.dir/XdmfArray.cxx.o: In function `MPI::Comm::Set_name(char const*)':
  2573. XdmfArray.cxx:(.text._ZN3MPI4Comm8Set_nameEPKc[_ZN3MPI4Comm8Set_nameEPKc]+0x5): undefined reference to `MPI_Comm_set_name'
  2574. CMakeFiles/vtkxdmf2.dir/XdmfArray.cxx.o: In function `MPI::Comm::Get_name(char*, int&) const':
  2575. XdmfArray.cxx:(.text._ZNK3MPI4Comm8Get_nameEPcRi[_ZNK3MPI4Comm8Get_nameEPcRi]+0x5): undefined reference to `MPI_Comm_get_name'
  2576. CMakeFiles/vtkxdmf2.dir/XdmfArray.cxx.o: In function `MPI::Comm::Disconnect()':
  2577. XdmfArray.cxx:(.text._ZN3MPI4Comm10DisconnectEv[_ZN3MPI4Comm10DisconnectEv]+0x5): undefined reference to `MPI_Comm_disconnect'
  2578. CMakeFiles/vtkxdmf2.dir/XdmfArray.cxx.o: In function `MPI::Comm::Reduce_scatter(void const*, void*, int*, MPI::Datatype const&, MPI::Op const&) const':
  2579. XdmfArray.cxx:(.text._ZNK3MPI4Comm14Reduce_scatterEPKvPvPiRKNS_8DatatypeERKNS_2OpE[_ZNK3MPI4Comm14Reduce_scatterEPKvPvPiRKNS_8DatatypeERKNS_2OpE]+0x1c): undefined reference to `MPI_Reduce_scatter'
  2580. CMakeFiles/vtkxdmf2.dir/XdmfArray.cxx.o: In function `MPI::Comm::Allreduce(void const*, void*, int, MPI::Datatype const&, MPI::Op const&) const':
  2581. XdmfArray.cxx:(.text._ZNK3MPI4Comm9AllreduceEPKvPviRKNS_8DatatypeERKNS_2OpE[_ZNK3MPI4Comm9AllreduceEPKvPviRKNS_8DatatypeERKNS_2OpE]+0x1b): undefined reference to `MPI_Allreduce'
  2582. CMakeFiles/vtkxdmf2.dir/XdmfArray.cxx.o: In function `MPI::Comm::Reduce(void const*, void*, int, MPI::Datatype const&, MPI::Op const&, int) const':
  2583. XdmfArray.cxx:(.text._ZNK3MPI4Comm6ReduceEPKvPviRKNS_8DatatypeERKNS_2OpEi[_ZNK3MPI4Comm6ReduceEPKvPviRKNS_8DatatypeERKNS_2OpEi]+0x28): undefined reference to `MPI_Reduce'
  2584. CMakeFiles/vtkxdmf2.dir/XdmfArray.cxx.o: In function `MPI::Comm::Alltoallw(void const*, int const*, int const*, MPI::Datatype const*, void*, int const*, int const*, MPI::Datatype const*) const':
  2585. XdmfArray.cxx:(.text._ZNK3MPI4Comm9AlltoallwEPKvPKiS4_PKNS_8DatatypeEPvS4_S4_S7_[_ZNK3MPI4Comm9AlltoallwEPKvPKiS4_PKNS_8DatatypeEPvS4_S4_S7_]+0xda): undefined reference to `MPI_Alltoallw'
  2586. CMakeFiles/vtkxdmf2.dir/XdmfArray.cxx.o: In function `MPI::Comm::Alltoallv(void const*, int const*, int const*, MPI::Datatype const&, void*, int const*, int const*, MPI::Datatype const&) const':
  2587. XdmfArray.cxx:(.text._ZNK3MPI4Comm9AlltoallvEPKvPKiS4_RKNS_8DatatypeEPvS4_S4_S7_[_ZNK3MPI4Comm9AlltoallvEPKvPKiS4_RKNS_8DatatypeEPvS4_S4_S7_]+0x3f): undefined reference to `MPI_Alltoallv'
  2588. CMakeFiles/vtkxdmf2.dir/XdmfArray.cxx.o: In function `MPI::Comm::Alltoall(void const*, int, MPI::Datatype const&, void*, int, MPI::Datatype const&) const':
  2589. XdmfArray.cxx:(.text._ZNK3MPI4Comm8AlltoallEPKviRKNS_8DatatypeEPviS5_[_ZNK3MPI4Comm8AlltoallEPKviRKNS_8DatatypeEPviS5_]+0x28): undefined reference to `MPI_Alltoall'
  2590. CMakeFiles/vtkxdmf2.dir/XdmfArray.cxx.o: In function `MPI::Comm::Allgatherv(void const*, int, MPI::Datatype const&, void*, int const*, int const*, MPI::Datatype const&) const':
  2591. XdmfArray.cxx:(.text._ZNK3MPI4Comm10AllgathervEPKviRKNS_8DatatypeEPvPKiS8_S5_[_ZNK3MPI4Comm10AllgathervEPKviRKNS_8DatatypeEPvPKiS8_S5_]+0x32): undefined reference to `MPI_Allgatherv'
  2592. CMakeFiles/vtkxdmf2.dir/XdmfArray.cxx.o: In function `MPI::Comm::Allgather(void const*, int, MPI::Datatype const&, void*, int, MPI::Datatype const&) const':
  2593. XdmfArray.cxx:(.text._ZNK3MPI4Comm9AllgatherEPKviRKNS_8DatatypeEPviS5_[_ZNK3MPI4Comm9AllgatherEPKviRKNS_8DatatypeEPviS5_]+0x28): undefined reference to `MPI_Allgather'
  2594. CMakeFiles/vtkxdmf2.dir/XdmfArray.cxx.o: In function `MPI::Comm::Scatterv(void const*, int const*, int const*, MPI::Datatype const&, void*, int, MPI::Datatype const&, int) const':
  2595. XdmfArray.cxx:(.text._ZNK3MPI4Comm8ScattervEPKvPKiS4_RKNS_8DatatypeEPviS7_i[_ZNK3MPI4Comm8ScattervEPKvPKiS4_RKNS_8DatatypeEPviS7_i]+0x3d): undefined reference to `MPI_Scatterv'
  2596. CMakeFiles/vtkxdmf2.dir/XdmfArray.cxx.o: In function `MPI::Comm::Scatter(void const*, int, MPI::Datatype const&, void*, int, MPI::Datatype const&, int) const':
  2597. XdmfArray.cxx:(.text._ZNK3MPI4Comm7ScatterEPKviRKNS_8DatatypeEPviS5_i[_ZNK3MPI4Comm7ScatterEPKviRKNS_8DatatypeEPviS5_i]+0x32): undefined reference to `MPI_Scatter'
  2598. CMakeFiles/vtkxdmf2.dir/XdmfArray.cxx.o: In function `MPI::Comm::Gatherv(void const*, int, MPI::Datatype const&, void*, int const*, int const*, MPI::Datatype const&, int) const':
  2599. XdmfArray.cxx:(.text._ZNK3MPI4Comm7GathervEPKviRKNS_8DatatypeEPvPKiS8_S5_i[_ZNK3MPI4Comm7GathervEPKviRKNS_8DatatypeEPvPKiS8_S5_i]+0x3a): undefined reference to `MPI_Gatherv'
  2600. CMakeFiles/vtkxdmf2.dir/XdmfArray.cxx.o: In function `MPI::Comm::Gather(void const*, int, MPI::Datatype const&, void*, int, MPI::Datatype const&, int) const':
  2601. XdmfArray.cxx:(.text._ZNK3MPI4Comm6GatherEPKviRKNS_8DatatypeEPviS5_i[_ZNK3MPI4Comm6GatherEPKviRKNS_8DatatypeEPviS5_i]+0x32): undefined reference to `MPI_Gather'
  2602. CMakeFiles/vtkxdmf2.dir/XdmfArray.cxx.o: In function `MPI::Comm::Bcast(void*, int, MPI::Datatype const&, int) const':
  2603. XdmfArray.cxx:(.text._ZNK3MPI4Comm5BcastEPviRKNS_8DatatypeEi[_ZNK3MPI4Comm5BcastEPviRKNS_8DatatypeEi]+0x17): undefined reference to `MPI_Bcast'
  2604. CMakeFiles/vtkxdmf2.dir/XdmfArray.cxx.o: In function `MPI::Comm::Barrier() const':
  2605. XdmfArray.cxx:(.text._ZNK3MPI4Comm7BarrierEv[_ZNK3MPI4Comm7BarrierEv]+0x5): undefined reference to `MPI_Barrier'
  2606. CMakeFiles/vtkxdmf2.dir/XdmfArray.cxx.o: In function `MPI::Comm::Free()':
  2607. XdmfArray.cxx:(.text._ZN3MPI4Comm4FreeEv[_ZN3MPI4Comm4FreeEv]+0x5): undefined reference to `MPI_Comm_free'
  2608. CMakeFiles/vtkxdmf2.dir/XdmfArray.cxx.o: In function `MPI::Comm::Get_rank() const':
  2609. XdmfArray.cxx:(.text._ZNK3MPI4Comm8Get_rankEv[_ZNK3MPI4Comm8Get_rankEv]+0xe): undefined reference to `MPI_Comm_rank'
  2610. CMakeFiles/vtkxdmf2.dir/XdmfArray.cxx.o: In function `MPI::Comm::Get_size() const':
  2611. XdmfArray.cxx:(.text._ZNK3MPI4Comm8Get_sizeEv[_ZNK3MPI4Comm8Get_sizeEv]+0xe): undefined reference to `MPI_Comm_size'
  2612. CMakeFiles/vtkxdmf2.dir/XdmfArray.cxx.o: In function `MPI::Comm::Get_group() const':
  2613. XdmfArray.cxx:(.text._ZNK3MPI4Comm9Get_groupEv[_ZNK3MPI4Comm9Get_groupEv]+0x12): undefined reference to `MPI_Comm_group'
  2614. CMakeFiles/vtkxdmf2.dir/XdmfArray.cxx.o: In function `MPI::Comm::Sendrecv_replace(void*, int, MPI::Datatype const&, int, int, int, int) const':
  2615. XdmfArray.cxx:(.text._ZNK3MPI4Comm16Sendrecv_replaceEPviRKNS_8DatatypeEiiii[_ZNK3MPI4Comm16Sendrecv_replaceEPviRKNS_8DatatypeEiiii]+0x38): undefined reference to `MPI_Sendrecv_replace'
  2616. CMakeFiles/vtkxdmf2.dir/XdmfArray.cxx.o: In function `MPI::Comm::Sendrecv_replace(void*, int, MPI::Datatype const&, int, int, int, int, MPI::Status&) const':
  2617. XdmfArray.cxx:(.text._ZNK3MPI4Comm16Sendrecv_replaceEPviRKNS_8DatatypeEiiiiRNS_6StatusE[_ZNK3MPI4Comm16Sendrecv_replaceEPviRKNS_8DatatypeEiiiiRNS_6StatusE]+0x34): undefined reference to `MPI_Sendrecv_replace'
  2618. CMakeFiles/vtkxdmf2.dir/XdmfArray.cxx.o: In function `MPI::Comm::Sendrecv(void const*, int, MPI::Datatype const&, int, int, void*, int, MPI::Datatype const&, int, int) const':
  2619. XdmfArray.cxx:(.text._ZNK3MPI4Comm8SendrecvEPKviRKNS_8DatatypeEiiPviS5_ii[_ZNK3MPI4Comm8SendrecvEPKviRKNS_8DatatypeEiiPviS5_ii]+0x56): undefined reference to `MPI_Sendrecv'
  2620. CMakeFiles/vtkxdmf2.dir/XdmfArray.cxx.o: In function `MPI::Comm::Sendrecv(void const*, int, MPI::Datatype const&, int, int, void*, int, MPI::Datatype const&, int, int, MPI::Status&) const':
  2621. XdmfArray.cxx:(.text._ZNK3MPI4Comm8SendrecvEPKviRKNS_8DatatypeEiiPviS5_iiRNS_6StatusE[_ZNK3MPI4Comm8SendrecvEPKviRKNS_8DatatypeEiiPviS5_iiRNS_6StatusE]+0x54): undefined reference to `MPI_Sendrecv'
  2622. CMakeFiles/vtkxdmf2.dir/XdmfArray.cxx.o: In function `MPI::Comm::Recv_init(void*, int, MPI::Datatype const&, int, int) const':
  2623. XdmfArray.cxx:(.text._ZNK3MPI4Comm9Recv_initEPviRKNS_8DatatypeEii[_ZNK3MPI4Comm9Recv_initEPviRKNS_8DatatypeEii]+0x29): undefined reference to `MPI_Recv_init'
  2624. CMakeFiles/vtkxdmf2.dir/XdmfArray.cxx.o: In function `MPI::Comm::Rsend_init(void const*, int, MPI::Datatype const&, int, int) const':
  2625. XdmfArray.cxx:(.text._ZNK3MPI4Comm10Rsend_initEPKviRKNS_8DatatypeEii[_ZNK3MPI4Comm10Rsend_initEPKviRKNS_8DatatypeEii]+0x29): undefined reference to `MPI_Rsend_init'
  2626. CMakeFiles/vtkxdmf2.dir/XdmfArray.cxx.o: In function `MPI::Comm::Ssend_init(void const*, int, MPI::Datatype const&, int, int) const':
  2627. XdmfArray.cxx:(.text._ZNK3MPI4Comm10Ssend_initEPKviRKNS_8DatatypeEii[_ZNK3MPI4Comm10Ssend_initEPKviRKNS_8DatatypeEii]+0x29): undefined reference to `MPI_Ssend_init'
  2628. CMakeFiles/vtkxdmf2.dir/XdmfArray.cxx.o: In function `MPI::Comm::Bsend_init(void const*, int, MPI::Datatype const&, int, int) const':
  2629. XdmfArray.cxx:(.text._ZNK3MPI4Comm10Bsend_initEPKviRKNS_8DatatypeEii[_ZNK3MPI4Comm10Bsend_initEPKviRKNS_8DatatypeEii]+0x29): undefined reference to `MPI_Bsend_init'
  2630. CMakeFiles/vtkxdmf2.dir/XdmfArray.cxx.o: In function `MPI::Comm::Send_init(void const*, int, MPI::Datatype const&, int, int) const':
  2631. XdmfArray.cxx:(.text._ZNK3MPI4Comm9Send_initEPKviRKNS_8DatatypeEii[_ZNK3MPI4Comm9Send_initEPKviRKNS_8DatatypeEii]+0x29): undefined reference to `MPI_Send_init'
  2632. CMakeFiles/vtkxdmf2.dir/XdmfArray.cxx.o: In function `MPI::Comm::Probe(int, int) const':
  2633. XdmfArray.cxx:(.text._ZNK3MPI4Comm5ProbeEii[_ZNK3MPI4Comm5ProbeEii]+0xd): undefined reference to `MPI_Probe'
  2634. CMakeFiles/vtkxdmf2.dir/XdmfArray.cxx.o: In function `MPI::Comm::Probe(int, int, MPI::Status&) const':
  2635. XdmfArray.cxx:(.text._ZNK3MPI4Comm5ProbeEiiRNS_6StatusE[_ZNK3MPI4Comm5ProbeEiiRNS_6StatusE]+0xf): undefined reference to `MPI_Probe'
  2636. CMakeFiles/vtkxdmf2.dir/XdmfArray.cxx.o: In function `MPI::Comm::Iprobe(int, int) const':
  2637. XdmfArray.cxx:(.text._ZNK3MPI4Comm6IprobeEii[_ZNK3MPI4Comm6IprobeEii]+0x17): undefined reference to `MPI_Iprobe'
  2638. CMakeFiles/vtkxdmf2.dir/XdmfArray.cxx.o: In function `MPI::Comm::Iprobe(int, int, MPI::Status&) const':
  2639. XdmfArray.cxx:(.text._ZNK3MPI4Comm6IprobeEiiRNS_6StatusE[_ZNK3MPI4Comm6IprobeEiiRNS_6StatusE]+0x18): undefined reference to `MPI_Iprobe'
  2640. CMakeFiles/vtkxdmf2.dir/XdmfArray.cxx.o: In function `MPI::Comm::Irecv(void*, int, MPI::Datatype const&, int, int) const':
  2641. XdmfArray.cxx:(.text._ZNK3MPI4Comm5IrecvEPviRKNS_8DatatypeEii[_ZNK3MPI4Comm5IrecvEPviRKNS_8DatatypeEii]+0x29): undefined reference to `MPI_Irecv'
  2642. CMakeFiles/vtkxdmf2.dir/XdmfArray.cxx.o: In function `MPI::Comm::Irsend(void const*, int, MPI::Datatype const&, int, int) const':
  2643. XdmfArray.cxx:(.text._ZNK3MPI4Comm6IrsendEPKviRKNS_8DatatypeEii[_ZNK3MPI4Comm6IrsendEPKviRKNS_8DatatypeEii]+0x29): undefined reference to `MPI_Irsend'
  2644. CMakeFiles/vtkxdmf2.dir/XdmfArray.cxx.o: In function `MPI::Comm::Issend(void const*, int, MPI::Datatype const&, int, int) const':
  2645. XdmfArray.cxx:(.text._ZNK3MPI4Comm6IssendEPKviRKNS_8DatatypeEii[_ZNK3MPI4Comm6IssendEPKviRKNS_8DatatypeEii]+0x29): undefined reference to `MPI_Issend'
  2646. CMakeFiles/vtkxdmf2.dir/XdmfArray.cxx.o: In function `MPI::Comm::Ibsend(void const*, int, MPI::Datatype const&, int, int) const':
  2647. XdmfArray.cxx:(.text._ZNK3MPI4Comm6IbsendEPKviRKNS_8DatatypeEii[_ZNK3MPI4Comm6IbsendEPKviRKNS_8DatatypeEii]+0x29): undefined reference to `MPI_Ibsend'
  2648. CMakeFiles/vtkxdmf2.dir/XdmfArray.cxx.o: In function `MPI::Comm::Isend(void const*, int, MPI::Datatype const&, int, int) const':
  2649. XdmfArray.cxx:(.text._ZNK3MPI4Comm5IsendEPKviRKNS_8DatatypeEii[_ZNK3MPI4Comm5IsendEPKviRKNS_8DatatypeEii]+0x29): undefined reference to `MPI_Isend'
  2650. CMakeFiles/vtkxdmf2.dir/XdmfArray.cxx.o: In function `MPI::Comm::Rsend(void const*, int, MPI::Datatype const&, int, int) const':
  2651. XdmfArray.cxx:(.text._ZNK3MPI4Comm5RsendEPKviRKNS_8DatatypeEii[_ZNK3MPI4Comm5RsendEPKviRKNS_8DatatypeEii]+0x1a): undefined reference to `MPI_Rsend'
  2652. CMakeFiles/vtkxdmf2.dir/XdmfArray.cxx.o: In function `MPI::Comm::Ssend(void const*, int, MPI::Datatype const&, int, int) const':
  2653. XdmfArray.cxx:(.text._ZNK3MPI4Comm5SsendEPKviRKNS_8DatatypeEii[_ZNK3MPI4Comm5SsendEPKviRKNS_8DatatypeEii]+0x1a): undefined reference to `MPI_Ssend'
  2654. CMakeFiles/vtkxdmf2.dir/XdmfArray.cxx.o: In function `MPI::Comm::Bsend(void const*, int, MPI::Datatype const&, int, int) const':
  2655. XdmfArray.cxx:(.text._ZNK3MPI4Comm5BsendEPKviRKNS_8DatatypeEii[_ZNK3MPI4Comm5BsendEPKviRKNS_8DatatypeEii]+0x1a): undefined reference to `MPI_Bsend'
  2656. CMakeFiles/vtkxdmf2.dir/XdmfArray.cxx.o: In function `MPI::Comm::Recv(void*, int, MPI::Datatype const&, int, int) const':
  2657. XdmfArray.cxx:(.text._ZNK3MPI4Comm4RecvEPviRKNS_8DatatypeEii[_ZNK3MPI4Comm4RecvEPviRKNS_8DatatypeEii]+0x26): undefined reference to `MPI_Recv'
  2658. CMakeFiles/vtkxdmf2.dir/XdmfArray.cxx.o: In function `MPI::Comm::Recv(void*, int, MPI::Datatype const&, int, int, MPI::Status&) const':
  2659. XdmfArray.cxx:(.text._ZNK3MPI4Comm4RecvEPviRKNS_8DatatypeEiiRNS_6StatusE[_ZNK3MPI4Comm4RecvEPviRKNS_8DatatypeEiiRNS_6StatusE]+0x20): undefined reference to `MPI_Recv'
  2660. CMakeFiles/vtkxdmf2.dir/XdmfArray.cxx.o: In function `MPI::Comm::Send(void const*, int, MPI::Datatype const&, int, int) const':
  2661. XdmfArray.cxx:(.text._ZNK3MPI4Comm4SendEPKviRKNS_8DatatypeEii[_ZNK3MPI4Comm4SendEPKviRKNS_8DatatypeEii]+0x1a): undefined reference to `MPI_Send'
  2662. CMakeFiles/vtkxdmf2.dir/XdmfArray.cxx.o: In function `MPI::Grequest::Complete()':
  2663. XdmfArray.cxx:(.text._ZN3MPI8Grequest8CompleteEv[_ZN3MPI8Grequest8CompleteEv]+0x5): undefined reference to `MPI_Grequest_complete'
  2664. CMakeFiles/vtkxdmf2.dir/XdmfArray.cxx.o: In function `MPI::Request::Get_status() const':
  2665. XdmfArray.cxx:(.text._ZNK3MPI7Request10Get_statusEv[_ZNK3MPI7Request10Get_statusEv]+0x10): undefined reference to `MPI_Request_get_status'
  2666. CMakeFiles/vtkxdmf2.dir/XdmfArray.cxx.o: In function `MPI::Request::Get_status(MPI::Status&) const':
  2667. XdmfArray.cxx:(.text._ZNK3MPI7Request10Get_statusERNS_6StatusE[_ZNK3MPI7Request10Get_statusERNS_6StatusE]+0x1c): undefined reference to `MPI_Request_get_status'
  2668. CMakeFiles/vtkxdmf2.dir/XdmfArray.cxx.o: In function `MPI::Prequest::Start()':
  2669. XdmfArray.cxx:(.text._ZN3MPI8Prequest5StartEv[_ZN3MPI8Prequest5StartEv]+0x5): undefined reference to `MPI_Start'
  2670. CMakeFiles/vtkxdmf2.dir/XdmfArray.cxx.o: In function `MPI::Request::Cancel() const':
  2671. XdmfArray.cxx:(.text._ZNK3MPI7Request6CancelEv[_ZNK3MPI7Request6CancelEv]+0x5): undefined reference to `MPI_Cancel'
  2672. CMakeFiles/vtkxdmf2.dir/XdmfArray.cxx.o: In function `MPI::Request::Test()':
  2673. XdmfArray.cxx:(.text._ZN3MPI7Request4TestEv[_ZN3MPI7Request4TestEv]+0x10): undefined reference to `MPI_Test'
  2674. CMakeFiles/vtkxdmf2.dir/XdmfArray.cxx.o: In function `MPI::Request::Test(MPI::Status&)':
  2675. XdmfArray.cxx:(.text._ZN3MPI7Request4TestERNS_6StatusE[_ZN3MPI7Request4TestERNS_6StatusE]+0x12): undefined reference to `MPI_Test'
  2676. CMakeFiles/vtkxdmf2.dir/XdmfArray.cxx.o: In function `MPI::Request::Free()':
  2677. XdmfArray.cxx:(.text._ZN3MPI7Request4FreeEv[_ZN3MPI7Request4FreeEv]+0x5): undefined reference to `MPI_Request_free'
  2678. CMakeFiles/vtkxdmf2.dir/XdmfArray.cxx.o: In function `MPI::Request::Wait()':
  2679. XdmfArray.cxx:(.text._ZN3MPI7Request4WaitEv[_ZN3MPI7Request4WaitEv]+0x7): undefined reference to `MPI_Wait'
  2680. CMakeFiles/vtkxdmf2.dir/XdmfArray.cxx.o: In function `MPI::Request::Wait(MPI::Status&)':
  2681. XdmfArray.cxx:(.text._ZN3MPI7Request4WaitERNS_6StatusE[_ZN3MPI7Request4WaitERNS_6StatusE]+0x9): undefined reference to `MPI_Wait'
  2682. CMakeFiles/vtkxdmf2.dir/XdmfArray.cxx.o: In function `MPI::Datatype::Set_name(char const*)':
  2683. XdmfArray.cxx:(.text._ZN3MPI8Datatype8Set_nameEPKc[_ZN3MPI8Datatype8Set_nameEPKc]+0x5): undefined reference to `MPI_Type_set_name'
  2684. CMakeFiles/vtkxdmf2.dir/XdmfArray.cxx.o: In function `MPI::Datatype::Set_attr(int, void const*)':
  2685. XdmfArray.cxx:(.text._ZN3MPI8Datatype8Set_attrEiPKv[_ZN3MPI8Datatype8Set_attrEiPKv]+0x5): undefined reference to `MPI_Type_set_attr'
  2686. CMakeFiles/vtkxdmf2.dir/XdmfArray.cxx.o: In function `MPI::Datatype::Get_name(char*, int&) const':
  2687. XdmfArray.cxx:(.text._ZNK3MPI8Datatype8Get_nameEPcRi[_ZNK3MPI8Datatype8Get_nameEPcRi]+0x5): undefined reference to `MPI_Type_get_name'
  2688. CMakeFiles/vtkxdmf2.dir/XdmfArray.cxx.o: In function `MPI::Datatype::Get_envelope(int&, int&, int&, int&) const':
  2689. XdmfArray.cxx:(.text._ZNK3MPI8Datatype12Get_envelopeERiS1_S1_S1_[_ZNK3MPI8Datatype12Get_envelopeERiS1_S1_S1_]+0x5): undefined reference to `MPI_Type_get_envelope'
  2690. CMakeFiles/vtkxdmf2.dir/XdmfArray.cxx.o: In function `MPI::Datatype::Get_contents(int, int, int, int*, long*, MPI::Datatype*) const':
  2691. XdmfArray.cxx:(.text._ZNK3MPI8Datatype12Get_contentsEiiiPiPlPS0_[_ZNK3MPI8Datatype12Get_contentsEiiiPiPlPS0_]+0x68): undefined reference to `MPI_Type_get_contents'
  2692. CMakeFiles/vtkxdmf2.dir/XdmfArray.cxx.o: In function `MPI::Datatype::Get_attr(int, void*) const':
  2693. XdmfArray.cxx:(.text._ZNK3MPI8Datatype8Get_attrEiPv[_ZNK3MPI8Datatype8Get_attrEiPv]+0xe): undefined reference to `MPI_Type_get_attr'
  2694. CMakeFiles/vtkxdmf2.dir/XdmfArray.cxx.o: In function `MPI::Datatype::Delete_attr(int)':
  2695. XdmfArray.cxx:(.text._ZN3MPI8Datatype11Delete_attrEi[_ZN3MPI8Datatype11Delete_attrEi]+0x5): undefined reference to `MPI_Type_delete_attr'
  2696. CMakeFiles/vtkxdmf2.dir/XdmfArray.cxx.o: In function `MPI::Datatype::Dup() const':
  2697. XdmfArray.cxx:(.text._ZNK3MPI8Datatype3DupEv[_ZNK3MPI8Datatype3DupEv]+0x12): undefined reference to `MPI_Type_dup'
  2698. CMakeFiles/vtkxdmf2.dir/XdmfArray.cxx.o: In function `MPI::Datatype::Create_darray(int, int, int, int const*, int const*, int const*, int const*, int) const':
  2699. XdmfArray.cxx:(.text._ZNK3MPI8Datatype13Create_darrayEiiiPKiS2_S2_S2_i[_ZNK3MPI8Datatype13Create_darrayEiiiPKiS2_S2_S2_i]+0x43): undefined reference to `MPI_Type_create_darray'
  2700. CMakeFiles/vtkxdmf2.dir/XdmfArray.cxx.o: In function `MPI::Datatype::Create_subarray(int, int const*, int const*, int const*, int) const':
  2701. XdmfArray.cxx:(.text._ZNK3MPI8Datatype15Create_subarrayEiPKiS2_S2_i[_ZNK3MPI8Datatype15Create_subarrayEiPKiS2_S2_i]+0x29): undefined reference to `MPI_Type_create_subarray'
  2702. CMakeFiles/vtkxdmf2.dir/XdmfArray.cxx.o: In function `MPI::Datatype::Unpack_external(char const*, void const*, long, long&, void*, int) const':
  2703. XdmfArray.cxx:(.text._ZNK3MPI8Datatype15Unpack_externalEPKcPKvlRlPvi[_ZNK3MPI8Datatype15Unpack_externalEPKcPKvlRlPvi]+0x21): undefined reference to `MPI_Unpack_external'
  2704. CMakeFiles/vtkxdmf2.dir/XdmfArray.cxx.o: In function `MPI::Datatype::Pack_external_size(char const*, int) const':
  2705. XdmfArray.cxx:(.text._ZNK3MPI8Datatype18Pack_external_sizeEPKci[_ZNK3MPI8Datatype18Pack_external_sizeEPKci]+0x16): undefined reference to `MPI_Pack_external_size'
  2706. CMakeFiles/vtkxdmf2.dir/XdmfArray.cxx.o: In function `MPI::Datatype::Pack_external(char const*, void const*, int, void*, long, long&) const':
  2707. XdmfArray.cxx:(.text._ZNK3MPI8Datatype13Pack_externalEPKcPKviPvlRl[_ZNK3MPI8Datatype13Pack_externalEPKcPKviPvlRl]+0x10): undefined reference to `MPI_Pack_external'
  2708. CMakeFiles/vtkxdmf2.dir/XdmfArray.cxx.o: In function `MPI::Datatype::Pack_size(int, MPI::Comm const&) const':
  2709. XdmfArray.cxx:(.text._ZNK3MPI8Datatype9Pack_sizeEiRKNS_4CommE[_ZNK3MPI8Datatype9Pack_sizeEiRKNS_4CommE]+0x16): undefined reference to `MPI_Pack_size'
  2710. CMakeFiles/vtkxdmf2.dir/XdmfArray.cxx.o: In function `MPI::Datatype::Unpack(void const*, int, void*, int, int&, MPI::Comm const&) const':
  2711. XdmfArray.cxx:(.text._ZNK3MPI8Datatype6UnpackEPKviPviRiRKNS_4CommE[_ZNK3MPI8Datatype6UnpackEPKviPviRiRKNS_4CommE]+0x1e): undefined reference to `MPI_Unpack'
  2712. CMakeFiles/vtkxdmf2.dir/XdmfArray.cxx.o: In function `MPI::Datatype::Pack(void const*, int, void*, int, int&, MPI::Comm const&) const':
  2713. XdmfArray.cxx:(.text._ZNK3MPI8Datatype4PackEPKviPviRiRKNS_4CommE[_ZNK3MPI8Datatype4PackEPKviPviRiRKNS_4CommE]+0x1b): undefined reference to `MPI_Pack'
  2714. CMakeFiles/vtkxdmf2.dir/XdmfArray.cxx.o: In function `MPI::Datatype::Commit()':
  2715. XdmfArray.cxx:(.text._ZN3MPI8Datatype6CommitEv[_ZN3MPI8Datatype6CommitEv]+0x5): undefined reference to `MPI_Type_commit'
  2716. CMakeFiles/vtkxdmf2.dir/XdmfArray.cxx.o: In function `MPI::Datatype::Get_true_extent(long&, long&) const':
  2717. XdmfArray.cxx:(.text._ZNK3MPI8Datatype15Get_true_extentERlS1_[_ZNK3MPI8Datatype15Get_true_extentERlS1_]+0x5): undefined reference to `MPI_Type_get_true_extent'
  2718. CMakeFiles/vtkxdmf2.dir/XdmfArray.cxx.o: In function `MPI::Datatype::Get_extent(long&, long&) const':
  2719. XdmfArray.cxx:(.text._ZNK3MPI8Datatype10Get_extentERlS1_[_ZNK3MPI8Datatype10Get_extentERlS1_]+0x5): undefined reference to `MPI_Type_get_extent'
  2720. CMakeFiles/vtkxdmf2.dir/XdmfArray.cxx.o: In function `MPI::Datatype::Get_size() const':
  2721. XdmfArray.cxx:(.text._ZNK3MPI8Datatype8Get_sizeEv[_ZNK3MPI8Datatype8Get_sizeEv]+0xe): undefined reference to `MPI_Type_size'
  2722. CMakeFiles/vtkxdmf2.dir/XdmfArray.cxx.o: In function `MPI::Datatype::Create_resized(long, long) const':
  2723. XdmfArray.cxx:(.text._ZNK3MPI8Datatype14Create_resizedEll[_ZNK3MPI8Datatype14Create_resizedEll]+0x1b): undefined reference to `MPI_Type_create_resized'
  2724. CMakeFiles/vtkxdmf2.dir/XdmfArray.cxx.o: In function `MPI::Datatype::Create_indexed_block(int, int, int const*) const':
  2725. XdmfArray.cxx:(.text._ZNK3MPI8Datatype20Create_indexed_blockEiiPKi[_ZNK3MPI8Datatype20Create_indexed_blockEiiPKi]+0x1b): undefined reference to `MPI_Type_create_indexed_block'
  2726. CMakeFiles/vtkxdmf2.dir/XdmfArray.cxx.o: In function `MPI::Datatype::Create_hvector(int, int, long) const':
  2727. XdmfArray.cxx:(.text._ZNK3MPI8Datatype14Create_hvectorEiil[_ZNK3MPI8Datatype14Create_hvectorEiil]+0x1b): undefined reference to `MPI_Type_create_hvector'
  2728. CMakeFiles/vtkxdmf2.dir/XdmfArray.cxx.o: In function `MPI::Datatype::Create_hindexed(int, int const*, long const*) const':
  2729. XdmfArray.cxx:(.text._ZNK3MPI8Datatype15Create_hindexedEiPKiPKl[_ZNK3MPI8Datatype15Create_hindexedEiPKiPKl]+0x1d): undefined reference to `MPI_Type_create_hindexed'
  2730. CMakeFiles/vtkxdmf2.dir/XdmfArray.cxx.o: In function `MPI::Datatype::Create_indexed(int, int const*, int const*) const':
  2731. XdmfArray.cxx:(.text._ZNK3MPI8Datatype14Create_indexedEiPKiS2_[_ZNK3MPI8Datatype14Create_indexedEiPKiS2_]+0x1d): undefined reference to `MPI_Type_indexed'
  2732. CMakeFiles/vtkxdmf2.dir/XdmfArray.cxx.o: In function `MPI::Datatype::Create_vector(int, int, int) const':
  2733. XdmfArray.cxx:(.text._ZNK3MPI8Datatype13Create_vectorEiii[_ZNK3MPI8Datatype13Create_vectorEiii]+0x1b): undefined reference to `MPI_Type_vector'
  2734. CMakeFiles/vtkxdmf2.dir/XdmfArray.cxx.o: In function `MPI::Datatype::Create_contiguous(int) const':
  2735. XdmfArray.cxx:(.text._ZNK3MPI8Datatype17Create_contiguousEi[_ZNK3MPI8Datatype17Create_contiguousEi]+0x14): undefined reference to `MPI_Type_contiguous'
  2736. CMakeFiles/vtkxdmf2.dir/XdmfArray.cxx.o: In function `MPI::Intracomm::Spawn_multiple(int, char const**, char const***, int const*, MPI::Info const*, int)':
  2737. XdmfArray.cxx:(.text._ZN3MPI9Intracomm14Spawn_multipleEiPPKcPS3_PKiPKNS_4InfoEi[_ZN3MPI9Intracomm14Spawn_multipleEiPPKcPS3_PKiPKNS_4InfoEi]+0xb7): undefined reference to `MPI_Comm_spawn_multiple'
  2738. CMakeFiles/vtkxdmf2.dir/XdmfArray.cxx.o: In function `MPI::Intracomm::Create(MPI::Group const&) const':
  2739. XdmfArray.cxx:(.text._ZNK3MPI9Intracomm6CreateERKNS_5GroupE[_ZNK3MPI9Intracomm6CreateERKNS_5GroupE]+0x27): undefined reference to `MPI_Comm_create'
  2740. XdmfArray.cxx:(.text._ZNK3MPI9Intracomm6CreateERKNS_5GroupE[_ZNK3MPI9Intracomm6CreateERKNS_5GroupE]+0x34): undefined reference to `MPI::Comm::Comm()'
  2741. XdmfArray.cxx:(.text._ZNK3MPI9Intracomm6CreateERKNS_5GroupE[_ZNK3MPI9Intracomm6CreateERKNS_5GroupE]+0x53): undefined reference to `MPI_Initialized'
  2742. XdmfArray.cxx:(.text._ZNK3MPI9Intracomm6CreateERKNS_5GroupE[_ZNK3MPI9Intracomm6CreateERKNS_5GroupE]+0x62): undefined reference to `ompi_mpi_comm_null'
  2743. XdmfArray.cxx:(.text._ZNK3MPI9Intracomm6CreateERKNS_5GroupE[_ZNK3MPI9Intracomm6CreateERKNS_5GroupE]+0x72): undefined reference to `MPI_Comm_test_inter'
  2744. CMakeFiles/vtkxdmf2.dir/XdmfArray.cxx.o: In function `MPI::Intracomm::Clone() const':
  2745. XdmfArray.cxx:(.text._ZNK3MPI9Intracomm5CloneEv[_ZNK3MPI9Intracomm5CloneEv]+0x1d): undefined reference to `MPI_Comm_dup'
  2746. XdmfArray.cxx:(.text._ZNK3MPI9Intracomm5CloneEv[_ZNK3MPI9Intracomm5CloneEv]+0x37): undefined reference to `MPI::Comm::Comm()'
  2747. XdmfArray.cxx:(.text._ZNK3MPI9Intracomm5CloneEv[_ZNK3MPI9Intracomm5CloneEv]+0x56): undefined reference to `MPI_Initialized'
  2748. XdmfArray.cxx:(.text._ZNK3MPI9Intracomm5CloneEv[_ZNK3MPI9Intracomm5CloneEv]+0x65): undefined reference to `ompi_mpi_comm_null'
  2749. XdmfArray.cxx:(.text._ZNK3MPI9Intracomm5CloneEv[_ZNK3MPI9Intracomm5CloneEv]+0x75): undefined reference to `MPI_Comm_test_inter'
  2750. CMakeFiles/vtkxdmf2.dir/XdmfArray.cxx.o: In function `MPI::Intercomm::Merge(bool) const':
  2751. XdmfArray.cxx:(.text._ZNK3MPI9Intercomm5MergeEb[_ZNK3MPI9Intercomm5MergeEb]+0x25): undefined reference to `MPI_Intercomm_merge'
  2752. XdmfArray.cxx:(.text._ZNK3MPI9Intercomm5MergeEb[_ZNK3MPI9Intercomm5MergeEb]+0x32): undefined reference to `MPI::Comm::Comm()'
  2753. XdmfArray.cxx:(.text._ZNK3MPI9Intercomm5MergeEb[_ZNK3MPI9Intercomm5MergeEb]+0x51): undefined reference to `MPI_Initialized'
  2754. XdmfArray.cxx:(.text._ZNK3MPI9Intercomm5MergeEb[_ZNK3MPI9Intercomm5MergeEb]+0x62): undefined reference to `ompi_mpi_comm_null'
  2755. XdmfArray.cxx:(.text._ZNK3MPI9Intercomm5MergeEb[_ZNK3MPI9Intercomm5MergeEb]+0x72): undefined reference to `MPI_Comm_test_inter'
  2756. CMakeFiles/vtkxdmf2.dir/XdmfArray.cxx.o: In function `MPI::Intracomm::Split(int, int) const':
  2757. XdmfArray.cxx:(.text._ZNK3MPI9Intracomm5SplitEii[_ZNK3MPI9Intracomm5SplitEii]+0x26): undefined reference to `MPI_Comm_split'
  2758. XdmfArray.cxx:(.text._ZNK3MPI9Intracomm5SplitEii[_ZNK3MPI9Intracomm5SplitEii]+0x33): undefined reference to `MPI::Comm::Comm()'
  2759. XdmfArray.cxx:(.text._ZNK3MPI9Intracomm5SplitEii[_ZNK3MPI9Intracomm5SplitEii]+0x52): undefined reference to `MPI_Initialized'
  2760. XdmfArray.cxx:(.text._ZNK3MPI9Intracomm5SplitEii[_ZNK3MPI9Intracomm5SplitEii]+0x63): undefined reference to `ompi_mpi_comm_null'
  2761. XdmfArray.cxx:(.text._ZNK3MPI9Intracomm5SplitEii[_ZNK3MPI9Intracomm5SplitEii]+0x73): undefined reference to `MPI_Comm_test_inter'
  2762. CMakeFiles/vtkxdmf2.dir/XdmfArray.cxx.o: In function `MPI::Cartcomm::Sub(bool const*) const':
  2763. XdmfArray.cxx:(.text._ZNK3MPI8Cartcomm3SubEPKb[_ZNK3MPI8Cartcomm3SubEPKb]+0x1b): undefined reference to `MPI_Cartdim_get'
  2764. XdmfArray.cxx:(.text._ZNK3MPI8Cartcomm3SubEPKb[_ZNK3MPI8Cartcomm3SubEPKb]+0x65): undefined reference to `MPI_Cart_sub'
  2765. XdmfArray.cxx:(.text._ZNK3MPI8Cartcomm3SubEPKb[_ZNK3MPI8Cartcomm3SubEPKb]+0x7a): undefined reference to `MPI::Comm::Comm()'
  2766. XdmfArray.cxx:(.text._ZNK3MPI8Cartcomm3SubEPKb[_ZNK3MPI8Cartcomm3SubEPKb]+0x9b): undefined reference to `MPI_Initialized'
  2767. XdmfArray.cxx:(.text._ZNK3MPI8Cartcomm3SubEPKb[_ZNK3MPI8Cartcomm3SubEPKb]+0xb1): undefined reference to `ompi_mpi_comm_null'
  2768. XdmfArray.cxx:(.text._ZNK3MPI8Cartcomm3SubEPKb[_ZNK3MPI8Cartcomm3SubEPKb]+0xc0): undefined reference to `MPI_Topo_test'
  2769. CMakeFiles/vtkxdmf2.dir/XdmfArray.cxx.o: In function `MPI::Intracomm::Create_cart(int, int const*, bool const*, bool) const':
  2770. XdmfArray.cxx:(.text._ZNK3MPI9Intracomm11Create_cartEiPKiPKbb[_ZNK3MPI9Intracomm11Create_cartEiPKiPKbb]+0x79): undefined reference to `MPI_Cart_create'
  2771. XdmfArray.cxx:(.text._ZNK3MPI9Intracomm11Create_cartEiPKiPKbb[_ZNK3MPI9Intracomm11Create_cartEiPKiPKbb]+0x8e): undefined reference to `MPI::Comm::Comm()'
  2772. XdmfArray.cxx:(.text._ZNK3MPI9Intracomm11Create_cartEiPKiPKbb[_ZNK3MPI9Intracomm11Create_cartEiPKiPKbb]+0xaf): undefined reference to `MPI_Initialized'
  2773. XdmfArray.cxx:(.text._ZNK3MPI9Intracomm11Create_cartEiPKiPKbb[_ZNK3MPI9Intracomm11Create_cartEiPKiPKbb]+0xc3): undefined reference to `ompi_mpi_comm_null'
  2774. XdmfArray.cxx:(.text._ZNK3MPI9Intracomm11Create_cartEiPKiPKbb[_ZNK3MPI9Intracomm11Create_cartEiPKiPKbb]+0xd2): undefined reference to `MPI_Topo_test'
  2775. CMakeFiles/vtkxdmf2.dir/XdmfArray.cxx.o: In function `MPI::Graphcomm::Clone() const':
  2776. XdmfArray.cxx:(.text._ZNK3MPI9Graphcomm5CloneEv[_ZNK3MPI9Graphcomm5CloneEv]+0x10): undefined reference to `MPI_Comm_dup'
  2777. XdmfArray.cxx:(.text._ZNK3MPI9Graphcomm5CloneEv[_ZNK3MPI9Graphcomm5CloneEv]+0x25): undefined reference to `MPI::Comm::Comm()'
  2778. XdmfArray.cxx:(.text._ZNK3MPI9Graphcomm5CloneEv[_ZNK3MPI9Graphcomm5CloneEv]+0x44): undefined reference to `MPI_Initialized'
  2779. XdmfArray.cxx:(.text._ZNK3MPI9Graphcomm5CloneEv[_ZNK3MPI9Graphcomm5CloneEv]+0x58): undefined reference to `ompi_mpi_comm_null'
  2780. XdmfArray.cxx:(.text._ZNK3MPI9Graphcomm5CloneEv[_ZNK3MPI9Graphcomm5CloneEv]+0x65): undefined reference to `MPI_Topo_test'
  2781. CMakeFiles/vtkxdmf2.dir/XdmfArray.cxx.o: In function `MPI::Intracomm::Create_graph(int, int const*, int const*, bool) const':
  2782. XdmfArray.cxx:(.text._ZNK3MPI9Intracomm12Create_graphEiPKiS2_b[_ZNK3MPI9Intracomm12Create_graphEiPKiS2_b]+0x21): undefined reference to `MPI_Graph_create'
  2783. XdmfArray.cxx:(.text._ZNK3MPI9Intracomm12Create_graphEiPKiS2_b[_ZNK3MPI9Intracomm12Create_graphEiPKiS2_b]+0x29): undefined reference to `MPI::Comm::Comm()'
  2784. XdmfArray.cxx:(.text._ZNK3MPI9Intracomm12Create_graphEiPKiS2_b[_ZNK3MPI9Intracomm12Create_graphEiPKiS2_b]+0x48): undefined reference to `MPI_Initialized'
  2785. XdmfArray.cxx:(.text._ZNK3MPI9Intracomm12Create_graphEiPKiS2_b[_ZNK3MPI9Intracomm12Create_graphEiPKiS2_b]+0x5c): undefined reference to `ompi_mpi_comm_null'
  2786. XdmfArray.cxx:(.text._ZNK3MPI9Intracomm12Create_graphEiPKiS2_b[_ZNK3MPI9Intracomm12Create_graphEiPKiS2_b]+0x69): undefined reference to `MPI_Topo_test'
  2787. CMakeFiles/vtkxdmf2.dir/XdmfArray.cxx.o: In function `MPI::Cartcomm::Clone() const':
  2788. XdmfArray.cxx:(.text._ZNK3MPI8Cartcomm5CloneEv[_ZNK3MPI8Cartcomm5CloneEv]+0x10): undefined reference to `MPI_Comm_dup'
  2789. XdmfArray.cxx:(.text._ZNK3MPI8Cartcomm5CloneEv[_ZNK3MPI8Cartcomm5CloneEv]+0x25): undefined reference to `MPI::Comm::Comm()'
  2790. XdmfArray.cxx:(.text._ZNK3MPI8Cartcomm5CloneEv[_ZNK3MPI8Cartcomm5CloneEv]+0x44): undefined reference to `MPI_Initialized'
  2791. XdmfArray.cxx:(.text._ZNK3MPI8Cartcomm5CloneEv[_ZNK3MPI8Cartcomm5CloneEv]+0x58): undefined reference to `ompi_mpi_comm_null'
  2792. XdmfArray.cxx:(.text._ZNK3MPI8Cartcomm5CloneEv[_ZNK3MPI8Cartcomm5CloneEv]+0x65): undefined reference to `MPI_Topo_test'
  2793. CMakeFiles/vtkxdmf2.dir/XdmfArray.cxx.o:(.data.rel.ro._ZTVN3MPI8DatatypeE[_ZTVN3MPI8DatatypeE]+0x78): undefined reference to `MPI::Datatype::Free()'
  2794. CMakeFiles/vtkxdmf2.dir/XdmfArray.cxx.o:(.data.rel.ro._ZTVN3MPI3WinE[_ZTVN3MPI3WinE]+0x48): undefined reference to `MPI::Win::Free()'
  2795. CMakeFiles/vtkxdmf2.dir/XdmfHDF.cxx.o: In function `XdmfHDF::XdmfHDF()':
  2796. XdmfHDF.cxx:(.text+0xbfe): undefined reference to `MPI_Initialized'
  2797. XdmfHDF.cxx:(.text+0xc43): undefined reference to `ompi_mpi_comm_world'
  2798. XdmfHDF.cxx:(.text+0xc4d): undefined reference to `MPI_Comm_size'
  2799. CMakeFiles/vtkxdmf2.dir/XdmfHDF.cxx.o: In function `XdmfHDF::DoOpen(char const*, char const*)':
  2800. XdmfHDF.cxx:(.text+0x3c7f): undefined reference to `ompi_mpi_info_null'
  2801. XdmfHDF.cxx:(.text+0x3c86): undefined reference to `ompi_mpi_comm_world'
  2802. collect2: Fehler: ld gab 1 als Ende-Status zurück
  2803. make[2]: *** [lib/libvtkxdmf2-pv3.98.so.1] Fehler 1
  2804. make[1]: *** [VTK/ThirdParty/xdmf2/vtkxdmf2/libsrc/CMakeFiles/vtkxdmf2.dir/all] Fehler 2
  2805. make[1]: *** Warte auf noch nicht beendete Prozesse...
  2806. Linking CXX shared module ../../../lib/MPIPython.so
  2807. [  5%] Built target MPIPython
  2808. make: *** [all] Fehler 2
  2809. ==> FEHLER: Ein Fehler geschah in build().
  2810.     Breche ab ...
clone this paste RAW Paste Data