Guest User

Untitled

a guest
Jan 14th, 2013
70
0
Never
Not a member of Pastebin yet? Sign Up, it unlocks many cool features!
text 3.52 KB | None | 0 0
  1. [INFO]
  2. [INFO] --- maven-remote-resources-plugin:1.3:process (default) @ cloud-utils ---
  3. [INFO]
  4. [INFO] --- maven-resources-plugin:2.5:resources (default-resources) @ cloud-utils ---
  5. [debug] execute contextualize
  6. [INFO] Using 'UTF-8' encoding to copy filtered resources.
  7. [INFO] Copying 1 resource
  8. [INFO] Copying 3 resources
  9. [INFO]
  10. [INFO] --- maven-compiler-plugin:2.5.1:compile (default-compile) @ cloud-utils ---
  11. [INFO] Compiling 18 source files to /home/employee/wido/repos/cloudstack/utils/target/classes
  12. [INFO] -------------------------------------------------------------
  13. [ERROR] COMPILATION ERROR :
  14. [INFO] -------------------------------------------------------------
  15. [ERROR] /home/employee/wido/repos/cloudstack/utils/src/com/cloud/utils/component/ComponentLocator.java:[201,23] cannot find symbol
  16. symbol : method putAll(java.util.Map<java.lang.String,com.cloud.utils.component.ComponentLocator.ComponentInfo<com.cloud.utils.db.GenericDao<?,?>>>)
  17. location: class java.util.LinkedHashMap<java.lang.String,com.cloud.utils.component.ComponentLocator.ComponentInfo<com.cloud.utils.db.GenericDao<?,? extends java.io.Serializable>>>
  18. [ERROR] /home/employee/wido/repos/cloudstack/utils/src/com/cloud/utils/component/ComponentLocator.java:[721,27] cannot find symbol
  19. symbol : method putAll(java.util.Map<java.lang.String,com.cloud.utils.component.ComponentLocator.ComponentInfo<com.cloud.utils.db.GenericDao<?,?>>>)
  20. location: class java.util.LinkedHashMap<java.lang.String,com.cloud.utils.component.ComponentLocator.ComponentInfo<com.cloud.utils.db.GenericDao<?,? extends java.io.Serializable>>>
  21. [INFO] 2 errors
  22. [INFO] -------------------------------------------------------------
  23. [INFO] ------------------------------------------------------------------------
  24. [INFO] BUILD FAILURE
  25. [INFO] ------------------------------------------------------------------------
  26. [INFO] Total time: 6.169s
  27. [INFO] Finished at: Mon Jan 14 16:49:31 CET 2013
  28. [INFO] Final Memory: 13M/240M
  29. [INFO] ------------------------------------------------------------------------
  30. [ERROR] Failed to execute goal org.apache.maven.plugins:maven-compiler-plugin:2.5.1:compile (default-compile) on project cloud-utils: Compilation failure: Compilation failure:
  31. [ERROR] /home/employee/wido/repos/cloudstack/utils/src/com/cloud/utils/component/ComponentLocator.java:[201,23] cannot find symbol
  32. [ERROR] symbol : method putAll(java.util.Map<java.lang.String,com.cloud.utils.component.ComponentLocator.ComponentInfo<com.cloud.utils.db.GenericDao<?,?>>>)
  33. [ERROR] location: class java.util.LinkedHashMap<java.lang.String,com.cloud.utils.component.ComponentLocator.ComponentInfo<com.cloud.utils.db.GenericDao<?,? extends java.io.Serializable>>>
  34. [ERROR] /home/employee/wido/repos/cloudstack/utils/src/com/cloud/utils/component/ComponentLocator.java:[721,27] cannot find symbol
  35. [ERROR] symbol : method putAll(java.util.Map<java.lang.String,com.cloud.utils.component.ComponentLocator.ComponentInfo<com.cloud.utils.db.GenericDao<?,?>>>)
  36. [ERROR] location: class java.util.LinkedHashMap<java.lang.String,com.cloud.utils.component.ComponentLocator.ComponentInfo<com.cloud.utils.db.GenericDao<?,? extends java.io.Serializable>>>
  37. [ERROR] -> [Help 1]
  38. [ERROR]
  39. [ERROR] To see the full stack trace of the errors, re-run Maven with the -e switch.
  40. [ERROR] Re-run Maven using the -X switch to enable full debug logging.
  41. [ERROR]
  42. [ERROR] For more information about the errors and possible solutions, please read the following articles:
  43. [ERROR] [Help 1] http://cwiki.apache.org/confluence/display/MAVEN/MojoFailureException
Advertisement
Add Comment
Please, Sign In to add comment