Want more features on Pastebin? Sign Up, it's FREE!
Guest

Untitled

By: a guest on Dec 14th, 2013  |  syntax: None  |  size: 1.47 KB  |  views: 35  |  expires: Never
download  |  raw  |  embed  |  report abuse  |  print
Text below is selected. Please press Ctrl+C to copy to your clipboard. (⌘+C on Mac)
  1. LINK  ppc-softmmu/qemu-system-ppc
  2. | /usr/bin/ld: skipping incompatible /usr/lib/gcc/x86_64-redhat-linux/4.8.2/../../../libX11.so when searching for -lX11
  3. | /usr/bin/ld: skipping incompatible /lib/libX11.so when searching for -lX11
  4. | /usr/bin/ld: skipping incompatible /usr/lib/libX11.so when searching for -lX11
  5. | /usr/bin/ld: cannot find -lX11
  6. | collect2: error: ld returned 1 exit status
  7. | make[1]: *** [qemu-system-ppc] Error 1
  8. | make: *** [subdir-ppc-softmmu] Error 2
  9. |   LINK  x86_64-linux-user/qemu-x86_64
  10. |   LINK  x86_64-softmmu/qemu-system-x86_64
  11. | /usr/bin/ld: skipping incompatible /usr/lib/gcc/x86_64-redhat-linux/4.8.2/../../../libX11.so when searching for -lX11
  12. | /usr/bin/ld: skipping incompatible /lib/libX11.so when searching for -lX11
  13. | /usr/bin/ld: skipping incompatible /usr/lib/libX11.so when searching for -lX11
  14. | /usr/bin/ld: cannot find -lX11
  15. | collect2: error: ld returned 1 exit status
  16. | make[1]: *** [qemu-system-x86_64] Error 1
  17. | make: *** [subdir-x86_64-softmmu] Error 2
  18. | ERROR: oe_runmake failed
  19. | WARNING: /home/jack/dev/poky-dora-10.0.0/build/tmp/work/x86_64-linux/qemu-native/1.5.0-r0/temp/run.do_compile.19195:1 exit 1 from
  20. |   exit 1
  21. | ERROR: Function failed: do_compile (log file is located at /home/jack/dev/poky-dora-10.0.0/build/tmp/work/x86_64-linux/qemu-native/1.5.0-r0/temp/log.do_compile.19195)
  22. ERROR: Task 87 (virtual:native:/home/jack/dev/poky-dora-10.0.0/meta/recipes-devtools/qemu/qemu_1.5.0.bb, do_compile) failed with exit code '1'
clone this paste RAW Paste Data