Guest User

Untitled

a guest
Jul 7th, 2012
70
0
Never
Not a member of Pastebin yet? Sign Up, it unlocks many cool features!
text 10.11 KB | None | 0 0
  1. Yo:~/t/bf/bitfighter-017b root# make
  2. make[1]: Entering directory `/private/var/root/t/bf/bitfighter-017b/tnl'
  3. g++ -DTNL_ENABLE_LOGGING -I../libtomcrypt/src/headers -I../libtomcrypt -O2 -c assert.cpp
  4. In file included from tnl.h:35,
  5. from assert.cpp:27:
  6. tnlTypes.h:40:15: error: new: No such file or directory
  7. tnlTypes.h:336:4: error: #error "TNL: Unsupported Target CPU"
  8. In file included from tnl.h:43,
  9. from assert.cpp:27:
  10. tnlEndian.h:153:2: error: #error "Endian define not set!"
  11. In file included from tnlUDP.h:35,
  12. from tnl.h:51,
  13. from assert.cpp:27:
  14. tnlVector.h:32:18: error: vector: No such file or directory
  15. In file included from tnl.h:51,
  16. from assert.cpp:27:
  17. tnlUDP.h:43:18: error: string: No such file or directory
  18. assert.cpp:31:18: error: cstdio: No such file or directory
  19. In file included from tnl.h:43,
  20. from assert.cpp:27:
  21. tnlEndian.h:158: error: expected constructor, destructor, or type conversion before 'TNL_DECLARE_TEMPLATIZED_ENDIAN_CONV'
  22. In file included from tnlUDP.h:35,
  23. from tnl.h:51,
  24. from assert.cpp:27:
  25. tnlVector.h:62: error: ISO C++ forbids declaration of 'vector' with no type
  26. tnlVector.h:62: error: invalid use of '::'
  27. tnlVector.h:62: error: expected ';' before '<' token
  28. tnlVector.h:67: error: expected unqualified-id before '<' token
  29. tnlVector.h:67: error: expected ',' or '...' before '<' token
  30. tnlVector.h:105: error: ISO C++ forbids declaration of 'vector' with no type
  31. tnlVector.h:105: error: invalid use of '::'
  32. tnlVector.h:105: error: expected ';' before '<' token
  33. tnlVector.h: In constructor 'TNL::Vector<T>::Vector(TNL::U32)':
  34. tnlVector.h:118: error: 'innerVector' was not declared in this scope
  35. tnlVector.h: In copy constructor 'TNL::Vector<T>::Vector(const TNL::Vector<T>&)':
  36. tnlVector.h:123: error: 'innerVector' was not declared in this scope
  37. tnlVector.h:123: error: 'vector' is not a member of 'std'
  38. tnlVector.h:123: error: expected primary-expression before '>' token
  39. tnlVector.h: At global scope:
  40. tnlVector.h:126: error: expected unqualified-id before '<' token
  41. tnlVector.h:126: error: expected ',' or '...' before '<' token
  42. tnlVector.h: In constructor 'TNL::Vector<T>::Vector()':
  43. tnlVector.h:128: error: 'innerVector' was not declared in this scope
  44. tnlVector.h:128: error: 'p' was not declared in this scope
  45. tnlVector.h: In constructor 'TNL::Vector<T>::Vector(const T*, TNL::U32)':
  46. tnlVector.h:133: error: 'innerVector' was not declared in this scope
  47. tnlVector.h:133: error: 'vector' is not a member of 'std'
  48. tnlVector.h:133: error: expected primary-expression before '>' token
  49. tnlVector.h: At global scope:
  50. tnlVector.h:139: error: expected initializer before '<' token
  51. tnlVector.h: In member function 'T* TNL::Vector<T>::address()':
  52. tnlVector.h:146: error: 'innerVector' was not declared in this scope
  53. tnlVector.h:149: error: 'innerVector' was not declared in this scope
  54. tnlVector.h: In member function 'const T* TNL::Vector<T>::address() const':
  55. tnlVector.h:154: error: 'innerVector' was not declared in this scope
  56. tnlVector.h:157: error: 'innerVector' was not declared in this scope
  57. tnlVector.h: In member function 'void TNL::Vector<T>::resize(TNL::U32)':
  58. tnlVector.h:163: error: 'innerVector' was not declared in this scope
  59. tnlVector.h: In member function 'void TNL::Vector<T>::insert(TNL::U32)':
  60. tnlVector.h:170: error: 'innerVector' was not declared in this scope
  61. tnlVector.h: In member function 'void TNL::Vector<T>::insert(TNL::U32, const T&)':
  62. tnlVector.h:177: error: 'innerVector' was not declared in this scope
  63. tnlVector.h: In member function 'void TNL::Vector<T>::erase(TNL::U32)':
  64. tnlVector.h:183: error: 'innerVector' was not declared in this scope
  65. tnlVector.h: In member function 'void TNL::Vector<T>::deleteAndErase(TNL::U32)':
  66. tnlVector.h:190: error: 'innerVector' was not declared in this scope
  67. tnlVector.h: In member function 'void TNL::Vector<T>::erase_fast(TNL::U32)':
  68. tnlVector.h:202: error: 'innerVector' was not declared in this scope
  69. tnlVector.h:203: error: 'swap' is not a member of 'std'
  70. tnlVector.h:204: error: 'innerVector' was not declared in this scope
  71. tnlVector.h: In member function 'void TNL::Vector<T>::deleteAndErase_fast(TNL::U32)':
  72. tnlVector.h:214: error: 'innerVector' was not declared in this scope
  73. tnlVector.h: In member function 'T& TNL::Vector<T>::first()':
  74. tnlVector.h:222: error: 'innerVector' was not declared in this scope
  75. tnlVector.h: In member function 'const T& TNL::Vector<T>::first() const':
  76. tnlVector.h:228: error: 'innerVector' was not declared in this scope
  77. tnlVector.h: In member function 'T& TNL::Vector<T>::last()':
  78. tnlVector.h:234: error: 'innerVector' was not declared in this scope
  79. tnlVector.h: In member function 'const T& TNL::Vector<T>::last() const':
  80. tnlVector.h:240: error: 'innerVector' was not declared in this scope
  81. tnlVector.h: In member function 'void TNL::Vector<T>::clear()':
  82. tnlVector.h:245: error: 'innerVector' was not declared in this scope
  83. tnlVector.h: In member function 'void TNL::Vector<T>::deleteAndClear()':
  84. tnlVector.h:250: error: 'innerVector' was not declared in this scope
  85. tnlVector.h:253: error: 'innerVector' was not declared in this scope
  86. tnlVector.h: In member function 'TNL::Vector<T>& TNL::Vector<T>::operator=(const TNL::Vector<T>&)':
  87. tnlVector.h:258: error: 'innerVector' was not declared in this scope
  88. tnlVector.h: In member function 'TNL::S32 TNL::Vector<T>::size() const':
  89. tnlVector.h:264: error: 'innerVector' was not declared in this scope
  90. tnlVector.h: In member function 'bool TNL::Vector<T>::empty() const':
  91. tnlVector.h:269: error: 'innerVector' was not declared in this scope
  92. tnlVector.h: In member function 'T& TNL::Vector<T>::get(TNL::S32)':
  93. tnlVector.h:275: error: 'innerVector' was not declared in this scope
  94. tnlVector.h: In member function 'const T& TNL::Vector<T>::get(TNL::S32) const':
  95. tnlVector.h:281: error: 'innerVector' was not declared in this scope
  96. tnlVector.h: In member function 'void TNL::Vector<T>::push_front(const T&)':
  97. tnlVector.h:287: error: 'innerVector' was not declared in this scope
  98. tnlVector.h: In member function 'void TNL::Vector<T>::push_back(const T&)':
  99. tnlVector.h:292: error: 'innerVector' was not declared in this scope
  100. tnlVector.h: In member function 'T& TNL::Vector<T>::pop_front()':
  101. tnlVector.h:298: error: 'innerVector' was not declared in this scope
  102. tnlVector.h: In member function 'T& TNL::Vector<T>::pop_back()':
  103. tnlVector.h:306: error: 'innerVector' was not declared in this scope
  104. tnlVector.h: In member function 'T& TNL::Vector<T>::operator[](TNL::U32)':
  105. tnlVector.h:314: error: 'innerVector' was not declared in this scope
  106. tnlVector.h: In member function 'const T& TNL::Vector<T>::operator[](TNL::U32) const':
  107. tnlVector.h:320: error: 'innerVector' was not declared in this scope
  108. tnlVector.h: In member function 'T& TNL::Vector<T>::operator[](TNL::S32)':
  109. tnlVector.h:326: error: 'innerVector' was not declared in this scope
  110. tnlVector.h: In member function 'const T& TNL::Vector<T>::operator[](TNL::S32) const':
  111. tnlVector.h:332: error: 'innerVector' was not declared in this scope
  112. tnlVector.h: In member function 'void TNL::Vector<T>::reserve(TNL::U32)':
  113. tnlVector.h:337: error: 'innerVector' was not declared in this scope
  114. tnlVector.h: In member function 'void TNL::Vector<T>::reverse()':
  115. tnlVector.h:343: error: 'innerVector' was not declared in this scope
  116. tnlVector.h: In member function 'T& TNL::Vector<T>::get(TNL::S32) [with T = bool]':
  117. tnlVector.h:363: error: 'innerVector' was not declared in this scope
  118. tnlVector.h: In member function 'const T& TNL::Vector<T>::get(TNL::S32) const [with T = bool]':
  119. tnlVector.h:369: error: 'innerVector' was not declared in this scope
  120. tnlVector.h: In member function 'T& TNL::Vector<T>::first() [with T = bool]':
  121. tnlVector.h:375: error: 'innerVector' was not declared in this scope
  122. tnlVector.h: In member function 'const T& TNL::Vector<T>::first() const [with T = bool]':
  123. tnlVector.h:382: error: 'innerVector' was not declared in this scope
  124. tnlVector.h: In member function 'T& TNL::Vector<T>::last() [with T = bool]':
  125. tnlVector.h:389: error: 'innerVector' was not declared in this scope
  126. tnlVector.h: In member function 'const T& TNL::Vector<T>::last() const [with T = bool]':
  127. tnlVector.h:396: error: 'innerVector' was not declared in this scope
  128. tnlVector.h: In member function 'T& TNL::Vector<T>::operator[](TNL::U32) [with T = bool]':
  129. tnlVector.h:403: error: 'innerVector' was not declared in this scope
  130. tnlVector.h: In member function 'const T& TNL::Vector<T>::operator[](TNL::U32) const [with T = bool]':
  131. tnlVector.h:409: error: 'innerVector' was not declared in this scope
  132. tnlVector.h: In member function 'T& TNL::Vector<T>::operator[](TNL::S32) [with T = bool]':
  133. tnlVector.h:415: error: 'innerVector' was not declared in this scope
  134. tnlVector.h: In member function 'const T& TNL::Vector<T>::operator[](TNL::S32) const [with T = bool]':
  135. tnlVector.h:421: error: 'innerVector' was not declared in this scope
  136. tnlVector.h: In member function 'T& TNL::Vector<T>::pop_front() [with T = bool]':
  137. tnlVector.h:427: error: 'innerVector' was not declared in this scope
  138. tnlVector.h: In member function 'T& TNL::Vector<T>::pop_back() [with T = bool]':
  139. tnlVector.h:434: error: 'innerVector' was not declared in this scope
  140. In file included from tnl.h:51,
  141. from assert.cpp:27:
  142. tnlUDP.h: At global scope:
  143. tnlUDP.h:105: error: 'std::string' has not been declared
  144. In file included from assert.cpp:29:
  145. tnlLog.h:120: error: 'std::string' has not been declared
  146. tnlLog.h:124: error: 'std::string' has not been declared
  147. tnlLog.h:135: error: ISO C++ forbids declaration of 'FILE' with no type
  148. tnlLog.h:135: error: expected ';' before '*' token
  149. tnlLog.h:141: error: 'std::string' has not been declared
  150. tnlLog.h:190: error: 'string' in namespace 'std' does not name a type
  151. tnlLog.h:191: error: 'string' in namespace 'std' does not name a type
  152. assert.cpp: In function 'const char* TNL::avar(const char*, ...)':
  153. assert.cpp:92: error: 'vsnprintf' was not declared in this scope
  154. make[1]: *** [assert.o] Error 1
  155. make[1]: Leaving directory `/private/var/root/t/bf/bitfighter-017b/tnl'
  156. make: *** [release] Error 2
  157. Yo:~/t/bf/bitfighter-017b root#
Advertisement
Add Comment
Please, Sign In to add comment