Guest User

Untitled

a guest
Nov 21st, 2015
71
0
Never
Not a member of Pastebin yet? Sign Up, it unlocks many cool features!
text 80.61 KB | None | 0 0
  1. Daniels-MacBook-Pro:TestGame mills$ cocos compile -p android
  2. Building mode: debug
  3. Using Eclipse project : /Users/mills/TestGame/proj.android
  4. Android platform not specified, searching a default one...
  5. running: '/Users/mills/Library/Android/sdk/tools/android update project -t android-23 -p /Users/mills/TestGame/proj.android'
  6.  
  7. Updated project.properties
  8. Updated local.properties
  9. Updated file /Users/mills/TestGame/proj.android/proguard-project.txt
  10. Android platform not specified, searching a default one...
  11. running: '/Users/mills/Library/Android/sdk/tools/android update lib-project -p /Users/mills/TestGame/cocos2d/cocos/platform/android/java -t android-23'
  12.  
  13. Updated project.properties
  14. Updated local.properties
  15. Updated file /Users/mills/TestGame/cocos2d/cocos/platform/android/java/proguard-project.txt
  16. Building native...
  17. NDK build mode: debug
  18. NDK_TOOLCHAIN_VERSION: 4.9
  19. running: '/Users/mills/Library/Android/sdk/ndk-bundle/ndk-build -C /Users/mills/TestGame/proj.android -j4 NDK_MODULE_PATH=/Users/mills/TestGame/proj.android/../cocos2d:/Users/mills/TestGame/proj.android/../cocos2d/cocos:/Users/mills/TestGame/proj.android/../cocos2d/external NDK_TOOLCHAIN_VERSION=4.9 NDK_DEBUG=1'
  20.  
  21. Android NDK: WARNING: APP_PLATFORM android-21 is larger than android:minSdkVersion 9 in ./AndroidManifest.xml
  22. make: Entering directory `/Users/mills/TestGame/proj.android'
  23. /Users/mills/Library/Android/sdk/ndk-bundle/build/core/build-binary.mk:466: warning: overriding commands for target `obj/local/armeabi/objs-debug/bullet_static/BulletMultiThreaded/SpuLibspe2Support.o'
  24. /Users/mills/Library/Android/sdk/ndk-bundle/build/core/build-binary.mk:466: warning: ignoring old commands for target `obj/local/armeabi/objs-debug/bullet_static/BulletMultiThreaded/SpuLibspe2Support.o'
  25. [armeabi] Compile++ thumb: cocostudio_static <= WidgetReader.cpp
  26. [armeabi] Compile++ thumb: cocostudio_static <= FlatBuffersSerialize.cpp
  27. [armeabi] Compile++ thumb: cocostudio_static <= WidgetCallBackHandlerProtocol.cpp
  28. [armeabi] Compile++ thumb: cocostudio_static <= CCComExtensionData.cpp
  29. [armeabi] Compile++ thumb: cocostudio_static <= CocoStudio.cpp
  30. [armeabi] Compile++ thumb: cocos_ui_static <= UILayoutComponent.cpp
  31. [armeabi] Compile++ thumb: cocos2dx_internal_static <= atitc.cpp
  32. [armeabi] Compile++ thumb: cocos2dx_internal_static <= base64.cpp
  33. [armeabi] Compile++ thumb: cocos2dx_internal_static <= ccCArray.cpp
  34. [armeabi] Compile thumb : cocos2dx_internal_static <= ccFPSImages.c
  35. [armeabi] Compile++ thumb: cocos2dx_internal_static <= ccRandom.cpp
  36. [armeabi] Compile++ thumb: cocos2dx_internal_static <= ccTypes.cpp
  37. [armeabi] Compile++ thumb: cocos2dx_internal_static <= ccUTF8.cpp
  38. [armeabi] Compile++ thumb: cocos2dx_internal_static <= ccUtils.cpp
  39. [armeabi] Compile++ thumb: cocos2dx_internal_static <= etc1.cpp
  40. [armeabi] Compile++ thumb: cocos2dx_internal_static <= pvr.cpp
  41. [armeabi] Compile++ thumb: cocos2dx_internal_static <= s3tc.cpp
  42. [armeabi] Gdbserver : [arm-linux-androideabi-4.9] libs/armeabi/gdbserver
  43. [armeabi] Gdbsetup : libs/armeabi/gdb.setup
  44. [armeabi] Compile++ thumb: cocos2dcpp_shared <= main.cpp
  45. [armeabi] Compile++ thumb: cocos2dcpp_shared <= AppDelegate.cpp
  46. [armeabi] Compile++ thumb: cocos2dcpp_shared <= HelloWorldScene.cpp
  47. [armeabi] StaticLibrary : libcocos2d.a
  48. [armeabi] Compile++ thumb: cocostudio_static <= CCActionFrame.cpp
  49. [armeabi] Compile++ thumb: cocostudio_static <= CCActionFrameEasing.cpp
  50. [armeabi] Compile++ thumb: cocostudio_static <= CCActionManagerEx.cpp
  51. [armeabi] Compile++ thumb: cocostudio_static <= CCActionNode.cpp
  52. [armeabi] Compile++ thumb: cocostudio_static <= CCActionObject.cpp
  53. [armeabi] Compile++ thumb: cocostudio_static <= CCArmature.cpp
  54. [armeabi] Compile++ thumb: cocostudio_static <= CCBone.cpp
  55. [armeabi] Compile++ thumb: cocostudio_static <= CCArmatureAnimation.cpp
  56. [armeabi] Compile++ thumb: cocostudio_static <= CCProcessBase.cpp
  57. [armeabi] Compile++ thumb: cocostudio_static <= CCTween.cpp
  58. [armeabi] Compile++ thumb: cocostudio_static <= CCDatas.cpp
  59. [armeabi] Compile++ thumb: cocostudio_static <= CCBatchNode.cpp
  60. [armeabi] Compile++ thumb: cocostudio_static <= CCDecorativeDisplay.cpp
  61. [armeabi] Compile++ thumb: cocostudio_static <= CCDisplayFactory.cpp
  62. [armeabi] Compile++ thumb: cocostudio_static <= CCDisplayManager.cpp
  63. [armeabi] Compile++ thumb: cocostudio_static <= CCSkin.cpp
  64. [armeabi] Compile++ thumb: cocostudio_static <= CCColliderDetector.cpp
  65. [armeabi] Compile++ thumb: cocostudio_static <= CCArmatureDataManager.cpp
  66. [armeabi] Compile++ thumb: cocostudio_static <= CCArmatureDefine.cpp
  67. [armeabi] Compile++ thumb: cocostudio_static <= CCDataReaderHelper.cpp
  68. [armeabi] Compile++ thumb: cocostudio_static <= CCSpriteFrameCacheHelper.cpp
  69. [armeabi] Compile++ thumb: cocostudio_static <= CCTransformHelp.cpp
  70. [armeabi] Compile++ thumb: cocostudio_static <= CCUtilMath.cpp
  71. [armeabi] Compile++ thumb: cocostudio_static <= CCComAttribute.cpp
  72. [armeabi] Compile++ thumb: cocostudio_static <= CCComAudio.cpp
  73. [armeabi] Compile++ thumb: cocostudio_static <= CCComController.cpp
  74. [armeabi] Compile++ thumb: cocostudio_static <= CCComRender.cpp
  75. [armeabi] Compile++ thumb: cocostudio_static <= CCInputDelegate.cpp
  76. [armeabi] Compile++ thumb: cocostudio_static <= DictionaryHelper.cpp
  77. [armeabi] Compile++ thumb: cocostudio_static <= CCSGUIReader.cpp
  78. [armeabi] Compile++ thumb: cocostudio_static <= CCSSceneReader.cpp
  79. [armeabi] Compile++ thumb: cocostudio_static <= TriggerBase.cpp
  80. [armeabi] Compile++ thumb: cocostudio_static <= TriggerMng.cpp
  81. [armeabi] Compile++ thumb: cocostudio_static <= TriggerObj.cpp
  82. [armeabi] Compile++ thumb: cocostudio_static <= CocoLoader.cpp
  83. [armeabi] Compile++ thumb: cocostudio_static <= NodeReader.cpp
  84. [armeabi] Compile++ thumb: cocostudio_static <= SingleNodeReader.cpp
  85. [armeabi] Compile++ thumb: cocostudio_static <= SpriteReader.cpp
  86. [armeabi] Compile++ thumb: cocostudio_static <= ParticleReader.cpp
  87. [armeabi] Compile++ thumb: cocostudio_static <= GameMapReader.cpp
  88. [armeabi] Compile++ thumb: cocostudio_static <= ProjectNodeReader.cpp
  89. [armeabi] Compile++ thumb: cocostudio_static <= ComAudioReader.cpp
  90. [armeabi] Compile++ thumb: cocostudio_static <= ButtonReader.cpp
  91. [armeabi] Compile++ thumb: cocostudio_static <= CheckBoxReader.cpp
  92. [armeabi] Compile++ thumb: cocostudio_static <= ImageViewReader.cpp
  93. [armeabi] Compile++ thumb: cocostudio_static <= LayoutReader.cpp
  94. [armeabi] Compile++ thumb: cocostudio_static <= ListViewReader.cpp
  95. [armeabi] Compile++ thumb: cocostudio_static <= LoadingBarReader.cpp
  96. [armeabi] Compile++ thumb: cocostudio_static <= PageViewReader.cpp
  97. [armeabi] Compile++ thumb: cocostudio_static <= ScrollViewReader.cpp
  98. [armeabi] Compile++ thumb: cocostudio_static <= SliderReader.cpp
  99. [armeabi] Compile++ thumb: cocostudio_static <= TextAtlasReader.cpp
  100. [armeabi] Compile++ thumb: cocostudio_static <= TextBMFontReader.cpp
  101. [armeabi] Compile++ thumb: cocostudio_static <= TextFieldReader.cpp
  102. [armeabi] Compile++ thumb: cocostudio_static <= TextReader.cpp
  103. [armeabi] Compile++ thumb: cocostudio_static <= Node3DReader.cpp
  104. [armeabi] Compile++ thumb: cocostudio_static <= Sprite3DReader.cpp
  105. [armeabi] Compile++ thumb: cocostudio_static <= UserCameraReader.cpp
  106. [armeabi] Compile++ thumb: cocostudio_static <= Particle3DReader.cpp
  107. [armeabi] Compile++ thumb: cocostudio_static <= BoneNodeReader.cpp
  108. [armeabi] Compile++ thumb: cocostudio_static <= SkeletonNodeReader.cpp
  109. [armeabi] Compile++ thumb: cocostudio_static <= GameNode3DReader.cpp
  110. [armeabi] Compile++ thumb: cocostudio_static <= Light3DReader.cpp
  111. [armeabi] Compile++ thumb: cocostudio_static <= CCActionTimelineCache.cpp
  112. [armeabi] Compile++ thumb: cocostudio_static <= CCFrame.cpp
  113. [armeabi] Compile++ thumb: cocostudio_static <= CCTimeLine.cpp
  114. [armeabi] Compile++ thumb: cocostudio_static <= CCActionTimeline.cpp
  115. [armeabi] Compile++ thumb: cocostudio_static <= CCActionTimelineNode.cpp
  116. [armeabi] Compile++ thumb: cocostudio_static <= CSLoader.cpp
  117. [armeabi] Compile++ thumb: cocostudio_static <= CCBoneNode.cpp
  118. [armeabi] Compile++ thumb: cocostudio_static <= CCSkeletonNode.cpp
  119. [armeabi] Compile++ thumb: cocostudio_static <= CCSkinNode.cpp
  120. [armeabi] Compile++ thumb: cocostudio_static <= ArmatureNodeReader.cpp
  121. [armeabi] Compile++ thumb: cocosbuilder_static <= CCBAnimationManager.cpp
  122. [armeabi] Compile++ thumb: cocosbuilder_static <= CCBFileLoader.cpp
  123. [armeabi] Compile++ thumb: cocosbuilder_static <= CCBKeyframe.cpp
  124. [armeabi] Compile++ thumb: cocosbuilder_static <= CCBReader.cpp
  125. [armeabi] Compile++ thumb: cocosbuilder_static <= CCBSequence.cpp
  126. [armeabi] Compile++ thumb: cocosbuilder_static <= CCBSequenceProperty.cpp
  127. [armeabi] Compile++ thumb: cocosbuilder_static <= CCControlButtonLoader.cpp
  128. [armeabi] Compile++ thumb: cocosbuilder_static <= CCControlLoader.cpp
  129. [armeabi] Compile++ thumb: cocosbuilder_static <= CCLabelBMFontLoader.cpp
  130. [armeabi] Compile++ thumb: cocosbuilder_static <= CCLabelTTFLoader.cpp
  131. [armeabi] Compile++ thumb: cocosbuilder_static <= CCLayerColorLoader.cpp
  132. [armeabi] Compile++ thumb: cocosbuilder_static <= CCLayerGradientLoader.cpp
  133. [armeabi] Compile++ thumb: cocosbuilder_static <= CCLayerLoader.cpp
  134. [armeabi] Compile++ thumb: cocosbuilder_static <= CCMenuItemImageLoader.cpp
  135. [armeabi] Compile++ thumb: cocosbuilder_static <= CCMenuItemLoader.cpp
  136. [armeabi] Compile++ thumb: cocosbuilder_static <= CCNode+CCBRelativePositioning.cpp
  137. [armeabi] Compile++ thumb: cocosbuilder_static <= CCNodeLoader.cpp
  138. [armeabi] Compile++ thumb: cocosbuilder_static <= CCNodeLoaderLibrary.cpp
  139. [armeabi] Compile++ thumb: cocosbuilder_static <= CCParticleSystemQuadLoader.cpp
  140. [armeabi] Compile++ thumb: cocosbuilder_static <= CCScale9SpriteLoader.cpp
  141. [armeabi] Compile++ thumb: cocosbuilder_static <= CCScrollViewLoader.cpp
  142. [armeabi] Compile++ thumb: cocosbuilder_static <= CCSpriteLoader.cpp
  143. [armeabi] Compile++ thumb: cocos3d_static <= CCRay.cpp
  144. [armeabi] Compile++ thumb: cocos3d_static <= CCAABB.cpp
  145. [armeabi] Compile++ thumb: cocos3d_static <= CCOBB.cpp
  146. [armeabi] Compile++ thumb: cocos3d_static <= CCAnimate3D.cpp
  147. [armeabi] Compile++ thumb: cocos3d_static <= CCAnimation3D.cpp
  148. [armeabi] Compile++ thumb: cocos3d_static <= CCAttachNode.cpp
  149. [armeabi] Compile++ thumb: cocos3d_static <= CCBillBoard.cpp
  150. [armeabi] Compile++ thumb: cocos3d_static <= CCBundle3D.cpp
  151. [armeabi] Compile++ thumb: cocos3d_static <= CCBundleReader.cpp
  152. [armeabi] Compile++ thumb: cocos3d_static <= CCMesh.cpp
  153. [armeabi] Compile++ thumb: cocos3d_static <= CCMeshSkin.cpp
  154. [armeabi] Compile++ thumb: cocos3d_static <= CCMeshVertexIndexData.cpp
  155. [armeabi] Compile++ thumb: cocos3d_static <= CCMotionStreak3D.cpp
  156. [armeabi] Compile++ thumb: cocos3d_static <= CCSprite3DMaterial.cpp
  157. [armeabi] Compile++ thumb: cocos3d_static <= CCObjLoader.cpp
  158. [armeabi] Compile++ thumb: cocos3d_static <= CCSkeleton3D.cpp
  159. [armeabi] Compile++ thumb: cocos3d_static <= CCSprite3D.cpp
  160. [armeabi] Compile++ thumb: cocos3d_static <= CCTerrain.cpp
  161. [armeabi] Compile++ thumb: cocos3d_static <= CCSkybox.cpp
  162. [armeabi] Compile thumb : spine_static <= Animation.c
  163. [armeabi] Compile thumb : spine_static <= AnimationState.c
  164. [armeabi] Compile thumb : spine_static <= AnimationStateData.c
  165. [armeabi] Compile thumb : spine_static <= Atlas.c
  166. [armeabi] Compile thumb : spine_static <= AtlasAttachmentLoader.c
  167. [armeabi] Compile thumb : spine_static <= Attachment.c
  168. [armeabi] Compile thumb : spine_static <= AttachmentLoader.c
  169. [armeabi] Compile thumb : spine_static <= Bone.c
  170. [armeabi] Compile thumb : spine_static <= BoneData.c
  171. [armeabi] Compile thumb : spine_static <= BoundingBoxAttachment.c
  172. [armeabi] Compile thumb : spine_static <= Event.c
  173. [armeabi] Compile thumb : spine_static <= EventData.c
  174. [armeabi] Compile thumb : spine_static <= extension.c
  175. [armeabi] Compile thumb : spine_static <= IkConstraint.c
  176. [armeabi] Compile thumb : spine_static <= IkConstraintData.c
  177. [armeabi] Compile thumb : spine_static <= Json.c
  178. [armeabi] Compile thumb : spine_static <= MeshAttachment.c
  179. [armeabi] Compile++ thumb: spine_static <= PolygonBatch.cpp
  180. [armeabi] Compile thumb : spine_static <= RegionAttachment.c
  181. [armeabi] Compile thumb : spine_static <= Skeleton.c
  182. [armeabi] Compile++ thumb: spine_static <= SkeletonAnimation.cpp
  183. [armeabi] Compile thumb : spine_static <= SkeletonBounds.c
  184. [armeabi] Compile thumb : spine_static <= SkeletonData.c
  185. [armeabi] Compile thumb : spine_static <= SkeletonJson.c
  186. [armeabi] Compile++ thumb: spine_static <= SkeletonRenderer.cpp
  187. [armeabi] Compile thumb : spine_static <= Skin.c
  188. [armeabi] Compile thumb : spine_static <= SkinnedMeshAttachment.c
  189. [armeabi] Compile thumb : spine_static <= Slot.c
  190. [armeabi] Compile thumb : spine_static <= SlotData.c
  191. [armeabi] Compile++ thumb: spine_static <= spine-cocos2dx.cpp
  192. /Users/mills/TestGame/proj.android/../cocos2d/cocos/editor-support/spine/SkeletonRenderer.cpp: In member function 'virtual void spine::SkeletonRenderer::drawSkeleton(const cocos2d::Mat4&, uint32_t)':
  193. /Users/mills/TestGame/proj.android/../cocos2d/cocos/editor-support/spine/SkeletonRenderer.cpp:252:20: warning: 'void cocos2d::DrawPrimitives::setDrawColor4B(GLubyte, GLubyte, GLubyte, GLubyte)' is deprecated (declared at /Users/mills/TestGame/proj.android/../cocos2d/cocos/./2d/CCDrawingPrimitives.h:245) [-Wdeprecated-declarations]
  194. DrawPrimitives::setDrawColor4B(0, 0, 255, 255);
  195. ^
  196. /Users/mills/TestGame/proj.android/../cocos2d/cocos/editor-support/spine/SkeletonRenderer.cpp:252:49: warning: 'void cocos2d::DrawPrimitives::setDrawColor4B(GLubyte, GLubyte, GLubyte, GLubyte)' is deprecated (declared at /Users/mills/TestGame/proj.android/../cocos2d/cocos/./2d/CCDrawingPrimitives.h:245) [-Wdeprecated-declarations]
  197. DrawPrimitives::setDrawColor4B(0, 0, 255, 255);
  198. ^
  199. /Users/mills/TestGame/proj.android/../cocos2d/cocos/editor-support/spine/SkeletonRenderer.cpp:265:21: warning: 'void cocos2d::DrawPrimitives::drawPoly(const cocos2d::Vec2*, unsigned int, bool)' is deprecated (declared at /Users/mills/TestGame/proj.android/../cocos2d/cocos/./2d/CCDrawingPrimitives.h:142) [-Wdeprecated-declarations]
  200. DrawPrimitives::drawPoly(points, 4, true);
  201. ^
  202. /Users/mills/TestGame/proj.android/../cocos2d/cocos/editor-support/spine/SkeletonRenderer.cpp:265:45: warning: 'void cocos2d::DrawPrimitives::drawPoly(const cocos2d::Vec2*, unsigned int, bool)' is deprecated (declared at /Users/mills/TestGame/proj.android/../cocos2d/cocos/./2d/CCDrawingPrimitives.h:142) [-Wdeprecated-declarations]
  203. DrawPrimitives::drawPoly(points, 4, true);
  204. ^
  205. /Users/mills/TestGame/proj.android/../cocos2d/cocos/editor-support/spine/SkeletonRenderer.cpp:271:20: warning: 'void cocos2d::DrawPrimitives::setDrawColor4B(GLubyte, GLubyte, GLubyte, GLubyte)' is deprecated (declared at /Users/mills/TestGame/proj.android/../cocos2d/cocos/./2d/CCDrawingPrimitives.h:245) [-Wdeprecated-declarations]
  206. DrawPrimitives::setDrawColor4B(255, 0, 0, 255);
  207. ^
  208. /Users/mills/TestGame/proj.android/../cocos2d/cocos/editor-support/spine/SkeletonRenderer.cpp:271:49: warning: 'void cocos2d::DrawPrimitives::setDrawColor4B(GLubyte, GLubyte, GLubyte, GLubyte)' is deprecated (declared at /Users/mills/TestGame/proj.android/../cocos2d/cocos/./2d/CCDrawingPrimitives.h:245) [-Wdeprecated-declarations]
  209. DrawPrimitives::setDrawColor4B(255, 0, 0, 255);
  210. ^
  211. /Users/mills/TestGame/proj.android/../cocos2d/cocos/editor-support/spine/SkeletonRenderer.cpp:276:21: warning: 'void cocos2d::DrawPrimitives::drawLine(const cocos2d::Vec2&, const cocos2d::Vec2&)' is deprecated (declared at /Users/mills/TestGame/proj.android/../cocos2d/cocos/./2d/CCDrawingPrimitives.h:115) [-Wdeprecated-declarations]
  212. DrawPrimitives::drawLine(Vec2(bone->worldX, bone->worldY), Vec2(x, y));
  213. ^
  214. /Users/mills/TestGame/proj.android/../cocos2d/cocos/editor-support/spine/SkeletonRenderer.cpp:276:74: warning: 'void cocos2d::DrawPrimitives::drawLine(const cocos2d::Vec2&, const cocos2d::Vec2&)' is deprecated (declared at /Users/mills/TestGame/proj.android/../cocos2d/cocos/./2d/CCDrawingPrimitives.h:115) [-Wdeprecated-declarations]
  215. DrawPrimitives::drawLine(Vec2(bone->worldX, bone->worldY), Vec2(x, y));
  216. ^
  217. /Users/mills/TestGame/proj.android/../cocos2d/cocos/editor-support/spine/SkeletonRenderer.cpp:279:20: warning: 'void cocos2d::DrawPrimitives::setPointSize(GLfloat)' is deprecated (declared at /Users/mills/TestGame/proj.android/../cocos2d/cocos/./2d/CCDrawingPrimitives.h:263) [-Wdeprecated-declarations]
  218. DrawPrimitives::setPointSize(4);
  219. ^
  220. /Users/mills/TestGame/proj.android/../cocos2d/cocos/editor-support/spine/SkeletonRenderer.cpp:279:34: warning: 'void cocos2d::DrawPrimitives::setPointSize(GLfloat)' is deprecated (declared at /Users/mills/TestGame/proj.android/../cocos2d/cocos/./2d/CCDrawingPrimitives.h:263) [-Wdeprecated-declarations]
  221. DrawPrimitives::setPointSize(4);
  222. ^
  223. /Users/mills/TestGame/proj.android/../cocos2d/cocos/editor-support/spine/SkeletonRenderer.cpp:280:20: warning: 'void cocos2d::DrawPrimitives::setDrawColor4B(GLubyte, GLubyte, GLubyte, GLubyte)' is deprecated (declared at /Users/mills/TestGame/proj.android/../cocos2d/cocos/./2d/CCDrawingPrimitives.h:245) [-Wdeprecated-declarations]
  224. DrawPrimitives::setDrawColor4B(0, 0, 255, 255); // Root bone is blue.
  225. ^
  226. /Users/mills/TestGame/proj.android/../cocos2d/cocos/editor-support/spine/SkeletonRenderer.cpp:280:49: warning: 'void cocos2d::DrawPrimitives::setDrawColor4B(GLubyte, GLubyte, GLubyte, GLubyte)' is deprecated (declared at /Users/mills/TestGame/proj.android/../cocos2d/cocos/./2d/CCDrawingPrimitives.h:245) [-Wdeprecated-declarations]
  227. DrawPrimitives::setDrawColor4B(0, 0, 255, 255); // Root bone is blue.
  228. ^
  229. /Users/mills/TestGame/proj.android/../cocos2d/cocos/editor-support/spine/SkeletonRenderer.cpp:283:21: warning: 'void cocos2d::DrawPrimitives::drawPoint(const cocos2d::Vec2&)' is deprecated (declared at /Users/mills/TestGame/proj.android/../cocos2d/cocos/./2d/CCDrawingPrimitives.h:100) [-Wdeprecated-declarations]
  230. DrawPrimitives::drawPoint(Vec2(bone->worldX, bone->worldY));
  231. ^
  232. /Users/mills/TestGame/proj.android/../cocos2d/cocos/editor-support/spine/SkeletonRenderer.cpp:283:63: warning: 'void cocos2d::DrawPrimitives::drawPoint(const cocos2d::Vec2&)' is deprecated (declared at /Users/mills/TestGame/proj.android/../cocos2d/cocos/./2d/CCDrawingPrimitives.h:100) [-Wdeprecated-declarations]
  233. DrawPrimitives::drawPoint(Vec2(bone->worldX, bone->worldY));
  234. ^
  235. /Users/mills/TestGame/proj.android/../cocos2d/cocos/editor-support/spine/SkeletonRenderer.cpp:284:33: warning: 'void cocos2d::DrawPrimitives::setDrawColor4B(GLubyte, GLubyte, GLubyte, GLubyte)' is deprecated (declared at /Users/mills/TestGame/proj.android/../cocos2d/cocos/./2d/CCDrawingPrimitives.h:245) [-Wdeprecated-declarations]
  236. if (i == 0) DrawPrimitives::setDrawColor4B(0, 255, 0, 255);
  237. ^
  238. /Users/mills/TestGame/proj.android/../cocos2d/cocos/editor-support/spine/SkeletonRenderer.cpp:284:62: warning: 'void cocos2d::DrawPrimitives::setDrawColor4B(GLubyte, GLubyte, GLubyte, GLubyte)' is deprecated (declared at /Users/mills/TestGame/proj.android/../cocos2d/cocos/./2d/CCDrawingPrimitives.h:245) [-Wdeprecated-declarations]
  239. if (i == 0) DrawPrimitives::setDrawColor4B(0, 255, 0, 255);
  240. ^
  241. [armeabi] Compile++ thumb: cocos_ui_static <= UIWidget.cpp
  242. [armeabi] Compile++ thumb: cocos_ui_static <= UILayout.cpp
  243. At global scope:
  244. cc1plus: warning: unrecognized command line option "-Wno-extern-c-compat"
  245. cc1plus: warning: unrecognized command line option "-Wno-extern-c-compat"
  246. [armeabi] Compile++ thumb: cocos_ui_static <= UILayoutParameter.cpp
  247. [armeabi] Compile++ thumb: cocos_ui_static <= UILayoutManager.cpp
  248. [armeabi] Compile++ thumb: cocos_ui_static <= CocosGUI.cpp
  249. [armeabi] Compile++ thumb: cocos_ui_static <= UIHelper.cpp
  250. [armeabi] Compile++ thumb: cocos_ui_static <= UIListView.cpp
  251. [armeabi] Compile++ thumb: cocos_ui_static <= UIPageView.cpp
  252. [armeabi] Compile++ thumb: cocos_ui_static <= UIScrollView.cpp
  253. [armeabi] Compile++ thumb: cocos_ui_static <= UIScrollViewBar.cpp
  254. [armeabi] Compile++ thumb: cocos_ui_static <= UIButton.cpp
  255. [armeabi] Compile++ thumb: cocos_ui_static <= UIAbstractCheckButton.cpp
  256. [armeabi] Compile++ thumb: cocos_ui_static <= UICheckBox.cpp
  257. [armeabi] Compile++ thumb: cocos_ui_static <= UIRadioButton.cpp
  258. [armeabi] Compile++ thumb: cocos_ui_static <= UIImageView.cpp
  259. [armeabi] Compile++ thumb: cocos_ui_static <= UIText.cpp
  260. [armeabi] Compile++ thumb: cocos_ui_static <= UITextAtlas.cpp
  261. [armeabi] Compile++ thumb: cocos_ui_static <= UITextBMFont.cpp
  262. [armeabi] Compile++ thumb: cocos_ui_static <= UILoadingBar.cpp
  263. [armeabi] Compile++ thumb: cocos_ui_static <= UISlider.cpp
  264. [armeabi] Compile++ thumb: cocos_ui_static <= UITextField.cpp
  265. [armeabi] Compile++ thumb: cocos_ui_static <= UIRichText.cpp
  266. [armeabi] Compile++ thumb: cocos_ui_static <= UIHBox.cpp
  267. [armeabi] Compile++ thumb: cocos_ui_static <= UIVBox.cpp
  268. [armeabi] Compile++ thumb: cocos_ui_static <= UIRelativeBox.cpp
  269. [armeabi] Compile++ thumb: cocos_ui_static <= UIVideoPlayer-android.cpp
  270. [armeabi] Compile++ thumb: cocos_ui_static <= UIDeprecated.cpp
  271. [armeabi] Compile++ thumb: cocos_ui_static <= UIScale9Sprite.cpp
  272. [armeabi] Compile++ thumb: cocos_ui_static <= UIWebView.cpp
  273. [armeabi] Compile++ thumb: cocos_ui_static <= UIWebViewImpl-android.cpp
  274. [armeabi] Compile++ thumb: cocos_ui_static <= UIEditBox.cpp
  275. [armeabi] Compile++ thumb: cocos_ui_static <= UIEditBoxImpl-android.cpp
  276. [armeabi] Compile++ thumb: cocos_ui_static <= UIEditBoxImpl-common.cpp
  277. [armeabi] Compile++ thumb: cocosdenshion_static <= cddSimpleAudioEngine.cpp
  278. [armeabi] Compile++ thumb: cocosdenshion_static <= ccdandroidUtils.cpp
  279. [armeabi] Compile++ thumb: cocosdenshion_static <= cddandroidAndroidJavaEngine.cpp
  280. /Users/mills/TestGame/proj.android/../cocos2d/cocos/audio/android/jni/cddandroidAndroidJavaEngine.cpp: In function 'void _jni_preloadEffect(const char*)':
  281. /Users/mills/TestGame/proj.android/../cocos2d/cocos/audio/android/jni/cddandroidAndroidJavaEngine.cpp:338:41: warning: deprecated conversion from string constant to 'char*' [-Wwrite-strings]
  282. loadEffect(filePath, "preloadEffect");
  283. ^
  284. /Users/mills/TestGame/proj.android/../cocos2d/cocos/audio/android/jni/cddandroidAndroidJavaEngine.cpp: In function 'void _jni_unloadEffect(const char*)':
  285. /Users/mills/TestGame/proj.android/../cocos2d/cocos/audio/android/jni/cddandroidAndroidJavaEngine.cpp:342:40: warning: deprecated conversion from string constant to 'char*' [-Wwrite-strings]
  286. loadEffect(filePath, "unloadEffect");
  287. ^
  288. [armeabi] Compile++ thumb: cocos_flatbuffers_static <= flatc.cpp
  289. [armeabi] Compile++ thumb: cocos_flatbuffers_static <= idl_gen_cpp.cpp
  290. [armeabi] Compile++ thumb: cocos_flatbuffers_static <= idl_gen_fbs.cpp
  291. [armeabi] Compile++ thumb: cocos_flatbuffers_static <= idl_gen_general.cpp
  292. [armeabi] Compile++ thumb: cocos_flatbuffers_static <= idl_gen_go.cpp
  293. [armeabi] Compile++ thumb: cocos_flatbuffers_static <= idl_gen_text.cpp
  294. [armeabi] Compile++ thumb: cocos_flatbuffers_static <= idl_parser.cpp
  295. [armeabi] Compile++ thumb: cocos_extension_static <= AssetsManager.cpp
  296. [armeabi] Compile++ thumb: cocos_extension_static <= Manifest.cpp
  297. [armeabi] Compile++ thumb: cocos_extension_static <= AssetsManagerEx.cpp
  298. [armeabi] Compile++ thumb: cocos_extension_static <= CCEventAssetsManagerEx.cpp
  299. [armeabi] Compile++ thumb: cocos_extension_static <= CCEventListenerAssetsManagerEx.cpp
  300. In file included from /Users/mills/TestGame/proj.android/../cocos2d/cocos/./base/CCEventDispatcher.h:34:0,
  301. from /Users/mills/TestGame/proj.android/../cocos2d/extensions/assets-manager/AssetsManagerEx.h:32,
  302. from /Users/mills/TestGame/proj.android/../cocos2d/extensions/assets-manager/AssetsManagerEx.cpp:24:
  303. /Users/mills/TestGame/proj.android/../cocos2d/extensions/assets-manager/AssetsManagerEx.cpp: In member function 'void cocos2d::extension::AssetsManagerEx::downloadFailedAssets()':
  304. /Users/mills/TestGame/proj.android/../cocos2d/cocos/./platform/CCPlatformMacros.h:234:67: warning: format '%lu' expects argument of type 'long unsigned int', but argument 2 has type 'std::unordered_map<std::basic_string<char>, cocos2d::extension::DownloadUnit>::size_type {aka unsigned int}' [-Wformat=]
  305. #define CCLOG(format, ...) cocos2d::log(format, ##__VA_ARGS__)
  306. ^
  307. /Users/mills/TestGame/proj.android/../cocos2d/extensions/assets-manager/AssetsManagerEx.cpp:826:5: note: in expansion of macro 'CCLOG'
  308. CCLOG("AssetsManagerEx : Start update %lu failed assets.\n", _failedUnits.size());
  309. ^
  310. [armeabi] Compile++ thumb: cocos_extension_static <= CCControl.cpp
  311. [armeabi] Compile++ thumb: cocos_extension_static <= CCControlButton.cpp
  312. At global scope:
  313. cc1plus: warning: unrecognized command line option "-Wno-extern-c-compat"
  314. cc1plus: warning: unrecognized command line option "-Wno-extern-c-compat"
  315. [armeabi] Compile++ thumb: cocos_extension_static <= CCControlColourPicker.cpp
  316. [armeabi] Compile++ thumb: cocos_extension_static <= CCControlHuePicker.cpp
  317. [armeabi] Compile++ thumb: cocos_extension_static <= CCControlPotentiometer.cpp
  318. [armeabi] Compile++ thumb: cocos_extension_static <= CCControlSaturationBrightnessPicker.cpp
  319. [armeabi] Compile++ thumb: cocos_extension_static <= CCControlSlider.cpp
  320. [armeabi] Compile++ thumb: cocos_extension_static <= CCControlStepper.cpp
  321. [armeabi] Compile++ thumb: cocos_extension_static <= CCControlSwitch.cpp
  322. [armeabi] Compile++ thumb: cocos_extension_static <= CCControlUtils.cpp
  323. [armeabi] Compile++ thumb: cocos_extension_static <= CCInvocation.cpp
  324. [armeabi] Compile++ thumb: cocos_extension_static <= CCScrollView.cpp
  325. [armeabi] Compile++ thumb: cocos_extension_static <= CCTableView.cpp
  326. [armeabi] Compile++ thumb: cocos_extension_static <= CCTableViewCell.cpp
  327. [armeabi] Compile++ thumb: cocos_extension_static <= CCPhysicsDebugNode.cpp
  328. [armeabi] Compile++ thumb: cocos_extension_static <= CCPhysicsSprite.cpp
  329. [armeabi] Compile++ thumb: cocos_extension_static <= CCParticle3DAffector.cpp
  330. [armeabi] Compile++ thumb: cocos_extension_static <= CCParticle3DEmitter.cpp
  331. [armeabi] Compile++ thumb: cocos_extension_static <= CCParticle3DRender.cpp
  332. [armeabi] Compile++ thumb: cocos_extension_static <= CCParticleSystem3D.cpp
  333. [armeabi] Compile++ thumb: cocos_extension_static <= CCPUDynamicAttribute.cpp
  334. [armeabi] Compile++ thumb: cocos_extension_static <= CCPUDynamicAttributeTranslator.cpp
  335. [armeabi] Compile++ thumb: cocos_extension_static <= CCPUForceField.cpp
  336. [armeabi] Compile++ thumb: cocos_extension_static <= CCPUMaterialManager.cpp
  337. [armeabi] Compile++ thumb: cocos_extension_static <= CCPUMaterialTranslator.cpp
  338. [armeabi] Compile++ thumb: cocos_extension_static <= CCPUNoise.cpp
  339. [armeabi] Compile++ thumb: cocos_extension_static <= CCPUPlane.cpp
  340. [armeabi] Compile++ thumb: cocos_extension_static <= CCPURendererTranslator.cpp
  341. [armeabi] Compile++ thumb: cocos_extension_static <= CCPUScriptCompiler.cpp
  342. [armeabi] Compile++ thumb: cocos_extension_static <= CCPUScriptLexer.cpp
  343. [armeabi] Compile++ thumb: cocos_extension_static <= CCPUScriptParser.cpp
  344. [armeabi] Compile++ thumb: cocos_extension_static <= CCPUScriptTranslator.cpp
  345. [armeabi] Compile++ thumb: cocos_extension_static <= CCPUSimpleSpline.cpp
  346. [armeabi] Compile++ thumb: cocos_extension_static <= CCPUSphere.cpp
  347. [armeabi] Compile++ thumb: cocos_extension_static <= CCPUTechniqueTranslator.cpp
  348. [armeabi] Compile++ thumb: cocos_extension_static <= CCPUTranslateManager.cpp
  349. [armeabi] Compile++ thumb: cocos_extension_static <= CCPUUtil.cpp
  350. [armeabi] Compile++ thumb: cocos_extension_static <= CCPUParticleSystem3D.cpp
  351. [armeabi] Compile++ thumb: cocos_extension_static <= CCPUParticleSystem3DTranslator.cpp
  352. [armeabi] Compile++ thumb: cocos_extension_static <= CCPUListener.cpp
  353. [armeabi] Compile++ thumb: cocos_extension_static <= CCPUAffector.cpp
  354. [armeabi] Compile++ thumb: cocos_extension_static <= CCPUAffectorManager.cpp
  355. [armeabi] Compile++ thumb: cocos_extension_static <= CCPUAffectorTranslator.cpp
  356. [armeabi] Compile++ thumb: cocos_extension_static <= CCPUAlignAffector.cpp
  357. [armeabi] Compile++ thumb: cocos_extension_static <= CCPUAlignAffectorTranslator.cpp
  358. [armeabi] Compile++ thumb: cocos_extension_static <= CCPUBaseCollider.cpp
  359. [armeabi] Compile++ thumb: cocos_extension_static <= CCPUBaseColliderTranslator.cpp
  360. [armeabi] Compile++ thumb: cocos_extension_static <= CCPUBaseForceAffector.cpp
  361. [armeabi] Compile++ thumb: cocos_extension_static <= CCPUBaseForceAffectorTranslator.cpp
  362. [armeabi] Compile++ thumb: cocos_extension_static <= CCPUBoxCollider.cpp
  363. [armeabi] Compile++ thumb: cocos_extension_static <= CCPUBoxColliderTranslator.cpp
  364. [armeabi] Compile++ thumb: cocos_extension_static <= CCPUCollisionAvoidanceAffector.cpp
  365. [armeabi] Compile++ thumb: cocos_extension_static <= CCPUCollisionAvoidanceAffectorTranslator.cpp
  366. [armeabi] Compile++ thumb: cocos_extension_static <= CCPUColorAffector.cpp
  367. [armeabi] Compile++ thumb: cocos_extension_static <= CCPUColorAffectorTranslator.cpp
  368. [armeabi] Compile++ thumb: cocos_extension_static <= CCPUFlockCenteringAffector.cpp
  369. [armeabi] Compile++ thumb: cocos_extension_static <= CCPUFlockCenteringAffectorTranslator.cpp
  370. [armeabi] Compile++ thumb: cocos_extension_static <= CCPUForceFieldAffector.cpp
  371. [armeabi] Compile++ thumb: cocos_extension_static <= CCPUForceFieldAffectorTranslator.cpp
  372. [armeabi] Compile++ thumb: cocos_extension_static <= CCPUGeometryRotator.cpp
  373. [armeabi] Compile++ thumb: cocos_extension_static <= CCPUGeometryRotatorTranslator.cpp
  374. [armeabi] Compile++ thumb: cocos_extension_static <= CCPUGravityAffector.cpp
  375. [armeabi] Compile++ thumb: cocos_extension_static <= CCPUGravityAffectorTranslator.cpp
  376. [armeabi] Compile++ thumb: cocos_extension_static <= CCPUInterParticleCollider.cpp
  377. [armeabi] Compile++ thumb: cocos_extension_static <= CCPUInterParticleColliderTranslator.cpp
  378. [armeabi] Compile++ thumb: cocos_extension_static <= CCPUJetAffector.cpp
  379. [armeabi] Compile++ thumb: cocos_extension_static <= CCPUJetAffectorTranslator.cpp
  380. [armeabi] Compile++ thumb: cocos_extension_static <= CCPULineAffector.cpp
  381. [armeabi] Compile++ thumb: cocos_extension_static <= CCPULineAffectorTranslator.cpp
  382. [armeabi] Compile++ thumb: cocos_extension_static <= CCPULinearForceAffector.cpp
  383. [armeabi] Compile++ thumb: cocos_extension_static <= CCPULinearForceAffectorTranslator.cpp
  384. [armeabi] Compile++ thumb: cocos_extension_static <= CCPUParticleFollower.cpp
  385. [armeabi] Compile++ thumb: cocos_extension_static <= CCPUParticleFollowerTranslator.cpp
  386. [armeabi] Compile++ thumb: cocos_extension_static <= CCPUPathFollower.cpp
  387. [armeabi] Compile++ thumb: cocos_extension_static <= CCPUPathFollowerTranslator.cpp
  388. [armeabi] Compile++ thumb: cocos_extension_static <= CCPUPlaneCollider.cpp
  389. [armeabi] Compile++ thumb: cocos_extension_static <= CCPUPlaneColliderTranslator.cpp
  390. [armeabi] Compile++ thumb: cocos_extension_static <= CCPURandomiser.cpp
  391. [armeabi] Compile++ thumb: cocos_extension_static <= CCPURandomiserTranslator.cpp
  392. [armeabi] Compile++ thumb: cocos_extension_static <= CCPUScaleAffector.cpp
  393. [armeabi] Compile++ thumb: cocos_extension_static <= CCPUScaleAffectorTranslator.cpp
  394. [armeabi] Compile++ thumb: cocos_extension_static <= CCPUScaleVelocityAffector.cpp
  395. [armeabi] Compile++ thumb: cocos_extension_static <= CCPUScaleVelocityAffectorTranslator.cpp
  396. [armeabi] Compile++ thumb: cocos_extension_static <= CCPUSineForceAffector.cpp
  397. [armeabi] Compile++ thumb: cocos_extension_static <= CCPUSineForceAffectorTranslator.cpp
  398. [armeabi] Compile++ thumb: cocos_extension_static <= CCPUSphereCollider.cpp
  399. [armeabi] Compile++ thumb: cocos_extension_static <= CCPUSphereColliderTranslator.cpp
  400. [armeabi] Compile++ thumb: cocos_extension_static <= CCPUTextureAnimator.cpp
  401. [armeabi] Compile++ thumb: cocos_extension_static <= CCPUTextureAnimatorTranslator.cpp
  402. [armeabi] Compile++ thumb: cocos_extension_static <= CCPUTextureRotator.cpp
  403. [armeabi] Compile++ thumb: cocos_extension_static <= CCPUTextureRotatorTranslator.cpp
  404. [armeabi] Compile++ thumb: cocos_extension_static <= CCPUVelocityMatchingAffector.cpp
  405. [armeabi] Compile++ thumb: cocos_extension_static <= CCPUVelocityMatchingAffectorTranslator.cpp
  406. [armeabi] Compile++ thumb: cocos_extension_static <= CCPUVortexAffector.cpp
  407. [armeabi] Compile++ thumb: cocos_extension_static <= CCPUVortexAffectorTranslator.cpp
  408. [armeabi] Compile++ thumb: cocos_extension_static <= CCPUEmitter.cpp
  409. [armeabi] Compile++ thumb: cocos_extension_static <= CCPUEmitterTranslator.cpp
  410. [armeabi] Compile++ thumb: cocos_extension_static <= CCPUEmitterManager.cpp
  411. [armeabi] Compile++ thumb: cocos_extension_static <= CCPUBoxEmitter.cpp
  412. [armeabi] Compile++ thumb: cocos_extension_static <= CCPUBoxEmitterTranslator.cpp
  413. [armeabi] Compile++ thumb: cocos_extension_static <= CCPUCircleEmitter.cpp
  414. [armeabi] Compile++ thumb: cocos_extension_static <= CCPUCircleEmitterTranslator.cpp
  415. [armeabi] Compile++ thumb: cocos_extension_static <= CCPULineEmitter.cpp
  416. [armeabi] Compile++ thumb: cocos_extension_static <= CCPULineEmitterTranslator.cpp
  417. [armeabi] Compile++ thumb: cocos_extension_static <= CCPUMeshSurfaceEmitter.cpp
  418. [armeabi] Compile++ thumb: cocos_extension_static <= CCPUMeshSurfaceEmitterTranslator.cpp
  419. [armeabi] Compile++ thumb: cocos_extension_static <= CCPUPointEmitter.cpp
  420. [armeabi] Compile++ thumb: cocos_extension_static <= CCPUPointEmitterTranslator.cpp
  421. [armeabi] Compile++ thumb: cocos_extension_static <= CCPUPositionEmitter.cpp
  422. [armeabi] Compile++ thumb: cocos_extension_static <= CCPUPositionEmitterTranslator.cpp
  423. [armeabi] Compile++ thumb: cocos_extension_static <= CCPUSlaveEmitter.cpp
  424. [armeabi] Compile++ thumb: cocos_extension_static <= CCPUSlaveEmitterTranslator.cpp
  425. [armeabi] Compile++ thumb: cocos_extension_static <= CCPUSphereSurfaceEmitter.cpp
  426. [armeabi] Compile++ thumb: cocos_extension_static <= CCPUSphereSurfaceEmitterTranslator.cpp
  427. [armeabi] Compile++ thumb: cocos_extension_static <= CCPUVertexEmitter.cpp
  428. [armeabi] Compile++ thumb: cocos_extension_static <= CCPURender.cpp
  429. [armeabi] Compile++ thumb: cocos_extension_static <= CCPUBeamRender.cpp
  430. [armeabi] Compile++ thumb: cocos_extension_static <= CCPUBillboardChain.cpp
  431. [armeabi] Compile++ thumb: cocos_extension_static <= CCPURibbonTrail.cpp
  432. [armeabi] Compile++ thumb: cocos_extension_static <= CCPURibbonTrailRender.cpp
  433. [armeabi] Compile++ thumb: cocos_extension_static <= CCPUDoAffectorEventHandler.cpp
  434. [armeabi] Compile++ thumb: cocos_extension_static <= CCPUDoAffectorEventHandlerTranslator.cpp
  435. [armeabi] Compile++ thumb: cocos_extension_static <= CCPUDoEnableComponentEventHandler.cpp
  436. [armeabi] Compile++ thumb: cocos_extension_static <= CCPUDoEnableComponentEventHandlerTranslator.cpp
  437. [armeabi] Compile++ thumb: cocos_extension_static <= CCPUDoExpireEventHandler.cpp
  438. [armeabi] Compile++ thumb: cocos_extension_static <= CCPUDoExpireEventHandlerTranslator.cpp
  439. [armeabi] Compile++ thumb: cocos_extension_static <= CCPUDoFreezeEventHandler.cpp
  440. [armeabi] Compile++ thumb: cocos_extension_static <= CCPUDoFreezeEventHandlerTranslator.cpp
  441. [armeabi] Compile++ thumb: cocos_extension_static <= CCPUDoPlacementParticleEventHandler.cpp
  442. [armeabi] Compile++ thumb: cocos_extension_static <= CCPUDoPlacementParticleEventHandlerTranslator.cpp
  443. [armeabi] Compile++ thumb: cocos_extension_static <= CCPUDoScaleEventHandler.cpp
  444. [armeabi] Compile++ thumb: cocos_extension_static <= CCPUDoScaleEventHandlerTranslator.cpp
  445. [armeabi] Compile++ thumb: cocos_extension_static <= CCPUDoStopSystemEventHandler.cpp
  446. [armeabi] Compile++ thumb: cocos_extension_static <= CCPUDoStopSystemEventHandlerTranslator.cpp
  447. [armeabi] Compile++ thumb: cocos_extension_static <= CCPUEventHandler.cpp
  448. [armeabi] Compile++ thumb: cocos_extension_static <= CCPUEventHandlerManager.cpp
  449. [armeabi] Compile++ thumb: cocos_extension_static <= CCPUEventHandlerTranslator.cpp
  450. [armeabi] Compile++ thumb: cocos_extension_static <= CCPUObserver.cpp
  451. [armeabi] Compile++ thumb: cocos_extension_static <= CCPUObserverManager.cpp
  452. [armeabi] Compile++ thumb: cocos_extension_static <= CCPUObserverTranslator.cpp
  453. [armeabi] Compile++ thumb: cocos_extension_static <= CCPUOnClearObserver.cpp
  454. [armeabi] Compile++ thumb: cocos_extension_static <= CCPUOnClearObserverTranslator.cpp
  455. [armeabi] Compile++ thumb: cocos_extension_static <= CCPUOnCollisionObserver.cpp
  456. [armeabi] Compile++ thumb: cocos_extension_static <= CCPUOnCollisionObserverTranslator.cpp
  457. [armeabi] Compile++ thumb: cocos_extension_static <= CCPUOnCountObserver.cpp
  458. [armeabi] Compile++ thumb: cocos_extension_static <= CCPUOnCountObserverTranslator.cpp
  459. [armeabi] Compile++ thumb: cocos_extension_static <= CCPUOnEmissionObserver.cpp
  460. [armeabi] Compile++ thumb: cocos_extension_static <= CCPUOnEmissionObserverTranslator.cpp
  461. [armeabi] Compile++ thumb: cocos_extension_static <= CCPUOnEventFlagObserver.cpp
  462. [armeabi] Compile++ thumb: cocos_extension_static <= CCPUOnEventFlagObserverTranslator.cpp
  463. [armeabi] Compile++ thumb: cocos_extension_static <= CCPUOnExpireObserver.cpp
  464. [armeabi] Compile++ thumb: cocos_extension_static <= CCPUOnExpireObserverTranslator.cpp
  465. [armeabi] Compile++ thumb: cocos_extension_static <= CCPUOnPositionObserver.cpp
  466. [armeabi] Compile++ thumb: cocos_extension_static <= CCPUOnPositionObserverTranslator.cpp
  467. [armeabi] Compile++ thumb: cocos_extension_static <= CCPUOnQuotaObserver.cpp
  468. [armeabi] Compile++ thumb: cocos_extension_static <= CCPUOnQuotaObserverTranslator.cpp
  469. [armeabi] Compile++ thumb: cocos_extension_static <= CCPUOnRandomObserver.cpp
  470. [armeabi] Compile++ thumb: cocos_extension_static <= CCPUOnRandomObserverTranslator.cpp
  471. [armeabi] Compile++ thumb: cocos_extension_static <= CCPUOnTimeObserver.cpp
  472. [armeabi] Compile++ thumb: cocos_extension_static <= CCPUOnTimeObserverTranslator.cpp
  473. [armeabi] Compile++ thumb: cocos_extension_static <= CCPUOnVelocityObserver.cpp
  474. [armeabi] Compile++ thumb: cocos_extension_static <= CCPUOnVelocityObserverTranslator.cpp
  475. [armeabi] Compile++ thumb: cocos_extension_static <= CCPUBehaviour.cpp
  476. [armeabi] Compile++ thumb: cocos_extension_static <= CCPUBehaviourManager.cpp
  477. [armeabi] Compile++ thumb: cocos_extension_static <= CCPUBehaviourTranslator.cpp
  478. [armeabi] Compile++ thumb: cocos_extension_static <= CCPUSlaveBehaviour.cpp
  479. [armeabi] Compile++ thumb: cocos_extension_static <= CCPUSlaveBehaviourTranslator.cpp
  480. [armeabi] Compile++ thumb: audioengine_static <= AudioEngine-inl.cpp
  481. [armeabi] Compile++ thumb: audioengine_static <= AudioEngine.cpp
  482. [armeabi] Compile++ thumb: box2d_static <= b2BroadPhase.cpp
  483. [armeabi] Compile++ thumb: box2d_static <= b2CollideCircle.cpp
  484. [armeabi] Compile++ thumb: box2d_static <= b2CollideEdge.cpp
  485. [armeabi] Compile++ thumb: box2d_static <= b2CollidePolygon.cpp
  486. [armeabi] Compile++ thumb: box2d_static <= b2Collision.cpp
  487. [armeabi] Compile++ thumb: box2d_static <= b2Distance.cpp
  488. [armeabi] Compile++ thumb: box2d_static <= b2DynamicTree.cpp
  489. [armeabi] Compile++ thumb: box2d_static <= b2TimeOfImpact.cpp
  490. [armeabi] Compile++ thumb: box2d_static <= b2ChainShape.cpp
  491. [armeabi] Compile++ thumb: box2d_static <= b2CircleShape.cpp
  492. [armeabi] Compile++ thumb: box2d_static <= b2EdgeShape.cpp
  493. [armeabi] Compile++ thumb: box2d_static <= b2PolygonShape.cpp
  494. [armeabi] Compile++ thumb: box2d_static <= b2BlockAllocator.cpp
  495. [armeabi] Compile++ thumb: box2d_static <= b2Draw.cpp
  496. [armeabi] Compile++ thumb: box2d_static <= b2Math.cpp
  497. [armeabi] Compile++ thumb: box2d_static <= b2Settings.cpp
  498. [armeabi] Compile++ thumb: box2d_static <= b2StackAllocator.cpp
  499. [armeabi] Compile++ thumb: box2d_static <= b2Timer.cpp
  500. [armeabi] Compile++ thumb: box2d_static <= b2Body.cpp
  501. [armeabi] Compile++ thumb: box2d_static <= b2ContactManager.cpp
  502. [armeabi] Compile++ thumb: box2d_static <= b2Fixture.cpp
  503. [armeabi] Compile++ thumb: box2d_static <= b2Island.cpp
  504. [armeabi] Compile++ thumb: box2d_static <= b2World.cpp
  505. [armeabi] Compile++ thumb: box2d_static <= b2WorldCallbacks.cpp
  506. [armeabi] Compile++ thumb: box2d_static <= b2ChainAndCircleContact.cpp
  507. [armeabi] Compile++ thumb: box2d_static <= b2ChainAndPolygonContact.cpp
  508. [armeabi] Compile++ thumb: box2d_static <= b2CircleContact.cpp
  509. [armeabi] Compile++ thumb: box2d_static <= b2Contact.cpp
  510. [armeabi] Compile++ thumb: box2d_static <= b2ContactSolver.cpp
  511. [armeabi] Compile++ thumb: box2d_static <= b2EdgeAndCircleContact.cpp
  512. [armeabi] Compile++ thumb: box2d_static <= b2EdgeAndPolygonContact.cpp
  513. [armeabi] Compile++ thumb: box2d_static <= b2PolygonAndCircleContact.cpp
  514. [armeabi] Compile++ thumb: box2d_static <= b2PolygonContact.cpp
  515. [armeabi] Compile++ thumb: box2d_static <= b2DistanceJoint.cpp
  516. [armeabi] Compile++ thumb: box2d_static <= b2FrictionJoint.cpp
  517. [armeabi] Compile++ thumb: box2d_static <= b2GearJoint.cpp
  518. [armeabi] Compile++ thumb: box2d_static <= b2Joint.cpp
  519. [armeabi] Compile++ thumb: box2d_static <= b2MotorJoint.cpp
  520. [armeabi] Compile++ thumb: box2d_static <= b2MouseJoint.cpp
  521. [armeabi] Compile++ thumb: box2d_static <= b2PrismaticJoint.cpp
  522. [armeabi] Compile++ thumb: box2d_static <= b2PulleyJoint.cpp
  523. [armeabi] Compile++ thumb: box2d_static <= b2RevoluteJoint.cpp
  524. [armeabi] Compile++ thumb: box2d_static <= b2RopeJoint.cpp
  525. [armeabi] Compile++ thumb: box2d_static <= b2WeldJoint.cpp
  526. [armeabi] Compile++ thumb: box2d_static <= b2WheelJoint.cpp
  527. [armeabi] Compile++ thumb: box2d_static <= b2Rope.cpp
  528. [armeabi] Compile++ thumb: cocos_network_static <= HttpClient-android.cpp
  529. [armeabi] Compile++ thumb: cocos_network_static <= SocketIO.cpp
  530. [armeabi] Compile++ thumb: cocos_network_static <= WebSocket.cpp
  531. [armeabi] Compile++ thumb: cocos_network_static <= CCDownloader.cpp
  532. [armeabi] Compile++ thumb: cocos_network_static <= CCDownloader-android.cpp
  533. In file included from /Users/mills/TestGame/proj.android/../cocos2d/cocos/network/SocketIO.h:63:0,
  534. from /Users/mills/TestGame/proj.android/../cocos2d/cocos/network/SocketIO.cpp:30:
  535. /Users/mills/TestGame/proj.android/../cocos2d/cocos/network/SocketIO.cpp: In member function 'virtual void cocos2d::network::SIOClientImpl::onError(cocos2d::network::WebSocket*, const cocos2d::network::WebSocket::ErrorCode&)':
  536. /Users/mills/TestGame/proj.android/../cocos2d/cocos/./platform/CCPlatformMacros.h:235:67: warning: format '%d' expects argument of type 'int', but argument 2 has type 'cocos2d::network::WebSocket::ErrorCode' [-Wformat=]
  537. #define CCLOGERROR(format,...) cocos2d::log(format, ##__VA_ARGS__)
  538. ^
  539. /Users/mills/TestGame/proj.android/../cocos2d/cocos/network/SocketIO.cpp:997:5: note: in expansion of macro 'CCLOGERROR'
  540. CCLOGERROR("Websocket error received: %d", error);
  541. ^
  542. [armeabi] Compile++ thumb: cocos2dx_internal_static <= cocos2d.cpp
  543. [armeabi] Compile++ thumb: cocos2dx_internal_static <= CCAction.cpp
  544. [armeabi] Compile++ thumb: cocos2dx_internal_static <= CCActionCamera.cpp
  545. At global scope:
  546. cc1plus: warning: unrecognized command line option "-Wno-extern-c-compat"
  547. cc1plus: warning: unrecognized command line option "-Wno-extern-c-compat"
  548. [armeabi] Compile++ thumb: cocos2dx_internal_static <= CCActionCatmullRom.cpp
  549. [armeabi] Compile++ thumb: cocos2dx_internal_static <= CCActionEase.cpp
  550. [armeabi] Compile++ thumb: cocos2dx_internal_static <= CCActionGrid.cpp
  551. [armeabi] Compile++ thumb: cocos2dx_internal_static <= CCActionGrid3D.cpp
  552. [armeabi] Compile++ thumb: cocos2dx_internal_static <= CCActionInstant.cpp
  553. [armeabi] Compile++ thumb: cocos2dx_internal_static <= CCActionInterval.cpp
  554. [armeabi] Compile++ thumb: cocos2dx_internal_static <= CCActionManager.cpp
  555. [armeabi] Compile++ thumb: cocos2dx_internal_static <= CCActionPageTurn3D.cpp
  556. [armeabi] Compile++ thumb: cocos2dx_internal_static <= CCActionProgressTimer.cpp
  557. [armeabi] Compile++ thumb: cocos2dx_internal_static <= CCActionTiledGrid.cpp
  558. [armeabi] Compile++ thumb: cocos2dx_internal_static <= CCActionTween.cpp
  559. [armeabi] Compile++ thumb: cocos2dx_internal_static <= CCAnimation.cpp
  560. [armeabi] Compile++ thumb: cocos2dx_internal_static <= CCAnimationCache.cpp
  561. [armeabi] Compile++ thumb: cocos2dx_internal_static <= CCAtlasNode.cpp
  562. [armeabi] Compile++ thumb: cocos2dx_internal_static <= CCCamera.cpp
  563. [armeabi] Compile++ thumb: cocos2dx_internal_static <= CCCameraBackgroundBrush.cpp
  564. [armeabi] Compile++ thumb: cocos2dx_internal_static <= CCClippingNode.cpp
  565. [armeabi] Compile++ thumb: cocos2dx_internal_static <= CCClippingRectangleNode.cpp
  566. [armeabi] Compile++ thumb: cocos2dx_internal_static <= CCComponent.cpp
  567. [armeabi] Compile++ thumb: cocos2dx_internal_static <= CCComponentContainer.cpp
  568. [armeabi] Compile++ thumb: cocos2dx_internal_static <= CCDrawNode.cpp
  569. [armeabi] Compile++ thumb: cocos2dx_internal_static <= CCDrawingPrimitives.cpp
  570. [armeabi] Compile++ thumb: cocos2dx_internal_static <= CCFastTMXLayer.cpp
  571. [armeabi] Compile++ thumb: cocos2dx_internal_static <= CCFastTMXTiledMap.cpp
  572. [armeabi] Compile++ thumb: cocos2dx_internal_static <= CCFont.cpp
  573. [armeabi] Compile++ thumb: cocos2dx_internal_static <= CCFontAtlas.cpp
  574. [armeabi] Compile++ thumb: cocos2dx_internal_static <= CCFontAtlasCache.cpp
  575. [armeabi] Compile++ thumb: cocos2dx_internal_static <= CCFontCharMap.cpp
  576. [armeabi] Compile++ thumb: cocos2dx_internal_static <= CCFontFNT.cpp
  577. [armeabi] Compile++ thumb: cocos2dx_internal_static <= CCFontFreeType.cpp
  578. [armeabi] Compile++ thumb: cocos2dx_internal_static <= CCGLBufferedNode.cpp
  579. [armeabi] Compile++ thumb: cocos2dx_internal_static <= CCGrabber.cpp
  580. [armeabi] Compile++ thumb: cocos2dx_internal_static <= CCGrid.cpp
  581. [armeabi] Compile++ thumb: cocos2dx_internal_static <= CCLabel.cpp
  582. [armeabi] Compile++ thumb: cocos2dx_internal_static <= CCLabelAtlas.cpp
  583. [armeabi] Compile++ thumb: cocos2dx_internal_static <= CCLabelBMFont.cpp
  584. [armeabi] Compile++ thumb: cocos2dx_internal_static <= CCLabelTTF.cpp
  585. [armeabi] Compile++ thumb: cocos2dx_internal_static <= CCLabelTextFormatter.cpp
  586. [armeabi] Compile++ thumb: cocos2dx_internal_static <= CCLayer.cpp
  587. [armeabi] Compile++ thumb: cocos2dx_internal_static <= CCLight.cpp
  588. [armeabi] Compile++ thumb: cocos2dx_internal_static <= CCMenu.cpp
  589. [armeabi] Compile++ thumb: cocos2dx_internal_static <= CCMenuItem.cpp
  590. [armeabi] Compile++ thumb: cocos2dx_internal_static <= CCMotionStreak.cpp
  591. [armeabi] Compile++ thumb: cocos2dx_internal_static <= CCNode.cpp
  592. [armeabi] Compile++ thumb: cocos2dx_internal_static <= CCNodeGrid.cpp
  593. [armeabi] Compile++ thumb: cocos2dx_internal_static <= CCParallaxNode.cpp
  594. [armeabi] Compile++ thumb: cocos2dx_internal_static <= CCParticleBatchNode.cpp
  595. [armeabi] Compile++ thumb: cocos2dx_internal_static <= CCParticleExamples.cpp
  596. [armeabi] Compile++ thumb: cocos2dx_internal_static <= CCParticleSystem.cpp
  597. [armeabi] Compile++ thumb: cocos2dx_internal_static <= CCParticleSystemQuad.cpp
  598. [armeabi] Compile++ thumb: cocos2dx_internal_static <= CCProgressTimer.cpp
  599. [armeabi] Compile++ thumb: cocos2dx_internal_static <= CCProtectedNode.cpp
  600. [armeabi] Compile++ thumb: cocos2dx_internal_static <= CCRenderTexture.cpp
  601. [armeabi] Compile++ thumb: cocos2dx_internal_static <= CCScene.cpp
  602. [armeabi] Compile++ thumb: cocos2dx_internal_static <= CCSprite.cpp
  603. [armeabi] Compile++ thumb: cocos2dx_internal_static <= CCSpriteBatchNode.cpp
  604. [armeabi] Compile++ thumb: cocos2dx_internal_static <= CCSpriteFrame.cpp
  605. [armeabi] Compile++ thumb: cocos2dx_internal_static <= CCSpriteFrameCache.cpp
  606. [armeabi] Compile++ thumb: cocos2dx_internal_static <= CCTMXLayer.cpp
  607. [armeabi] Compile++ thumb: cocos2dx_internal_static <= CCTMXObjectGroup.cpp
  608. [armeabi] Compile++ thumb: cocos2dx_internal_static <= CCTMXTiledMap.cpp
  609. [armeabi] Compile++ thumb: cocos2dx_internal_static <= CCTMXXMLParser.cpp
  610. [armeabi] Compile++ thumb: cocos2dx_internal_static <= CCTextFieldTTF.cpp
  611. [armeabi] Compile++ thumb: cocos2dx_internal_static <= CCTileMapAtlas.cpp
  612. [armeabi] Compile++ thumb: cocos2dx_internal_static <= CCTransition.cpp
  613. [armeabi] Compile++ thumb: cocos2dx_internal_static <= CCTransitionPageTurn.cpp
  614. [armeabi] Compile++ thumb: cocos2dx_internal_static <= CCTransitionProgress.cpp
  615. [armeabi] Compile++ thumb: cocos2dx_internal_static <= CCTweenFunction.cpp
  616. [armeabi] Compile++ thumb: cocos2dx_internal_static <= CCAutoPolygon.cpp
  617. [armeabi] Compile++ thumb: cocos2dx_internal_static <= CCFrustum.cpp
  618. [armeabi] Compile++ thumb: cocos2dx_internal_static <= CCPlane.cpp
  619. [armeabi] Compile++ thumb: cocos2dx_internal_static <= CCFileUtils.cpp
  620. [armeabi] Compile++ thumb: cocos2dx_internal_static <= CCGLView.cpp
  621. [armeabi] Compile++ thumb: cocos2dx_internal_static <= CCImage.cpp
  622. [armeabi] Compile++ thumb: cocos2dx_internal_static <= CCSAXParser.cpp
  623. [armeabi] Compile++ thumb: cocos2dx_internal_static <= CCThread.cpp
  624. [armeabi] Compile++ thumb: cocos2dx_internal_static <= MathUtil.cpp
  625. [armeabi] Compile++ thumb: cocos2dx_internal_static <= CCAffineTransform.cpp
  626. [armeabi] Compile++ thumb: cocos2dx_internal_static <= CCGeometry.cpp
  627. [armeabi] Compile++ thumb: cocos2dx_internal_static <= CCVertex.cpp
  628. [armeabi] Compile++ thumb: cocos2dx_internal_static <= Mat4.cpp
  629. [armeabi] Compile++ thumb: cocos2dx_internal_static <= Quaternion.cpp
  630. [armeabi] Compile++ thumb: cocos2dx_internal_static <= TransformUtils.cpp
  631. [armeabi] Compile++ thumb: cocos2dx_internal_static <= Vec2.cpp
  632. [armeabi] Compile++ thumb: cocos2dx_internal_static <= Vec3.cpp
  633. [armeabi] Compile++ thumb: cocos2dx_internal_static <= Vec4.cpp
  634. [armeabi] Compile++ thumb: cocos2dx_internal_static <= CCNinePatchImageParser.cpp
  635. [armeabi] Compile++ thumb: cocos2dx_internal_static <= CCAsyncTaskPool.cpp
  636. [armeabi] Compile++ thumb: cocos2dx_internal_static <= CCAutoreleasePool.cpp
  637. [armeabi] Compile++ thumb: cocos2dx_internal_static <= CCConfiguration.cpp
  638. [armeabi] Compile++ thumb: cocos2dx_internal_static <= CCConsole.cpp
  639. [armeabi] Compile++ thumb: cocos2dx_internal_static <= CCController-android.cpp
  640. [armeabi] Compile++ thumb: cocos2dx_internal_static <= CCController.cpp
  641. [armeabi] Compile++ thumb: cocos2dx_internal_static <= CCData.cpp
  642. [armeabi] Compile++ thumb: cocos2dx_internal_static <= CCDataVisitor.cpp
  643. [armeabi] Compile++ thumb: cocos2dx_internal_static <= CCDirector.cpp
  644. [armeabi] Compile++ thumb: cocos2dx_internal_static <= CCEvent.cpp
  645. [armeabi] Compile++ thumb: cocos2dx_internal_static <= CCEventAcceleration.cpp
  646. [armeabi] Compile++ thumb: cocos2dx_internal_static <= CCEventController.cpp
  647. [armeabi] Compile++ thumb: cocos2dx_internal_static <= CCEventCustom.cpp
  648. [armeabi] Compile++ thumb: cocos2dx_internal_static <= CCEventDispatcher.cpp
  649. [armeabi] Compile++ thumb: cocos2dx_internal_static <= CCEventFocus.cpp
  650. [armeabi] Compile++ thumb: cocos2dx_internal_static <= CCEventKeyboard.cpp
  651. [armeabi] Compile++ thumb: cocos2dx_internal_static <= CCEventListener.cpp
  652. [armeabi] Compile++ thumb: cocos2dx_internal_static <= CCEventListenerAcceleration.cpp
  653. [armeabi] Compile++ thumb: cocos2dx_internal_static <= CCEventListenerController.cpp
  654. [armeabi] Compile++ thumb: cocos2dx_internal_static <= CCEventListenerCustom.cpp
  655. [armeabi] Compile++ thumb: cocos2dx_internal_static <= CCEventListenerFocus.cpp
  656. [armeabi] Compile++ thumb: cocos2dx_internal_static <= CCEventListenerKeyboard.cpp
  657. [armeabi] Compile++ thumb: cocos2dx_internal_static <= CCEventListenerMouse.cpp
  658. [armeabi] Compile++ thumb: cocos2dx_internal_static <= CCEventListenerTouch.cpp
  659. [armeabi] Compile++ thumb: cocos2dx_internal_static <= CCEventMouse.cpp
  660. [armeabi] Compile++ thumb: cocos2dx_internal_static <= CCEventTouch.cpp
  661. [armeabi] Compile++ thumb: cocos2dx_internal_static <= CCIMEDispatcher.cpp
  662. [armeabi] Compile++ thumb: cocos2dx_internal_static <= CCNS.cpp
  663. [armeabi] Compile++ thumb: cocos2dx_internal_static <= CCProfiling.cpp
  664. [armeabi] Compile++ thumb: cocos2dx_internal_static <= CCProperties.cpp
  665. [armeabi] Compile++ thumb: cocos2dx_internal_static <= CCRef.cpp
  666. [armeabi] Compile++ thumb: cocos2dx_internal_static <= CCScheduler.cpp
  667. [armeabi] Compile++ thumb: cocos2dx_internal_static <= CCScriptSupport.cpp
  668. [armeabi] Compile++ thumb: cocos2dx_internal_static <= CCTouch.cpp
  669. [armeabi] Compile++ thumb: cocos2dx_internal_static <= CCUserDefault-android.cpp
  670. [armeabi] Compile++ thumb: cocos2dx_internal_static <= CCUserDefault.cpp
  671. [armeabi] Compile++ thumb: cocos2dx_internal_static <= CCValue.cpp
  672. [armeabi] Compile++ thumb: cocos2dx_internal_static <= ObjectFactory.cpp
  673. [armeabi] Compile++ thumb: cocos2dx_internal_static <= TGAlib.cpp
  674. [armeabi] Compile++ thumb: cocos2dx_internal_static <= ZipUtils.cpp
  675. [armeabi] Compile++ thumb: cocos2dx_internal_static <= CCAllocatorDiagnostics.cpp
  676. [armeabi] Compile++ thumb: cocos2dx_internal_static <= CCAllocatorGlobal.cpp
  677. [armeabi] Compile++ thumb: cocos2dx_internal_static <= CCAllocatorGlobalNewDelete.cpp
  678. [armeabi] Compile++ thumb: cocos2dx_internal_static <= CCBatchCommand.cpp
  679. [armeabi] Compile++ thumb: cocos2dx_internal_static <= CCCustomCommand.cpp
  680. [armeabi] Compile++ thumb: cocos2dx_internal_static <= CCGLProgram.cpp
  681. [armeabi] Compile++ thumb: cocos2dx_internal_static <= CCGLProgramCache.cpp
  682. [armeabi] Compile++ thumb: cocos2dx_internal_static <= CCGLProgramState.cpp
  683. [armeabi] Compile++ thumb: cocos2dx_internal_static <= CCGLProgramStateCache.cpp
  684. [armeabi] Compile++ thumb: cocos2dx_internal_static <= CCGroupCommand.cpp
  685. [armeabi] Compile++ thumb: cocos2dx_internal_static <= CCMaterial.cpp
  686. [armeabi] Compile++ thumb: cocos2dx_internal_static <= CCMeshCommand.cpp
  687. [armeabi] Compile++ thumb: cocos2dx_internal_static <= CCPass.cpp
  688. [armeabi] Compile++ thumb: cocos2dx_internal_static <= CCPrimitive.cpp
  689. [armeabi] Compile++ thumb: cocos2dx_internal_static <= CCPrimitiveCommand.cpp
  690. [armeabi] Compile++ thumb: cocos2dx_internal_static <= CCQuadCommand.cpp
  691. [armeabi] Compile++ thumb: cocos2dx_internal_static <= CCRenderCommand.cpp
  692. [armeabi] Compile++ thumb: cocos2dx_internal_static <= CCRenderState.cpp
  693. [armeabi] Compile++ thumb: cocos2dx_internal_static <= CCRenderer.cpp
  694. [armeabi] Compile++ thumb: cocos2dx_internal_static <= CCTechnique.cpp
  695. [armeabi] Compile++ thumb: cocos2dx_internal_static <= CCTexture2D.cpp
  696. [armeabi] Compile++ thumb: cocos2dx_internal_static <= CCTextureAtlas.cpp
  697. [armeabi] Compile++ thumb: cocos2dx_internal_static <= CCTextureCache.cpp
  698. In file included from /Users/mills/TestGame/proj.android/../cocos2d/cocos/./base/CCRef.h:29:0,
  699. from /Users/mills/TestGame/proj.android/../cocos2d/cocos/./renderer/CCTexture2D.h:34,
  700. from /Users/mills/TestGame/proj.android/../cocos2d/cocos/./renderer/CCTexture2D.cpp:34:
  701. /Users/mills/TestGame/proj.android/../cocos2d/cocos/./renderer/CCTexture2D.cpp: In static member function 'static cocos2d::Texture2D::PixelFormat cocos2d::Texture2D::convertI8ToFormat(const unsigned char*, ssize_t, cocos2d::Texture2D::PixelFormat, unsigned char**, ssize_t*)':
  702. /Users/mills/TestGame/proj.android/../cocos2d/cocos/./platform/CCPlatformMacros.h:234:67: warning: format '%d' expects argument of type 'int', but argument 2 has type 'cocos2d::Texture2D::PixelFormat' [-Wformat=]
  703. #define CCLOG(format, ...) cocos2d::log(format, ##__VA_ARGS__)
  704. ^
  705. /Users/mills/TestGame/proj.android/../cocos2d/cocos/./renderer/CCTexture2D.cpp:832:13: note: in expansion of macro 'CCLOG'
  706. CCLOG("Can not convert image format PixelFormat::I8 to format ID:%d, we will use it's origin format PixelFormat::I8", format);
  707. ^
  708. /Users/mills/TestGame/proj.android/../cocos2d/cocos/./renderer/CCTexture2D.cpp: In static member function 'static cocos2d::Texture2D::PixelFormat cocos2d::Texture2D::convertAI88ToFormat(const unsigned char*, ssize_t, cocos2d::Texture2D::PixelFormat, unsigned char**, ssize_t*)':
  709. /Users/mills/TestGame/proj.android/../cocos2d/cocos/./platform/CCPlatformMacros.h:234:67: warning: format '%d' expects argument of type 'int', but argument 2 has type 'cocos2d::Texture2D::PixelFormat' [-Wformat=]
  710. #define CCLOG(format, ...) cocos2d::log(format, ##__VA_ARGS__)
  711. ^
  712. /Users/mills/TestGame/proj.android/../cocos2d/cocos/./renderer/CCTexture2D.cpp:886:13: note: in expansion of macro 'CCLOG'
  713. CCLOG("Can not convert image format PixelFormat::AI88 to format ID:%d, we will use it's origin format PixelFormat::AI88", format);
  714. ^
  715. /Users/mills/TestGame/proj.android/../cocos2d/cocos/./renderer/CCTexture2D.cpp: In static member function 'static cocos2d::Texture2D::PixelFormat cocos2d::Texture2D::convertRGB888ToFormat(const unsigned char*, ssize_t, cocos2d::Texture2D::PixelFormat, unsigned char**, ssize_t*)':
  716. /Users/mills/TestGame/proj.android/../cocos2d/cocos/./platform/CCPlatformMacros.h:234:67: warning: format '%d' expects argument of type 'int', but argument 2 has type 'cocos2d::Texture2D::PixelFormat' [-Wformat=]
  717. #define CCLOG(format, ...) cocos2d::log(format, ##__VA_ARGS__)
  718. ^
  719. /Users/mills/TestGame/proj.android/../cocos2d/cocos/./renderer/CCTexture2D.cpp:936:13: note: in expansion of macro 'CCLOG'
  720. CCLOG("Can not convert image format PixelFormat::RGB888 to format ID:%d, we will use it's origin format PixelFormat::RGB888", format);
  721. ^
  722. /Users/mills/TestGame/proj.android/../cocos2d/cocos/./renderer/CCTexture2D.cpp: In static member function 'static cocos2d::Texture2D::PixelFormat cocos2d::Texture2D::convertRGBA8888ToFormat(const unsigned char*, ssize_t, cocos2d::Texture2D::PixelFormat, unsigned char**, ssize_t*)':
  723. /Users/mills/TestGame/proj.android/../cocos2d/cocos/./platform/CCPlatformMacros.h:234:67: warning: format '%d' expects argument of type 'int', but argument 2 has type 'cocos2d::Texture2D::PixelFormat' [-Wformat=]
  724. #define CCLOG(format, ...) cocos2d::log(format, ##__VA_ARGS__)
  725. ^
  726. /Users/mills/TestGame/proj.android/../cocos2d/cocos/./renderer/CCTexture2D.cpp:990:13: note: in expansion of macro 'CCLOG'
  727. CCLOG("Can not convert image format PixelFormat::RGBA8888 to format ID:%d, we will use it's origin format PixelFormat::RGBA8888", format);
  728. ^
  729. /Users/mills/TestGame/proj.android/../cocos2d/cocos/./renderer/CCTexture2D.cpp: In static member function 'static cocos2d::Texture2D::PixelFormat cocos2d::Texture2D::convertDataToFormat(const unsigned char*, ssize_t, cocos2d::Texture2D::PixelFormat, cocos2d::Texture2D::PixelFormat, unsigned char**, ssize_t*)':
  730. /Users/mills/TestGame/proj.android/../cocos2d/cocos/./platform/CCPlatformMacros.h:234:67: warning: format '%d' expects argument of type 'int', but argument 2 has type 'cocos2d::Texture2D::PixelFormat' [-Wformat=]
  731. #define CCLOG(format, ...) cocos2d::log(format, ##__VA_ARGS__)
  732. ^
  733. /Users/mills/TestGame/proj.android/../cocos2d/cocos/./renderer/CCTexture2D.cpp:1039:9: note: in expansion of macro 'CCLOG'
  734. CCLOG("unsupported conversion from format %d to format %d", originFormat, format);
  735. ^
  736. /Users/mills/TestGame/proj.android/../cocos2d/cocos/./platform/CCPlatformMacros.h:234:67: warning: format '%d' expects argument of type 'int', but argument 3 has type 'cocos2d::Texture2D::PixelFormat' [-Wformat=]
  737. #define CCLOG(format, ...) cocos2d::log(format, ##__VA_ARGS__)
  738. ^
  739. /Users/mills/TestGame/proj.android/../cocos2d/cocos/./renderer/CCTexture2D.cpp:1039:9: note: in expansion of macro 'CCLOG'
  740. CCLOG("unsupported conversion from format %d to format %d", originFormat, format);
  741. ^
  742. [armeabi] Compile++ thumb: cocos2dx_internal_static <= CCTextureCube.cpp
  743. At global scope:
  744. cc1plus: warning: unrecognized command line option "-Wno-extern-c-compat"
  745. cc1plus: warning: unrecognized command line option "-Wno-extern-c-compat"
  746. [armeabi] Compile++ thumb: cocos2dx_internal_static <= CCTrianglesCommand.cpp
  747. [armeabi] Compile++ thumb: cocos2dx_internal_static <= CCVertexAttribBinding.cpp
  748. [armeabi] Compile++ thumb: cocos2dx_internal_static <= CCVertexIndexBuffer.cpp
  749. [armeabi] Compile++ thumb: cocos2dx_internal_static <= CCVertexIndexData.cpp
  750. [armeabi] Compile++ thumb: cocos2dx_internal_static <= ccGLStateCache.cpp
  751. [armeabi] Compile++ thumb: cocos2dx_internal_static <= CCFrameBuffer.cpp
  752. [armeabi] Compile++ thumb: cocos2dx_internal_static <= ccShaders.cpp
  753. [armeabi] Compile++ thumb: cocos2dx_internal_static <= CCArray.cpp
  754. [armeabi] Compile++ thumb: cocos2dx_internal_static <= CCDeprecated.cpp
  755. [armeabi] Compile++ thumb: cocos2dx_internal_static <= CCDictionary.cpp
  756. [armeabi] Compile++ thumb: cocos2dx_internal_static <= CCNotificationCenter.cpp
  757. [armeabi] Compile++ thumb: cocos2dx_internal_static <= CCSet.cpp
  758. [armeabi] Compile++ thumb: cocos2dx_internal_static <= CCString.cpp
  759. [armeabi] Compile++ thumb: cocos2dx_internal_static <= CCPhysicsBody.cpp
  760. [armeabi] Compile++ thumb: cocos2dx_internal_static <= CCPhysicsContact.cpp
  761. [armeabi] Compile++ thumb: cocos2dx_internal_static <= CCPhysicsJoint.cpp
  762. [armeabi] Compile++ thumb: cocos2dx_internal_static <= CCPhysicsShape.cpp
  763. [armeabi] Compile++ thumb: cocos2dx_internal_static <= CCPhysicsWorld.cpp
  764. [armeabi] Compile++ thumb: cocos2dx_internal_static <= CCPhysics3D.cpp
  765. [armeabi] Compile++ thumb: cocos2dx_internal_static <= CCPhysics3DWorld.cpp
  766. [armeabi] Compile++ thumb: cocos2dx_internal_static <= CCPhysics3DComponent.cpp
  767. [armeabi] Compile++ thumb: cocos2dx_internal_static <= CCPhysics3DDebugDrawer.cpp
  768. [armeabi] Compile++ thumb: cocos2dx_internal_static <= CCPhysics3DObject.cpp
  769. [armeabi] Compile++ thumb: cocos2dx_internal_static <= CCPhysics3DShape.cpp
  770. [armeabi] Compile++ thumb: cocos2dx_internal_static <= CCPhysicsSprite3D.cpp
  771. [armeabi] Compile++ thumb: cocos2dx_internal_static <= CCPhysics3DConstraint.cpp
  772. [armeabi] Compile++ thumb: cocos2dx_internal_static <= CCNavMesh.cpp
  773. [armeabi] Compile++ thumb: cocos2dx_internal_static <= CCNavMeshAgent.cpp
  774. [armeabi] Compile++ thumb: cocos2dx_internal_static <= CCNavMeshDebugDraw.cpp
  775. [armeabi] Compile++ thumb: cocos2dx_internal_static <= CCNavMeshObstacle.cpp
  776. [armeabi] Compile++ thumb: cocos2dx_internal_static <= CCNavMeshUtils.cpp
  777. [armeabi] Compile++ thumb: cocos2dx_internal_static <= ConvertUTFWrapper.cpp
  778. [armeabi] Compile thumb : cocos2dx_internal_static <= ConvertUTF.c
  779. [armeabi] Compile++ thumb: cocos2dx_internal_static <= tinyxml2.cpp
  780. [armeabi] Compile++ thumb: cocos2dx_internal_static <= ioapi_mem.cpp
  781. [armeabi] Compile++ thumb: cocos2dx_internal_static <= ioapi.cpp
  782. [armeabi] Compile++ thumb: cocos2dx_internal_static <= unzip.cpp
  783. [armeabi] Compile++ thumb: cocos2dx_internal_static <= edtaa3func.cpp
  784. [armeabi] Compile thumb : cocos2dx_internal_static <= xxhash.c
  785. [armeabi] Compile++ thumb: cocos2dx_internal_static <= shapes.cc
  786. [armeabi] Compile++ thumb: cocos2dx_internal_static <= advancing_front.cc
  787. [armeabi] Compile++ thumb: cocos2dx_internal_static <= cdt.cc
  788. [armeabi] Compile++ thumb: cocos2dx_internal_static <= sweep_context.cc
  789. [armeabi] Compile++ thumb: cocos2dx_internal_static <= sweep.cc
  790. [armeabi] Compile++ thumb: cocos2dx_internal_static <= clipper.cpp
  791. [armeabi] Compile++ thumb: recast_static <= DebugDraw.cpp
  792. [armeabi] Compile++ thumb: recast_static <= DetourDebugDraw.cpp
  793. [armeabi] Compile++ thumb: recast_static <= DetourAlloc.cpp
  794. [armeabi] Compile++ thumb: recast_static <= DetourCommon.cpp
  795. [armeabi] Compile++ thumb: recast_static <= DetourNavMesh.cpp
  796. [armeabi] Compile++ thumb: recast_static <= DetourNavMeshBuilder.cpp
  797. [armeabi] Compile++ thumb: recast_static <= DetourNavMeshQuery.cpp
  798. [armeabi] Compile++ thumb: recast_static <= DetourNode.cpp
  799. [armeabi] Compile++ thumb: recast_static <= DetourCrowd.cpp
  800. [armeabi] Compile++ thumb: recast_static <= DetourLocalBoundary.cpp
  801. [armeabi] Compile++ thumb: recast_static <= DetourObstacleAvoidance.cpp
  802. [armeabi] Compile++ thumb: recast_static <= DetourPathCorridor.cpp
  803. [armeabi] Compile++ thumb: recast_static <= DetourPathQueue.cpp
  804. [armeabi] Compile++ thumb: recast_static <= DetourProximityGrid.cpp
  805. [armeabi] Compile++ thumb: recast_static <= DetourTileCache.cpp
  806. [armeabi] Compile++ thumb: recast_static <= DetourTileCacheBuilder.cpp
  807. [armeabi] Compile thumb : recast_static <= fastlz.c
  808. [armeabi] Compile++ thumb: bullet_static <= btAxisSweep3.cpp
  809. [armeabi] Compile++ thumb: bullet_static <= btBroadphaseProxy.cpp
  810. [armeabi] Compile++ thumb: bullet_static <= btCollisionAlgorithm.cpp
  811. [armeabi] Compile++ thumb: bullet_static <= btDbvt.cpp
  812. [armeabi] Compile++ thumb: bullet_static <= btDbvtBroadphase.cpp
  813. [armeabi] Compile++ thumb: bullet_static <= btDispatcher.cpp
  814. [armeabi] Compile++ thumb: bullet_static <= btMultiSapBroadphase.cpp
  815. [armeabi] Compile++ thumb: bullet_static <= btOverlappingPairCache.cpp
  816. [armeabi] Compile++ thumb: bullet_static <= btQuantizedBvh.cpp
  817. [armeabi] Compile++ thumb: bullet_static <= btSimpleBroadphase.cpp
  818. [armeabi] Compile++ thumb: bullet_static <= btActivatingCollisionAlgorithm.cpp
  819. [armeabi] Compile++ thumb: bullet_static <= btBoxBoxCollisionAlgorithm.cpp
  820. [armeabi] Compile++ thumb: bullet_static <= btBox2dBox2dCollisionAlgorithm.cpp
  821. [armeabi] Compile++ thumb: bullet_static <= btBoxBoxDetector.cpp
  822. [armeabi] Compile++ thumb: bullet_static <= btCollisionDispatcher.cpp
  823. [armeabi] Compile++ thumb: bullet_static <= btCollisionObject.cpp
  824. [armeabi] Compile++ thumb: bullet_static <= btCollisionWorld.cpp
  825. [armeabi] Compile++ thumb: bullet_static <= btCompoundCollisionAlgorithm.cpp
  826. [armeabi] Compile++ thumb: bullet_static <= btCompoundCompoundCollisionAlgorithm.cpp
  827. [armeabi] Compile++ thumb: bullet_static <= btConvexConcaveCollisionAlgorithm.cpp
  828. In file included from /Users/mills/TestGame/proj.android/../cocos2d/external/bullet/BulletCollision/CollisionDispatch/btCompoundCompoundCollisionAlgorithm.cpp:17:0:
  829. /Users/mills/TestGame/proj.android/../cocos2d/external/bullet/BulletCollision/CollisionDispatch/btCompoundCompoundCollisionAlgorithm.h:42:2: error: 'btSimplePairArray' does not name a type
  830. btSimplePairArray m_removePairs;
  831. ^
  832. In file included from /Users/mills/TestGame/proj.android/../cocos2d/external/bullet/../bullet/LinearMath/btAlignedObjectArray.h:21:0,
  833. from /Users/mills/TestGame/proj.android/../cocos2d/external/bullet/../bullet/BulletCollision//BroadphaseCollision/btCollisionAlgorithm.h:20,
  834. from /Users/mills/TestGame/proj.android/../cocos2d/external/bullet/../bullet/BulletCollision//CollisionDispatch/btActivatingCollisionAlgorithm.h:19,
  835. from /Users/mills/TestGame/proj.android/../cocos2d/external/bullet/BulletCollision/CollisionDispatch/btCompoundCompoundCollisionAlgorithm.h:20,
  836. from /Users/mills/TestGame/proj.android/../cocos2d/external/bullet/BulletCollision/CollisionDispatch/btCompoundCompoundCollisionAlgorithm.cpp:17:
  837. /Users/mills/TestGame/proj.android/../cocos2d/external/bullet/BulletCollision/CollisionDispatch/btCompoundCompoundCollisionAlgorithm.cpp: In constructor 'btCompoundCompoundCollisionAlgorithm::btCompoundCompoundCollisionAlgorithm(const btCollisionAlgorithmConstructionInfo&, const btCollisionObjectWrapper*, const btCollisionObjectWrapper*, bool)':
  838. /Users/mills/TestGame/proj.android/../cocos2d/external/bullet/BulletCollision/CollisionDispatch/btCompoundCompoundCollisionAlgorithm.cpp:35:59: error: invalid application of 'sizeof' to incomplete type 'btHashedSimplePairCache'
  839. void* ptr = btAlignedAlloc(sizeof(btHashedSimplePairCache),16);
  840. ^
  841. /Users/mills/TestGame/proj.android/../cocos2d/external/bullet/../bullet/LinearMath/btAlignedAllocator.h:41:64: note: in definition of macro 'btAlignedAlloc'
  842. #define btAlignedAlloc(size,alignment) btAlignedAllocInternal(size,alignment)
  843. ^
  844. /Users/mills/TestGame/proj.android/../cocos2d/external/bullet/BulletCollision/CollisionDispatch/btCompoundCompoundCollisionAlgorithm.cpp:36:67: error: invalid use of incomplete type 'class btHashedSimplePairCache'
  845. m_childCollisionAlgorithmCache= new(ptr) btHashedSimplePairCache();
  846. ^
  847. In file included from /Users/mills/TestGame/proj.android/../cocos2d/external/bullet/BulletCollision/CollisionDispatch/btCompoundCompoundCollisionAlgorithm.cpp:17:0:
  848. /Users/mills/TestGame/proj.android/../cocos2d/external/bullet/BulletCollision/CollisionDispatch/btCompoundCompoundCollisionAlgorithm.h:41:8: error: forward declaration of 'class btHashedSimplePairCache'
  849. class btHashedSimplePairCache* m_childCollisionAlgorithmCache;
  850. ^
  851. /Users/mills/TestGame/proj.android/../cocos2d/external/bullet/BulletCollision/CollisionDispatch/btCompoundCompoundCollisionAlgorithm.cpp: In destructor 'virtual btCompoundCompoundCollisionAlgorithm::~btCompoundCompoundCollisionAlgorithm()':
  852. /Users/mills/TestGame/proj.android/../cocos2d/external/bullet/BulletCollision/CollisionDispatch/btCompoundCompoundCollisionAlgorithm.cpp:57:32: error: invalid use of incomplete type 'class btHashedSimplePairCache'
  853. m_childCollisionAlgorithmCache->~btHashedSimplePairCache();
  854. ^
  855. In file included from /Users/mills/TestGame/proj.android/../cocos2d/external/bullet/BulletCollision/CollisionDispatch/btCompoundCompoundCollisionAlgorithm.cpp:17:0:
  856. /Users/mills/TestGame/proj.android/../cocos2d/external/bullet/BulletCollision/CollisionDispatch/btCompoundCompoundCollisionAlgorithm.h:41:8: error: forward declaration of 'class btHashedSimplePairCache'
  857. class btHashedSimplePairCache* m_childCollisionAlgorithmCache;
  858. ^
  859. /Users/mills/TestGame/proj.android/../cocos2d/external/bullet/BulletCollision/CollisionDispatch/btCompoundCompoundCollisionAlgorithm.cpp: In member function 'virtual void btCompoundCompoundCollisionAlgorithm::getAllContactManifolds(btManifoldArray&)':
  860. /Users/mills/TestGame/proj.android/../cocos2d/external/bullet/BulletCollision/CollisionDispatch/btCompoundCompoundCollisionAlgorithm.cpp:64:2: error: 'btSimplePairArray' was not declared in this scope
  861. btSimplePairArray& pairs = m_childCollisionAlgorithmCache->getOverlappingPairArray();
  862. ^
  863. /Users/mills/TestGame/proj.android/../cocos2d/external/bullet/BulletCollision/CollisionDispatch/btCompoundCompoundCollisionAlgorithm.cpp:64:21: error: 'pairs' was not declared in this scope
  864. btSimplePairArray& pairs = m_childCollisionAlgorithmCache->getOverlappingPairArray();
  865. ^
  866. /Users/mills/TestGame/proj.android/../cocos2d/external/bullet/BulletCollision/CollisionDispatch/btCompoundCompoundCollisionAlgorithm.cpp:64:59: error: invalid use of incomplete type 'class btHashedSimplePairCache'
  867. btSimplePairArray& pairs = m_childCollisionAlgorithmCache->getOverlappingPairArray();
  868. ^
  869. In file included from /Users/mills/TestGame/proj.android/../cocos2d/external/bullet/BulletCollision/CollisionDispatch/btCompoundCompoundCollisionAlgorithm.cpp:17:0:
  870. /Users/mills/TestGame/proj.android/../cocos2d/external/bullet/BulletCollision/CollisionDispatch/btCompoundCompoundCollisionAlgorithm.h:41:8: error: forward declaration of 'class btHashedSimplePairCache'
  871. class btHashedSimplePairCache* m_childCollisionAlgorithmCache;
  872. ^
  873. /Users/mills/TestGame/proj.android/../cocos2d/external/bullet/BulletCollision/CollisionDispatch/btCompoundCompoundCollisionAlgorithm.cpp: In member function 'void btCompoundCompoundCollisionAlgorithm::removeChildAlgorithms()':
  874. /Users/mills/TestGame/proj.android/../cocos2d/external/bullet/BulletCollision/CollisionDispatch/btCompoundCompoundCollisionAlgorithm.cpp:78:2: error: 'btSimplePairArray' was not declared in this scope
  875. btSimplePairArray& pairs = m_childCollisionAlgorithmCache->getOverlappingPairArray();
  876. ^
  877. /Users/mills/TestGame/proj.android/../cocos2d/external/bullet/BulletCollision/CollisionDispatch/btCompoundCompoundCollisionAlgorithm.cpp:78:21: error: 'pairs' was not declared in this scope
  878. btSimplePairArray& pairs = m_childCollisionAlgorithmCache->getOverlappingPairArray();
  879. ^
  880. /Users/mills/TestGame/proj.android/../cocos2d/external/bullet/BulletCollision/CollisionDispatch/btCompoundCompoundCollisionAlgorithm.cpp:78:59: error: invalid use of incomplete type 'class btHashedSimplePairCache'
  881. btSimplePairArray& pairs = m_childCollisionAlgorithmCache->getOverlappingPairArray();
  882. ^
  883. In file included from /Users/mills/TestGame/proj.android/../cocos2d/external/bullet/BulletCollision/CollisionDispatch/btCompoundCompoundCollisionAlgorithm.cpp:17:0:
  884. /Users/mills/TestGame/proj.android/../cocos2d/external/bullet/BulletCollision/CollisionDispatch/btCompoundCompoundCollisionAlgorithm.h:41:8: error: forward declaration of 'class btHashedSimplePairCache'
  885. class btHashedSimplePairCache* m_childCollisionAlgorithmCache;
  886. ^
  887. /Users/mills/TestGame/proj.android/../cocos2d/external/bullet/BulletCollision/CollisionDispatch/btCompoundCompoundCollisionAlgorithm.cpp:91:32: error: invalid use of incomplete type 'class btHashedSimplePairCache'
  888. m_childCollisionAlgorithmCache->removeAllPairs();
  889. ^
  890. In file included from /Users/mills/TestGame/proj.android/../cocos2d/external/bullet/BulletCollision/CollisionDispatch/btCompoundCompoundCollisionAlgorithm.cpp:17:0:
  891. /Users/mills/TestGame/proj.android/../cocos2d/external/bullet/BulletCollision/CollisionDispatch/btCompoundCompoundCollisionAlgorithm.h:41:8: error: forward declaration of 'class btHashedSimplePairCache'
  892. class btHashedSimplePairCache* m_childCollisionAlgorithmCache;
  893. ^
  894. /Users/mills/TestGame/proj.android/../cocos2d/external/bullet/BulletCollision/CollisionDispatch/btCompoundCompoundCollisionAlgorithm.cpp: In member function 'virtual void btCompoundCompoundLeafCallback::Process(const btDbvtNode*, const btDbvtNode*)':
  895. /Users/mills/TestGame/proj.android/../cocos2d/external/bullet/BulletCollision/CollisionDispatch/btCompoundCompoundCollisionAlgorithm.cpp:177:4: error: 'btSimplePair' was not declared in this scope
  896. btSimplePair* pair = m_childCollisionAlgorithmCache->findPair(childIndex0,childIndex1);
  897. ^
  898. /Users/mills/TestGame/proj.android/../cocos2d/external/bullet/BulletCollision/CollisionDispatch/btCompoundCompoundCollisionAlgorithm.cpp:177:18: error: 'pair' was not declared in this scope
  899. btSimplePair* pair = m_childCollisionAlgorithmCache->findPair(childIndex0,childIndex1);
  900. ^
  901. /Users/mills/TestGame/proj.android/../cocos2d/external/bullet/BulletCollision/CollisionDispatch/btCompoundCompoundCollisionAlgorithm.cpp:177:55: error: invalid use of incomplete type 'class btHashedSimplePairCache'
  902. btSimplePair* pair = m_childCollisionAlgorithmCache->findPair(childIndex0,childIndex1);
  903. ^
  904. In file included from /Users/mills/TestGame/proj.android/../cocos2d/external/bullet/BulletCollision/CollisionDispatch/btCompoundCompoundCollisionAlgorithm.cpp:17:0:
  905. /Users/mills/TestGame/proj.android/../cocos2d/external/bullet/BulletCollision/CollisionDispatch/btCompoundCompoundCollisionAlgorithm.h:41:8: error: forward declaration of 'class btHashedSimplePairCache'
  906. class btHashedSimplePairCache* m_childCollisionAlgorithmCache;
  907. ^
  908. /Users/mills/TestGame/proj.android/../cocos2d/external/bullet/BulletCollision/CollisionDispatch/btCompoundCompoundCollisionAlgorithm.cpp:188:42: error: invalid use of incomplete type 'class btHashedSimplePairCache'
  909. pair = m_childCollisionAlgorithmCache->addOverlappingPair(childIndex0,childIndex1);
  910. ^
  911. In file included from /Users/mills/TestGame/proj.android/../cocos2d/external/bullet/BulletCollision/CollisionDispatch/btCompoundCompoundCollisionAlgorithm.cpp:17:0:
  912. /Users/mills/TestGame/proj.android/../cocos2d/external/bullet/BulletCollision/CollisionDispatch/btCompoundCompoundCollisionAlgorithm.h:41:8: error: forward declaration of 'class btHashedSimplePairCache'
  913. class btHashedSimplePairCache* m_childCollisionAlgorithmCache;
  914. ^
  915. /Users/mills/TestGame/proj.android/../cocos2d/external/bullet/BulletCollision/CollisionDispatch/btCompoundCompoundCollisionAlgorithm.cpp: In member function 'virtual void btCompoundCompoundCollisionAlgorithm::processCollision(const btCollisionObjectWrapper*, const btCollisionObjectWrapper*, const btDispatcherInfo&, btManifoldResult*)':
  916. /Users/mills/TestGame/proj.android/../cocos2d/external/bullet/BulletCollision/CollisionDispatch/btCompoundCompoundCollisionAlgorithm.cpp:310:3: error: 'btSimplePairArray' was not declared in this scope
  917. btSimplePairArray& pairs = m_childCollisionAlgorithmCache->getOverlappingPairArray();
  918. ^
  919. /Users/mills/TestGame/proj.android/../cocos2d/external/bullet/BulletCollision/CollisionDispatch/btCompoundCompoundCollisionAlgorithm.cpp:310:22: error: 'pairs' was not declared in this scope
  920. btSimplePairArray& pairs = m_childCollisionAlgorithmCache->getOverlappingPairArray();
  921. ^
  922. /Users/mills/TestGame/proj.android/../cocos2d/external/bullet/BulletCollision/CollisionDispatch/btCompoundCompoundCollisionAlgorithm.cpp:310:60: error: invalid use of incomplete type 'class btHashedSimplePairCache'
  923. btSimplePairArray& pairs = m_childCollisionAlgorithmCache->getOverlappingPairArray();
  924. ^
  925. In file included from /Users/mills/TestGame/proj.android/../cocos2d/external/bullet/BulletCollision/CollisionDispatch/btCompoundCompoundCollisionAlgorithm.cpp:17:0:
  926. /Users/mills/TestGame/proj.android/../cocos2d/external/bullet/BulletCollision/CollisionDispatch/btCompoundCompoundCollisionAlgorithm.h:41:8: error: forward declaration of 'class btHashedSimplePairCache'
  927. class btHashedSimplePairCache* m_childCollisionAlgorithmCache;
  928. ^
  929. /Users/mills/TestGame/proj.android/../cocos2d/external/bullet/BulletCollision/CollisionDispatch/btCompoundCompoundCollisionAlgorithm.cpp:349:3: error: 'btSimplePairArray' was not declared in this scope
  930. btSimplePairArray& pairs = m_childCollisionAlgorithmCache->getOverlappingPairArray();
  931. ^
  932. /Users/mills/TestGame/proj.android/../cocos2d/external/bullet/BulletCollision/CollisionDispatch/btCompoundCompoundCollisionAlgorithm.cpp:349:22: error: 'pairs' was not declared in this scope
  933. btSimplePairArray& pairs = m_childCollisionAlgorithmCache->getOverlappingPairArray();
  934. ^
  935. /Users/mills/TestGame/proj.android/../cocos2d/external/bullet/BulletCollision/CollisionDispatch/btCompoundCompoundCollisionAlgorithm.cpp:349:60: error: invalid use of incomplete type 'class btHashedSimplePairCache'
  936. btSimplePairArray& pairs = m_childCollisionAlgorithmCache->getOverlappingPairArray();
  937. ^
  938. In file included from /Users/mills/TestGame/proj.android/../cocos2d/external/bullet/BulletCollision/CollisionDispatch/btCompoundCompoundCollisionAlgorithm.cpp:17:0:
  939. /Users/mills/TestGame/proj.android/../cocos2d/external/bullet/BulletCollision/CollisionDispatch/btCompoundCompoundCollisionAlgorithm.h:41:8: error: forward declaration of 'class btHashedSimplePairCache'
  940. class btHashedSimplePairCache* m_childCollisionAlgorithmCache;
  941. ^
  942. /Users/mills/TestGame/proj.android/../cocos2d/external/bullet/BulletCollision/CollisionDispatch/btCompoundCompoundCollisionAlgorithm.cpp:400:6: error: 'm_removePairs' was not declared in this scope
  943. m_removePairs.push_back(btSimplePair(pairs[i].m_indexA,pairs[i].m_indexB));
  944. ^
  945. /Users/mills/TestGame/proj.android/../cocos2d/external/bullet/BulletCollision/CollisionDispatch/btCompoundCompoundCollisionAlgorithm.cpp:400:78: error: 'btSimplePair' was not declared in this scope
  946. m_removePairs.push_back(btSimplePair(pairs[i].m_indexA,pairs[i].m_indexB));
  947. ^
  948. /Users/mills/TestGame/proj.android/../cocos2d/external/bullet/BulletCollision/CollisionDispatch/btCompoundCompoundCollisionAlgorithm.cpp:404:18: error: 'm_removePairs' was not declared in this scope
  949. for (int i=0;i<m_removePairs.size();i++)
  950. ^
  951. /Users/mills/TestGame/proj.android/../cocos2d/external/bullet/BulletCollision/CollisionDispatch/btCompoundCompoundCollisionAlgorithm.cpp:406:34: error: invalid use of incomplete type 'class btHashedSimplePairCache'
  952. m_childCollisionAlgorithmCache->removeOverlappingPair(m_removePairs[i].m_indexA,m_removePairs[i].m_indexB);
  953. ^
  954. In file included from /Users/mills/TestGame/proj.android/../cocos2d/external/bullet/BulletCollision/CollisionDispatch/btCompoundCompoundCollisionAlgorithm.cpp:17:0:
  955. /Users/mills/TestGame/proj.android/../cocos2d/external/bullet/BulletCollision/CollisionDispatch/btCompoundCompoundCollisionAlgorithm.h:41:8: error: forward declaration of 'class btHashedSimplePairCache'
  956. class btHashedSimplePairCache* m_childCollisionAlgorithmCache;
  957. ^
  958. /Users/mills/TestGame/proj.android/../cocos2d/external/bullet/BulletCollision/CollisionDispatch/btCompoundCompoundCollisionAlgorithm.cpp:408:3: error: 'm_removePairs' was not declared in this scope
  959. m_removePairs.clear();
  960. ^
  961. make: *** [obj/local/armeabi/objs-debug/bullet_static/BulletCollision/CollisionDispatch/btCompoundCompoundCollisionAlgorithm.o] Error 1
  962. make: *** Waiting for unfinished jobs....
  963. make: Leaving directory `/Users/mills/TestGame/proj.android'
  964. Error running command, return code: 2.
  965. Daniels-MacBook-Pro:TestGame mills$
Advertisement
Add Comment
Please, Sign In to add comment