Pastebin launched a little side project called VERYVIRAL.com, check it out ;-) Want more features on Pastebin? Sign Up, it's FREE!
Guest

Untitled

By: a guest on Mar 18th, 2013  |  syntax: None  |  size: 3.74 KB  |  views: 71  |  expires: Never
download  |  raw  |  embed  |  report abuse  |  print
Text below is selected. Please press Ctrl+C to copy to your clipboard. (⌘+C on Mac)
  1. --2013-03-18 21:08:31--  http://gehidore.net/drivers/Realtek_RTS5229_Linux_Driver_v1.07.zip
  2. Распознаётся gehidore.net (gehidore.net)... 64.13.232.84
  3. Подключение к gehidore.net (gehidore.net)|64.13.232.84|:80... соединение установлено.
  4. HTTP-запрос отправлен. Ожидание ответа... 200 OK
  5. Длина: 67519 (66K) [application/zip]
  6. Сохранение в: «Realtek_RTS5229_Linux_Driver_v1.07.zip»
  7.  
  8. 100%[============================================================================>] 67 519       168KB/s   за 0,4s  
  9.  
  10. 2013-03-18 21:08:32 (168 KB/s) - «Realtek_RTS5229_Linux_Driver_v1.07.zip» сохранён [67519/67519]
  11.  
  12. Archive:  Realtek_RTS5229_Linux_Driver_v1.07.zip
  13.    creating: Realtek_RTS5229_Linux_Driver_v1.07/
  14.  extracting: Realtek_RTS5229_Linux_Driver_v1.07/rts5229.tar.bz2  
  15. cp -f ./define.release ./define.h
  16. make -C /lib/modules/3.8.3-2-ARCH/build/ SUBDIRS=/tmp/yaourt-tmp-root/aur-rts5229/src/rts5229 modules
  17. make[1]: Вход в каталог `/usr/src/linux-3.8.3-2-ARCH'
  18.   CC [M]  /tmp/yaourt-tmp-root/aur-rts5229/src/rts5229/rtsx.o
  19. /tmp/yaourt-tmp-root/aur-rts5229/src/rts5229/rtsx.c:914:22: ошибка: expected «=», «,», «;», «asm» or «__attribute__» before «rtsx_probe»
  20. /tmp/yaourt-tmp-root/aur-rts5229/src/rts5229/rtsx.c:1069:23: ошибка: expected «=», «,», «;», «asm» or «__attribute__» before «rtsx_remove»
  21. /tmp/yaourt-tmp-root/aur-rts5229/src/rts5229/rtsx.c:1094:11: ошибка: «rtsx_probe» undeclared here (not in a function)
  22. /tmp/yaourt-tmp-root/aur-rts5229/src/rts5229/rtsx.c:1095:2: ошибка: неявная декларация функции «__devexit_p» [-Werror=implicit-function-declaration]
  23. /tmp/yaourt-tmp-root/aur-rts5229/src/rts5229/rtsx.c:1095:24: ошибка: «rtsx_remove» undeclared here (not in a function)
  24. /tmp/yaourt-tmp-root/aur-rts5229/src/rts5229/rtsx.c:262:34: предупреждение: «rtsx_host_template» определена, но нигде не используется [-Wunused-variable]
  25. /tmp/yaourt-tmp-root/aur-rts5229/src/rts5229/rtsx.c:476:12: предупреждение: «rtsx_control_thread» определена, но нигде не используется [-Wunused-function]
  26. /tmp/yaourt-tmp-root/aur-rts5229/src/rts5229/rtsx.c:585:12: предупреждение: «rtsx_polling_thread» определена, но нигде не используется [-Wunused-function]
  27. /tmp/yaourt-tmp-root/aur-rts5229/src/rts5229/rtsx.c:739:13: предупреждение: «quiesce_and_remove_host» определена, но нигде не используется [-Wunused-function]
  28. /tmp/yaourt-tmp-root/aur-rts5229/src/rts5229/rtsx.c:775:13: предупреждение: «release_everything» определена, но нигде не используется [-Wunused-function]
  29. /tmp/yaourt-tmp-root/aur-rts5229/src/rts5229/rtsx.c:785:12: предупреждение: «rtsx_scan_thread» определена, но нигде не используется [-Wunused-function]
  30. /tmp/yaourt-tmp-root/aur-rts5229/src/rts5229/rtsx.c:810:13: предупреждение: «rtsx_init_options» определена, но нигде не используется [-Wunused-function]
  31. cc1: some warnings being treated as errors
  32. make[2]: *** [/tmp/yaourt-tmp-root/aur-rts5229/src/rts5229/rtsx.o] Ошибка 1
  33. make[1]: *** [_module_/tmp/yaourt-tmp-root/aur-rts5229/src/rts5229] Ошибка 2
  34. make[1]: Выход из каталога `/usr/src/linux-3.8.3-2-ARCH'
  35. make: *** [default] Ошибка 2
  36. ==> ОШИБКА: Произошел сбой в build().
  37.     Преждевременный выход...
  38. ==> ERROR: Makepkg was unable to build rts5229.
  39. ==> Restart building rts5229 ? [y/N]