rippler

Untitled

Jun 21st, 2014
370
0
Never
Not a member of Pastebin yet? Sign Up, it unlocks many cool features!
Bash 72.16 KB | None | 0 0
  1. This file contains any messages produced by compilers while
  2. running configure, to aid debugging if configure makes a mistake.
  3.  
  4. It was created by Bitcoin Core configure 0.9.2, which was
  5. generated by GNU Autoconf 2.69.  Invocation command line was
  6.  
  7.   $ ./configure --disable-wallet --without-gui
  8.  
  9. ## --------- ##
  10. ## Platform. ##
  11. ## --------- ##
  12.  
  13. hostname = raspberrypi
  14. uname -m = armv6l
  15. uname -r = 3.12.22+
  16. uname -s = Linux
  17. uname -v = #691 PREEMPT Wed Jun 18 18:29:58 BST 2014
  18.  
  19. /usr/bin/uname -p = unknown
  20. /bin/uname -X     = unknown
  21.  
  22. /bin/arch              = unknown
  23. /usr/bin/arch -k       = unknown
  24. /usr/convex/getsysinfo = unknown
  25. /usr/bin/hostinfo      = unknown
  26. /bin/machine           = unknown
  27. /usr/bin/oslevel       = unknown
  28. /bin/universe          = unknown
  29.  
  30. PATH: /usr/local/sbin
  31. PATH: /usr/local/bin
  32. PATH: /usr/sbin
  33. PATH: /usr/bin
  34. PATH: /sbin
  35. PATH: /bin
  36. PATH: /usr/local/games
  37. PATH: /usr/games
  38.  
  39.  
  40. ## ----------- ##
  41. ## Core tests. ##
  42. ## ----------- ##
  43.  
  44. configure:2733: checking build system type
  45. configure:2747: result: armv6l-unknown-linux-gnueabihf
  46. configure:2767: checking host system type
  47. configure:2780: result: armv6l-unknown-linux-gnueabihf
  48. configure:2921: checking for a BSD-compatible install
  49. configure:2989: result: /usr/bin/install -c
  50. configure:3000: checking whether build environment is sane
  51. configure:3055: result: yes
  52. configure:3206: checking for a thread-safe mkdir -p
  53. configure:3245: result: /bin/mkdir -p
  54. configure:3252: checking for gawk
  55. configure:3282: result: no
  56. configure:3252: checking for mawk
  57. configure:3268: found /usr/bin/mawk
  58. configure:3279: result: mawk
  59. configure:3290: checking whether make sets $(MAKE)
  60. configure:3312: result: yes
  61. configure:3341: checking whether make supports nested variables
  62. configure:3358: result: yes
  63. configure:3477: checking whether to enable maintainer-specific portions of Makefiles
  64. configure:3486: result: yes
  65. configure:3511: checking whether make supports nested variables
  66. configure:3528: result: yes
  67. configure:3702: checking for g++
  68. configure:3718: found /usr/bin/g++
  69. configure:3729: result: g++
  70. configure:3756: checking for C++ compiler version
  71. configure:3765: g++ --version >&5
  72. g++ (Raspbian 4.9.0-6) 4.9.0
  73. Copyright (C) 2014 Free Software Foundation, Inc.
  74. This is free software; see the source for copying conditions.  There is NO
  75. warranty; not even for MERCHANTABILITY or FITNESS FOR A PARTICULAR PURPOSE.
  76.  
  77. configure:3776: $? = 0
  78. configure:3765: g++ -v >&5
  79. Using built-in specs.
  80. COLLECT_GCC=g++
  81. COLLECT_LTO_WRAPPER=/usr/lib/gcc/arm-linux-gnueabihf/4.9/lto-wrapper
  82. Target: arm-linux-gnueabihf
  83. Configured with: ../src/configure -v --with-pkgversion='Raspbian 4.9.0-6' --with-bugurl=file:///usr/share/doc/gcc-4.9/README.Bugs --enable-languages=c,c++,java,go,d,fortran,objc,obj-c++ --prefix=/usr --program-suffix=-4.9 --enable-shared --enable-linker-build-id --libexecdir=/usr/lib --without-included-gettext --enable-threads=posix --with-gxx-include-dir=/usr/include/c++/4.9 --libdir=/usr/lib --enable-nls --with-sysroot=/ --enable-clocale=gnu --enable-libstdcxx-debug --enable-libstdcxx-time=yes --enable-gnu-unique-object --disable-libmudflap --disable-libitm --disable-libquadmath --enable-plugin --with-system-zlib --disable-browser-plugin --enable-java-awt=gtk --enable-gtk-cairo --with-java-home=/usr/lib/jvm/java-1.5.0-gcj-4.9-armhf/jre --enable-java-home --with-jvm-root-dir=/usr/lib/jvm/java-1.5.0-gcj-4.9-armhf --with-jvm-jar-dir=/usr/lib/jvm-exports/java-1.5.0-gcj-4.9-armhf --with-arch-directory=arm --with-ecj-jar=/usr/share/java/eclipse-ecj.jar --enable-objc-gc --enable-multiarch --disable-sjlj-exceptions --with-arch=armv6 --with-fpu=vfp --with-float=hard --enable-checking=release --build=arm-linux-gnueabihf --host=arm-linux-gnueabihf --target=arm-linux-gnueabihf
  84. Thread model: posix
  85. gcc version 4.9.0 (Raspbian 4.9.0-6)
  86. configure:3776: $? = 0
  87. configure:3765: g++ -V >&5
  88. g++: error: unrecognized command line option '-V'
  89. g++: fatal error: no input files
  90. compilation terminated.
  91. configure:3776: $? = 4
  92. configure:3765: g++ -qversion >&5
  93. g++: error: unrecognized command line option '-qversion'
  94. g++: fatal error: no input files
  95. compilation terminated.
  96. configure:3776: $? = 4
  97. configure:3796: checking whether the C++ compiler works
  98. configure:3818: g++    conftest.cpp  >&5
  99. configure:3822: $? = 0
  100. configure:3870: result: yes
  101. configure:3873: checking for C++ compiler default output file name
  102. configure:3875: result: a.out
  103. configure:3881: checking for suffix of executables
  104. configure:3888: g++ -o conftest    conftest.cpp  >&5
  105. configure:3892: $? = 0
  106. configure:3914: result:
  107. configure:3936: checking whether we are cross compiling
  108. configure:3944: g++ -o conftest    conftest.cpp  >&5
  109. configure:3948: $? = 0
  110. configure:3955: ./conftest
  111. configure:3959: $? = 0
  112. configure:3974: result: no
  113. configure:3979: checking for suffix of object files
  114. configure:4001: g++ -c   conftest.cpp >&5
  115. configure:4005: $? = 0
  116. configure:4026: result: o
  117. configure:4030: checking whether we are using the GNU C++ compiler
  118. configure:4049: g++ -c   conftest.cpp >&5
  119. configure:4049: $? = 0
  120. configure:4058: result: yes
  121. configure:4067: checking whether g++ accepts -g
  122. configure:4087: g++ -c -g  conftest.cpp >&5
  123. configure:4087: $? = 0
  124. configure:4128: result: yes
  125. configure:4162: checking for style of include used by make
  126. configure:4190: result: GNU
  127. configure:4216: checking dependency style of g++
  128. configure:4327: result: gcc3
  129. configure:4390: checking for gcc
  130. configure:4406: found /usr/bin/gcc
  131. configure:4417: result: gcc
  132. configure:4646: checking for C compiler version
  133. configure:4655: gcc --version >&5
  134. gcc (Raspbian 4.9.0-6) 4.9.0
  135. Copyright (C) 2014 Free Software Foundation, Inc.
  136. This is free software; see the source for copying conditions.  There is NO
  137. warranty; not even for MERCHANTABILITY or FITNESS FOR A PARTICULAR PURPOSE.
  138.  
  139. configure:4666: $? = 0
  140. configure:4655: gcc -v >&5
  141. Using built-in specs.
  142. COLLECT_GCC=gcc
  143. COLLECT_LTO_WRAPPER=/usr/lib/gcc/arm-linux-gnueabihf/4.9/lto-wrapper
  144. Target: arm-linux-gnueabihf
  145. Configured with: ../src/configure -v --with-pkgversion='Raspbian 4.9.0-6' --with-bugurl=file:///usr/share/doc/gcc-4.9/README.Bugs --enable-languages=c,c++,java,go,d,fortran,objc,obj-c++ --prefix=/usr --program-suffix=-4.9 --enable-shared --enable-linker-build-id --libexecdir=/usr/lib --without-included-gettext --enable-threads=posix --with-gxx-include-dir=/usr/include/c++/4.9 --libdir=/usr/lib --enable-nls --with-sysroot=/ --enable-clocale=gnu --enable-libstdcxx-debug --enable-libstdcxx-time=yes --enable-gnu-unique-object --disable-libmudflap --disable-libitm --disable-libquadmath --enable-plugin --with-system-zlib --disable-browser-plugin --enable-java-awt=gtk --enable-gtk-cairo --with-java-home=/usr/lib/jvm/java-1.5.0-gcj-4.9-armhf/jre --enable-java-home --with-jvm-root-dir=/usr/lib/jvm/java-1.5.0-gcj-4.9-armhf --with-jvm-jar-dir=/usr/lib/jvm-exports/java-1.5.0-gcj-4.9-armhf --with-arch-directory=arm --with-ecj-jar=/usr/share/java/eclipse-ecj.jar --enable-objc-gc --enable-multiarch --disable-sjlj-exceptions --with-arch=armv6 --with-fpu=vfp --with-float=hard --enable-checking=release --build=arm-linux-gnueabihf --host=arm-linux-gnueabihf --target=arm-linux-gnueabihf
  146. Thread model: posix
  147. gcc version 4.9.0 (Raspbian 4.9.0-6)
  148. configure:4666: $? = 0
  149. configure:4655: gcc -V >&5
  150. gcc: error: unrecognized command line option '-V'
  151. gcc: fatal error: no input files
  152. compilation terminated.
  153. configure:4666: $? = 4
  154. configure:4655: gcc -qversion >&5
  155. gcc: error: unrecognized command line option '-qversion'
  156. gcc: fatal error: no input files
  157. compilation terminated.
  158. configure:4666: $? = 4
  159. configure:4670: checking whether we are using the GNU C compiler
  160. configure:4689: gcc -c   conftest.c >&5
  161. configure:4689: $? = 0
  162. configure:4698: result: yes
  163. configure:4707: checking whether gcc accepts -g
  164. configure:4727: gcc -c -g  conftest.c >&5
  165. configure:4727: $? = 0
  166. configure:4768: result: yes
  167. configure:4785: checking for gcc option to accept ISO C89
  168. configure:4848: gcc  -c -g -O2  conftest.c >&5
  169. configure:4848: $? = 0
  170. configure:4861: result: none needed
  171. configure:4886: checking whether gcc understands -c and -o together
  172. configure:4908: gcc -c conftest.c -o conftest2.o
  173. configure:4911: $? = 0
  174. configure:4908: gcc -c conftest.c -o conftest2.o
  175. configure:4911: $? = 0
  176. configure:4923: result: yes
  177. configure:4942: checking dependency style of gcc
  178. configure:5053: result: gcc3
  179. configure:5073: checking how to run the C preprocessor
  180. configure:5104: gcc -E  conftest.c
  181. configure:5104: $? = 0
  182. configure:5118: gcc -E  conftest.c
  183. conftest.c:9:28: fatal error: ac_nonexistent.h: No such file or directory
  184.  #include <ac_nonexistent.h>
  185.                             ^
  186. compilation terminated.
  187. configure:5118: $? = 1
  188. configure: failed program was:
  189. | /* confdefs.h */
  190. | #define PACKAGE_NAME "Bitcoin Core"
  191. | #define PACKAGE_TARNAME "bitcoin"
  192. | #define PACKAGE_VERSION "0.9.2"
  193. | #define PACKAGE_STRING "Bitcoin Core 0.9.2"
  194. | #define PACKAGE_BUGREPORT "[email protected]"
  195. | #define PACKAGE_URL ""
  196. | /* end confdefs.h.  */
  197. | #include <ac_nonexistent.h>
  198. configure:5143: result: gcc -E
  199. configure:5163: gcc -E  conftest.c
  200. configure:5163: $? = 0
  201. configure:5177: gcc -E  conftest.c
  202. conftest.c:9:28: fatal error: ac_nonexistent.h: No such file or directory
  203.  #include <ac_nonexistent.h>
  204.                             ^
  205. compilation terminated.
  206. configure:5177: $? = 1
  207. configure: failed program was:
  208. | /* confdefs.h */
  209. | #define PACKAGE_NAME "Bitcoin Core"
  210. | #define PACKAGE_TARNAME "bitcoin"
  211. | #define PACKAGE_VERSION "0.9.2"
  212. | #define PACKAGE_STRING "Bitcoin Core 0.9.2"
  213. | #define PACKAGE_BUGREPORT "[email protected]"
  214. | #define PACKAGE_URL ""
  215. | /* end confdefs.h.  */
  216. | #include <ac_nonexistent.h>
  217. configure:5210: checking how to run the C++ preprocessor
  218. configure:5237: g++ -E  conftest.cpp
  219. configure:5237: $? = 0
  220. configure:5251: g++ -E  conftest.cpp
  221. conftest.cpp:9:28: fatal error: ac_nonexistent.h: No such file or directory
  222.  #include <ac_nonexistent.h>
  223.                             ^
  224. compilation terminated.
  225. configure:5251: $? = 1
  226. configure: failed program was:
  227. | /* confdefs.h */
  228. | #define PACKAGE_NAME "Bitcoin Core"
  229. | #define PACKAGE_TARNAME "bitcoin"
  230. | #define PACKAGE_VERSION "0.9.2"
  231. | #define PACKAGE_STRING "Bitcoin Core 0.9.2"
  232. | #define PACKAGE_BUGREPORT "[email protected]"
  233. | #define PACKAGE_URL ""
  234. | /* end confdefs.h.  */
  235. | #include <ac_nonexistent.h>
  236. configure:5276: result: g++ -E
  237. configure:5296: g++ -E  conftest.cpp
  238. configure:5296: $? = 0
  239. configure:5310: g++ -E  conftest.cpp
  240. conftest.cpp:9:28: fatal error: ac_nonexistent.h: No such file or directory
  241.  #include <ac_nonexistent.h>
  242.                             ^
  243. compilation terminated.
  244. configure:5310: $? = 1
  245. configure: failed program was:
  246. | /* confdefs.h */
  247. | #define PACKAGE_NAME "Bitcoin Core"
  248. | #define PACKAGE_TARNAME "bitcoin"
  249. | #define PACKAGE_VERSION "0.9.2"
  250. | #define PACKAGE_STRING "Bitcoin Core 0.9.2"
  251. | #define PACKAGE_BUGREPORT "[email protected]"
  252. | #define PACKAGE_URL ""
  253. | /* end confdefs.h.  */
  254. | #include <ac_nonexistent.h>
  255. configure:5393: checking for gcc
  256. configure:5409: found /usr/bin/gcc
  257. configure:5420: result: gcc
  258. configure:5445: checking for Objective C compiler version
  259. configure:5454: gcc --version >&5
  260. gcc (Raspbian 4.9.0-6) 4.9.0
  261. Copyright (C) 2014 Free Software Foundation, Inc.
  262. This is free software; see the source for copying conditions.  There is NO
  263. warranty; not even for MERCHANTABILITY or FITNESS FOR A PARTICULAR PURPOSE.
  264.  
  265. configure:5465: $? = 0
  266. configure:5454: gcc -v >&5
  267. Using built-in specs.
  268. COLLECT_GCC=gcc
  269. COLLECT_LTO_WRAPPER=/usr/lib/gcc/arm-linux-gnueabihf/4.9/lto-wrapper
  270. Target: arm-linux-gnueabihf
  271. Configured with: ../src/configure -v --with-pkgversion='Raspbian 4.9.0-6' --with-bugurl=file:///usr/share/doc/gcc-4.9/README.Bugs --enable-languages=c,c++,java,go,d,fortran,objc,obj-c++ --prefix=/usr --program-suffix=-4.9 --enable-shared --enable-linker-build-id --libexecdir=/usr/lib --without-included-gettext --enable-threads=posix --with-gxx-include-dir=/usr/include/c++/4.9 --libdir=/usr/lib --enable-nls --with-sysroot=/ --enable-clocale=gnu --enable-libstdcxx-debug --enable-libstdcxx-time=yes --enable-gnu-unique-object --disable-libmudflap --disable-libitm --disable-libquadmath --enable-plugin --with-system-zlib --disable-browser-plugin --enable-java-awt=gtk --enable-gtk-cairo --with-java-home=/usr/lib/jvm/java-1.5.0-gcj-4.9-armhf/jre --enable-java-home --with-jvm-root-dir=/usr/lib/jvm/java-1.5.0-gcj-4.9-armhf --with-jvm-jar-dir=/usr/lib/jvm-exports/java-1.5.0-gcj-4.9-armhf --with-arch-directory=arm --with-ecj-jar=/usr/share/java/eclipse-ecj.jar --enable-objc-gc --enable-multiarch --disable-sjlj-exceptions --with-arch=armv6 --with-fpu=vfp --with-float=hard --enable-checking=release --build=arm-linux-gnueabihf --host=arm-linux-gnueabihf --target=arm-linux-gnueabihf
  272. Thread model: posix
  273. gcc version 4.9.0 (Raspbian 4.9.0-6)
  274. configure:5465: $? = 0
  275. configure:5454: gcc -V >&5
  276. gcc: error: unrecognized command line option '-V'
  277. gcc: fatal error: no input files
  278. compilation terminated.
  279. configure:5465: $? = 4
  280. configure:5454: gcc -qversion >&5
  281. gcc: error: unrecognized command line option '-qversion'
  282. gcc: fatal error: no input files
  283. compilation terminated.
  284. configure:5465: $? = 4
  285. configure:5469: checking whether we are using the GNU Objective C compiler
  286. configure:5488: gcc -c   conftest.m >&5
  287. gcc: error trying to exec 'cc1obj': execvp: No such file or directory
  288. configure:5488: $? = 1
  289. configure: failed program was:
  290. | /* confdefs.h */
  291. | #define PACKAGE_NAME "Bitcoin Core"
  292. | #define PACKAGE_TARNAME "bitcoin"
  293. | #define PACKAGE_VERSION "0.9.2"
  294. | #define PACKAGE_STRING "Bitcoin Core 0.9.2"
  295. | #define PACKAGE_BUGREPORT "[email protected]"
  296. | #define PACKAGE_URL ""
  297. | /* end confdefs.h.  */
  298. |
  299. | int
  300. | main ()
  301. | {
  302. | #ifndef __GNUC__
  303. |        choke me
  304. | #endif
  305. |
  306. |   ;
  307. |   return 0;
  308. | }
  309. configure:5497: result: no
  310. configure:5506: checking whether gcc accepts -g
  311. configure:5526: gcc -c -g  conftest.m >&5
  312. gcc: error trying to exec 'cc1obj': execvp: No such file or directory
  313. configure:5526: $? = 1
  314. configure: failed program was:
  315. | /* confdefs.h */
  316. | #define PACKAGE_NAME "Bitcoin Core"
  317. | #define PACKAGE_TARNAME "bitcoin"
  318. | #define PACKAGE_VERSION "0.9.2"
  319. | #define PACKAGE_STRING "Bitcoin Core 0.9.2"
  320. | #define PACKAGE_BUGREPORT "[email protected]"
  321. | #define PACKAGE_URL ""
  322. | /* end confdefs.h.  */
  323. |
  324. | int
  325. | main ()
  326. | {
  327. |
  328. |   ;
  329. |   return 0;
  330. | }
  331. configure:5541: gcc -c   conftest.m >&5
  332. gcc: error trying to exec 'cc1obj': execvp: No such file or directory
  333. configure:5541: $? = 1
  334. configure: failed program was:
  335. | /* confdefs.h */
  336. | #define PACKAGE_NAME "Bitcoin Core"
  337. | #define PACKAGE_TARNAME "bitcoin"
  338. | #define PACKAGE_VERSION "0.9.2"
  339. | #define PACKAGE_STRING "Bitcoin Core 0.9.2"
  340. | #define PACKAGE_BUGREPORT "[email protected]"
  341. | #define PACKAGE_URL ""
  342. | /* end confdefs.h.  */
  343. |
  344. | int
  345. | main ()
  346. | {
  347. |
  348. |   ;
  349. |   return 0;
  350. | }
  351. configure:5557: gcc -c -g  conftest.m >&5
  352. gcc: error trying to exec 'cc1obj': execvp: No such file or directory
  353. configure:5557: $? = 1
  354. configure: failed program was:
  355. | /* confdefs.h */
  356. | #define PACKAGE_NAME "Bitcoin Core"
  357. | #define PACKAGE_TARNAME "bitcoin"
  358. | #define PACKAGE_VERSION "0.9.2"
  359. | #define PACKAGE_STRING "Bitcoin Core 0.9.2"
  360. | #define PACKAGE_BUGREPORT "[email protected]"
  361. | #define PACKAGE_URL ""
  362. | /* end confdefs.h.  */
  363. |
  364. | int
  365. | main ()
  366. | {
  367. |
  368. |   ;
  369. |   return 0;
  370. | }
  371. configure:5567: result: no
  372. configure:5592: checking dependency style of gcc
  373. configure:5701: result: gcc3
  374. configure:5716: checking whether ln -s works
  375. configure:5720: result: yes
  376. configure:5781: checking for g++
  377. configure:5797: found /usr/bin/g++
  378. configure:5808: result: g++
  379. configure:5833: checking for Objective C++ compiler version
  380. configure:5842: g++ --version >&5
  381. g++ (Raspbian 4.9.0-6) 4.9.0
  382. Copyright (C) 2014 Free Software Foundation, Inc.
  383. This is free software; see the source for copying conditions.  There is NO
  384. warranty; not even for MERCHANTABILITY or FITNESS FOR A PARTICULAR PURPOSE.
  385.  
  386. configure:5853: $? = 0
  387. configure:5842: g++ -v >&5
  388. Using built-in specs.
  389. COLLECT_GCC=g++
  390. COLLECT_LTO_WRAPPER=/usr/lib/gcc/arm-linux-gnueabihf/4.9/lto-wrapper
  391. Target: arm-linux-gnueabihf
  392. Configured with: ../src/configure -v --with-pkgversion='Raspbian 4.9.0-6' --with-bugurl=file:///usr/share/doc/gcc-4.9/README.Bugs --enable-languages=c,c++,java,go,d,fortran,objc,obj-c++ --prefix=/usr --program-suffix=-4.9 --enable-shared --enable-linker-build-id --libexecdir=/usr/lib --without-included-gettext --enable-threads=posix --with-gxx-include-dir=/usr/include/c++/4.9 --libdir=/usr/lib --enable-nls --with-sysroot=/ --enable-clocale=gnu --enable-libstdcxx-debug --enable-libstdcxx-time=yes --enable-gnu-unique-object --disable-libmudflap --disable-libitm --disable-libquadmath --enable-plugin --with-system-zlib --disable-browser-plugin --enable-java-awt=gtk --enable-gtk-cairo --with-java-home=/usr/lib/jvm/java-1.5.0-gcj-4.9-armhf/jre --enable-java-home --with-jvm-root-dir=/usr/lib/jvm/java-1.5.0-gcj-4.9-armhf --with-jvm-jar-dir=/usr/lib/jvm-exports/java-1.5.0-gcj-4.9-armhf --with-arch-directory=arm --with-ecj-jar=/usr/share/java/eclipse-ecj.jar --enable-objc-gc --enable-multiarch --disable-sjlj-exceptions --with-arch=armv6 --with-fpu=vfp --with-float=hard --enable-checking=release --build=arm-linux-gnueabihf --host=arm-linux-gnueabihf --target=arm-linux-gnueabihf
  393. Thread model: posix
  394. gcc version 4.9.0 (Raspbian 4.9.0-6)
  395. configure:5853: $? = 0
  396. configure:5842: g++ -V >&5
  397. g++: error: unrecognized command line option '-V'
  398. g++: fatal error: no input files
  399. compilation terminated.
  400. configure:5853: $? = 4
  401. configure:5842: g++ -qversion >&5
  402. g++: error: unrecognized command line option '-qversion'
  403. g++: fatal error: no input files
  404. compilation terminated.
  405. configure:5853: $? = 4
  406. configure:5857: checking whether we are using the GNU Objective C++ compiler
  407. configure:5876: g++ -c   conftest.mm >&5
  408. g++: error trying to exec 'cc1objplus': execvp: No such file or directory
  409. configure:5876: $? = 1
  410. configure: failed program was:
  411. | /* confdefs.h */
  412. | #define PACKAGE_NAME "Bitcoin Core"
  413. | #define PACKAGE_TARNAME "bitcoin"
  414. | #define PACKAGE_VERSION "0.9.2"
  415. | #define PACKAGE_STRING "Bitcoin Core 0.9.2"
  416. | #define PACKAGE_BUGREPORT "[email protected]"
  417. | #define PACKAGE_URL ""
  418. | /* end confdefs.h.  */
  419. |
  420. | int
  421. | main ()
  422. | {
  423. | #ifndef __GNUC__
  424. |        choke me
  425. | #endif
  426. |
  427. |   ;
  428. |   return 0;
  429. | }
  430. configure:5885: result: no
  431. configure:5894: checking whether g++ accepts -g
  432. configure:5914: g++ -c -g  conftest.mm >&5
  433. g++: error trying to exec 'cc1objplus': execvp: No such file or directory
  434. configure:5914: $? = 1
  435. configure: failed program was:
  436. | /* confdefs.h */
  437. | #define PACKAGE_NAME "Bitcoin Core"
  438. | #define PACKAGE_TARNAME "bitcoin"
  439. | #define PACKAGE_VERSION "0.9.2"
  440. | #define PACKAGE_STRING "Bitcoin Core 0.9.2"
  441. | #define PACKAGE_BUGREPORT "[email protected]"
  442. | #define PACKAGE_URL ""
  443. | /* end confdefs.h.  */
  444. |
  445. | int
  446. | main ()
  447. | {
  448. |
  449. |   ;
  450. |   return 0;
  451. | }
  452. configure:5929: g++ -c   conftest.mm >&5
  453. g++: error trying to exec 'cc1objplus': execvp: No such file or directory
  454. configure:5929: $? = 1
  455. configure: failed program was:
  456. | /* confdefs.h */
  457. | #define PACKAGE_NAME "Bitcoin Core"
  458. | #define PACKAGE_TARNAME "bitcoin"
  459. | #define PACKAGE_VERSION "0.9.2"
  460. | #define PACKAGE_STRING "Bitcoin Core 0.9.2"
  461. | #define PACKAGE_BUGREPORT "[email protected]"
  462. | #define PACKAGE_URL ""
  463. | /* end confdefs.h.  */
  464. |
  465. | int
  466. | main ()
  467. | {
  468. |
  469. |   ;
  470. |   return 0;
  471. | }
  472. configure:5945: g++ -c -g  conftest.mm >&5
  473. g++: error trying to exec 'cc1objplus': execvp: No such file or directory
  474. configure:5945: $? = 1
  475. configure: failed program was:
  476. | /* confdefs.h */
  477. | #define PACKAGE_NAME "Bitcoin Core"
  478. | #define PACKAGE_TARNAME "bitcoin"
  479. | #define PACKAGE_VERSION "0.9.2"
  480. | #define PACKAGE_STRING "Bitcoin Core 0.9.2"
  481. | #define PACKAGE_BUGREPORT "[email protected]"
  482. | #define PACKAGE_URL ""
  483. | /* end confdefs.h.  */
  484. |
  485. | int
  486. | main ()
  487. | {
  488. |
  489. |   ;
  490. |   return 0;
  491. | }
  492. configure:5955: result: no
  493. configure:5980: checking dependency style of g++
  494. configure:6089: result: gcc3
  495. configure:6105: checking for a sed that does not truncate output
  496. configure:6169: result: /bin/sed
  497. configure:6220: checking for ar
  498. configure:6238: found /usr/bin/ar
  499. configure:6250: result: /usr/bin/ar
  500. configure:6318: checking for ranlib
  501. configure:6336: found /usr/bin/ranlib
  502. configure:6348: result: /usr/bin/ranlib
  503. configure:6416: checking for strip
  504. configure:6434: found /usr/bin/strip
  505. configure:6446: result: /usr/bin/strip
  506. configure:6514: checking for gcov
  507. configure:6532: found /usr/bin/gcov
  508. configure:6544: result: /usr/bin/gcov
  509. configure:6568: checking for lcov
  510. configure:6601: result: no
  511. configure:6608: checking for java
  512. configure:6626: found /usr/bin/java
  513. configure:6638: result: /usr/bin/java
  514. configure:6648: checking for genhtml
  515. configure:6681: result: no
  516. configure:6688: checking for git
  517. configure:6706: found /usr/bin/git
  518. configure:6718: result: /usr/bin/git
  519. configure:6728: checking for ccache
  520. configure:6761: result: no
  521. configure:6768: checking for xgettext
  522. configure:6786: found /usr/bin/xgettext
  523. configure:6798: result: /usr/bin/xgettext
  524. configure:6808: checking for hexdump
  525. configure:6826: found /usr/bin/hexdump
  526. configure:6838: result: /usr/bin/hexdump
  527. configure:6900: checking for pkg-config
  528. configure:6918: found /usr/bin/pkg-config
  529. configure:6930: result: /usr/bin/pkg-config
  530. configure:6955: checking pkg-config is at least version 0.9.0
  531. configure:6958: result: yes
  532. configure:8479: checking for grep that handles long lines and -e
  533. configure:8537: result: /bin/grep
  534. configure:8542: checking for egrep
  535. configure:8604: result: /bin/grep -E
  536. configure:8609: checking for ANSI C header files
  537. configure:8629: g++ -c -g -O2 -Wall -Wextra -Wformat -Wformat-security -Wno-unused-parameter  -DBOOST_SPIRIT_THREADSAFE -DHAVE_BUILD_INFO -D__STDC_FORMAT_MACROS conftest.cpp >&5
  538. configure:8629: $? = 0
  539. configure:8702: g++ -o conftest -g -O2 -Wall -Wextra -Wformat -Wformat-security -Wno-unused-parameter  -DBOOST_SPIRIT_THREADSAFE -DHAVE_BUILD_INFO -D__STDC_FORMAT_MACROS  conftest.cpp  >&5
  540. configure:8702: $? = 0
  541. configure:8702: ./conftest
  542. configure:8702: $? = 0
  543. configure:8713: result: yes
  544. configure:8726: checking for sys/types.h
  545. configure:8726: g++ -c -g -O2 -Wall -Wextra -Wformat -Wformat-security -Wno-unused-parameter  -DBOOST_SPIRIT_THREADSAFE -DHAVE_BUILD_INFO -D__STDC_FORMAT_MACROS conftest.cpp >&5
  546. configure:8726: $? = 0
  547. configure:8726: result: yes
  548. configure:8726: checking for sys/stat.h
  549. configure:8726: g++ -c -g -O2 -Wall -Wextra -Wformat -Wformat-security -Wno-unused-parameter  -DBOOST_SPIRIT_THREADSAFE -DHAVE_BUILD_INFO -D__STDC_FORMAT_MACROS conftest.cpp >&5
  550. configure:8726: $? = 0
  551. configure:8726: result: yes
  552. configure:8726: checking for stdlib.h
  553. configure:8726: g++ -c -g -O2 -Wall -Wextra -Wformat -Wformat-security -Wno-unused-parameter  -DBOOST_SPIRIT_THREADSAFE -DHAVE_BUILD_INFO -D__STDC_FORMAT_MACROS conftest.cpp >&5
  554. configure:8726: $? = 0
  555. configure:8726: result: yes
  556. configure:8726: checking for string.h
  557. configure:8726: g++ -c -g -O2 -Wall -Wextra -Wformat -Wformat-security -Wno-unused-parameter  -DBOOST_SPIRIT_THREADSAFE -DHAVE_BUILD_INFO -D__STDC_FORMAT_MACROS conftest.cpp >&5
  558. configure:8726: $? = 0
  559. configure:8726: result: yes
  560. configure:8726: checking for memory.h
  561. configure:8726: g++ -c -g -O2 -Wall -Wextra -Wformat -Wformat-security -Wno-unused-parameter  -DBOOST_SPIRIT_THREADSAFE -DHAVE_BUILD_INFO -D__STDC_FORMAT_MACROS conftest.cpp >&5
  562. configure:8726: $? = 0
  563. configure:8726: result: yes
  564. configure:8726: checking for strings.h
  565. configure:8726: g++ -c -g -O2 -Wall -Wextra -Wformat -Wformat-security -Wno-unused-parameter  -DBOOST_SPIRIT_THREADSAFE -DHAVE_BUILD_INFO -D__STDC_FORMAT_MACROS conftest.cpp >&5
  566. configure:8726: $? = 0
  567. configure:8726: result: yes
  568. configure:8726: checking for inttypes.h
  569. configure:8726: g++ -c -g -O2 -Wall -Wextra -Wformat -Wformat-security -Wno-unused-parameter  -DBOOST_SPIRIT_THREADSAFE -DHAVE_BUILD_INFO -D__STDC_FORMAT_MACROS conftest.cpp >&5
  570. configure:8726: $? = 0
  571. configure:8726: result: yes
  572. configure:8726: checking for stdint.h
  573. configure:8726: g++ -c -g -O2 -Wall -Wextra -Wformat -Wformat-security -Wno-unused-parameter  -DBOOST_SPIRIT_THREADSAFE -DHAVE_BUILD_INFO -D__STDC_FORMAT_MACROS conftest.cpp >&5
  574. configure:8726: $? = 0
  575. configure:8726: result: yes
  576. configure:8726: checking for unistd.h
  577. configure:8726: g++ -c -g -O2 -Wall -Wextra -Wformat -Wformat-security -Wno-unused-parameter  -DBOOST_SPIRIT_THREADSAFE -DHAVE_BUILD_INFO -D__STDC_FORMAT_MACROS conftest.cpp >&5
  578. configure:8726: $? = 0
  579. configure:8726: result: yes
  580. configure:8738: checking whether byte ordering is bigendian
  581. configure:8753: g++ -c -g -O2 -Wall -Wextra -Wformat -Wformat-security -Wno-unused-parameter  -DBOOST_SPIRIT_THREADSAFE -DHAVE_BUILD_INFO -D__STDC_FORMAT_MACROS conftest.cpp >&5
  582. conftest.cpp:20:9: error: expected unqualified-id before 'not' token
  583.          not a universal capable compiler
  584.          ^
  585. configure:8753: $? = 1
  586. configure: failed program was:
  587. | /* confdefs.h */
  588. | #define PACKAGE_NAME "Bitcoin Core"
  589. | #define PACKAGE_TARNAME "bitcoin"
  590. | #define PACKAGE_VERSION "0.9.2"
  591. | #define PACKAGE_STRING "Bitcoin Core 0.9.2"
  592. | #define PACKAGE_BUGREPORT "[email protected]"
  593. | #define PACKAGE_URL ""
  594. | #define STDC_HEADERS 1
  595. | #define HAVE_SYS_TYPES_H 1
  596. | #define HAVE_SYS_STAT_H 1
  597. | #define HAVE_STDLIB_H 1
  598. | #define HAVE_STRING_H 1
  599. | #define HAVE_MEMORY_H 1
  600. | #define HAVE_STRINGS_H 1
  601. | #define HAVE_INTTYPES_H 1
  602. | #define HAVE_STDINT_H 1
  603. | #define HAVE_UNISTD_H 1
  604. | /* end confdefs.h.  */
  605. | #ifndef __APPLE_CC__
  606. |          not a universal capable compiler
  607. |        #endif
  608. |        typedef int dummy;
  609. |
  610. configure:8798: g++ -c -g -O2 -Wall -Wextra -Wformat -Wformat-security -Wno-unused-parameter  -DBOOST_SPIRIT_THREADSAFE -DHAVE_BUILD_INFO -D__STDC_FORMAT_MACROS conftest.cpp >&5
  611. configure:8798: $? = 0
  612. configure:8816: g++ -c -g -O2 -Wall -Wextra -Wformat -Wformat-security -Wno-unused-parameter  -DBOOST_SPIRIT_THREADSAFE -DHAVE_BUILD_INFO -D__STDC_FORMAT_MACROS conftest.cpp >&5
  613. conftest.cpp: In function 'int main()':
  614. conftest.cpp:26:8: error: 'big' was not declared in this scope
  615.     not big endian
  616.         ^
  617. configure:8816: $? = 1
  618. configure: failed program was:
  619. | /* confdefs.h */
  620. | #define PACKAGE_NAME "Bitcoin Core"
  621. | #define PACKAGE_TARNAME "bitcoin"
  622. | #define PACKAGE_VERSION "0.9.2"
  623. | #define PACKAGE_STRING "Bitcoin Core 0.9.2"
  624. | #define PACKAGE_BUGREPORT "[email protected]"
  625. | #define PACKAGE_URL ""
  626. | #define STDC_HEADERS 1
  627. | #define HAVE_SYS_TYPES_H 1
  628. | #define HAVE_SYS_STAT_H 1
  629. | #define HAVE_STDLIB_H 1
  630. | #define HAVE_STRING_H 1
  631. | #define HAVE_MEMORY_H 1
  632. | #define HAVE_STRINGS_H 1
  633. | #define HAVE_INTTYPES_H 1
  634. | #define HAVE_STDINT_H 1
  635. | #define HAVE_UNISTD_H 1
  636. | /* end confdefs.h.  */
  637. | #include <sys/types.h>
  638. |       #include <sys/param.h>
  639. |
  640. | int
  641. | main ()
  642. | {
  643. | #if BYTE_ORDER != BIG_ENDIAN
  644. |        not big endian
  645. |       #endif
  646. |
  647. |   ;
  648. |   return 0;
  649. | }
  650. configure:8944: result: no
  651. configure:9075: checking if compiler needs -Werror to reject unknown flags
  652. configure:9091: gcc -c -g -O2 -Werror -Wunknown-warning-option -Wsizeof-array-argument  -DBOOST_SPIRIT_THREADSAFE -DHAVE_BUILD_INFO -D__STDC_FORMAT_MACROS conftest.c >&5
  653. gcc: error: unrecognized command line option '-Wunknown-warning-option'
  654. gcc: error: unrecognized command line option '-Wsizeof-array-argument'
  655. configure:9091: $? = 1
  656. configure: failed program was:
  657. | /* confdefs.h */
  658. | #define PACKAGE_NAME "Bitcoin Core"
  659. | #define PACKAGE_TARNAME "bitcoin"
  660. | #define PACKAGE_VERSION "0.9.2"
  661. | #define PACKAGE_STRING "Bitcoin Core 0.9.2"
  662. | #define PACKAGE_BUGREPORT "[email protected]"
  663. | #define PACKAGE_URL ""
  664. | #define STDC_HEADERS 1
  665. | #define HAVE_SYS_TYPES_H 1
  666. | #define HAVE_SYS_STAT_H 1
  667. | #define HAVE_STDLIB_H 1
  668. | #define HAVE_STRING_H 1
  669. | #define HAVE_MEMORY_H 1
  670. | #define HAVE_STRINGS_H 1
  671. | #define HAVE_INTTYPES_H 1
  672. | #define HAVE_STDINT_H 1
  673. | #define HAVE_UNISTD_H 1
  674. | /* end confdefs.h.  */
  675. | int foo(void);
  676. | int
  677. | main ()
  678. | {
  679. | foo()
  680. |   ;
  681. |   return 0;
  682. | }
  683. configure:9096: result: no
  684. configure:9162: checking for the pthreads library -lpthreads
  685. configure:9200: gcc -o conftest -g -O2    -DBOOST_SPIRIT_THREADSAFE -DHAVE_BUILD_INFO -D__STDC_FORMAT_MACROS  conftest.c -lpthreads  >&5
  686. /usr/bin/ld: cannot find -lpthreads
  687. collect2: error: ld returned 1 exit status
  688. configure:9200: $? = 1
  689. configure: failed program was:
  690. | /* confdefs.h */
  691. | #define PACKAGE_NAME "Bitcoin Core"
  692. | #define PACKAGE_TARNAME "bitcoin"
  693. | #define PACKAGE_VERSION "0.9.2"
  694. | #define PACKAGE_STRING "Bitcoin Core 0.9.2"
  695. | #define PACKAGE_BUGREPORT "[email protected]"
  696. | #define PACKAGE_URL ""
  697. | #define STDC_HEADERS 1
  698. | #define HAVE_SYS_TYPES_H 1
  699. | #define HAVE_SYS_STAT_H 1
  700. | #define HAVE_STDLIB_H 1
  701. | #define HAVE_STRING_H 1
  702. | #define HAVE_MEMORY_H 1
  703. | #define HAVE_STRINGS_H 1
  704. | #define HAVE_INTTYPES_H 1
  705. | #define HAVE_STDINT_H 1
  706. | #define HAVE_UNISTD_H 1
  707. | /* end confdefs.h.  */
  708. | #include <pthread.h>
  709. |                         static void routine(void *a) { a = 0; }
  710. |                         static void *start_routine(void *a) { return a; }
  711. | int
  712. | main ()
  713. | {
  714. | pthread_t th; pthread_attr_t attr;
  715. |                         pthread_create(&th, 0, start_routine, 0);
  716. |                         pthread_join(th, 0);
  717. |                         pthread_attr_init(&attr);
  718. |                         pthread_cleanup_push(routine, 0);
  719. |                         pthread_cleanup_pop(0) /* ; */
  720. |   ;
  721. |   return 0;
  722. | }
  723. configure:9209: result: no
  724. configure:9107: checking whether pthreads work without any flags
  725. configure:9200: gcc -o conftest -g -O2    -DBOOST_SPIRIT_THREADSAFE -DHAVE_BUILD_INFO -D__STDC_FORMAT_MACROS  conftest.c   >&5
  726. /tmp/ccjO7hHw.o: In function `main':
  727. /home/pi/bitcoin/conftest.c:26: undefined reference to `pthread_create'
  728. /home/pi/bitcoin/conftest.c:27: undefined reference to `pthread_join'
  729. /home/pi/bitcoin/conftest.c:29: undefined reference to `__pthread_register_cancel'
  730. /home/pi/bitcoin/conftest.c:30: undefined reference to `__pthread_unregister_cancel'
  731. collect2: error: ld returned 1 exit status
  732. configure:9200: $? = 1
  733. configure: failed program was:
  734. | /* confdefs.h */
  735. | #define PACKAGE_NAME "Bitcoin Core"
  736. | #define PACKAGE_TARNAME "bitcoin"
  737. | #define PACKAGE_VERSION "0.9.2"
  738. | #define PACKAGE_STRING "Bitcoin Core 0.9.2"
  739. | #define PACKAGE_BUGREPORT "[email protected]"
  740. | #define PACKAGE_URL ""
  741. | #define STDC_HEADERS 1
  742. | #define HAVE_SYS_TYPES_H 1
  743. | #define HAVE_SYS_STAT_H 1
  744. | #define HAVE_STDLIB_H 1
  745. | #define HAVE_STRING_H 1
  746. | #define HAVE_MEMORY_H 1
  747. | #define HAVE_STRINGS_H 1
  748. | #define HAVE_INTTYPES_H 1
  749. | #define HAVE_STDINT_H 1
  750. | #define HAVE_UNISTD_H 1
  751. | /* end confdefs.h.  */
  752. | #include <pthread.h>
  753. |                         static void routine(void *a) { a = 0; }
  754. |                         static void *start_routine(void *a) { return a; }
  755. | int
  756. | main ()
  757. | {
  758. | pthread_t th; pthread_attr_t attr;
  759. |                         pthread_create(&th, 0, start_routine, 0);
  760. |                         pthread_join(th, 0);
  761. |                         pthread_attr_init(&attr);
  762. |                         pthread_cleanup_push(routine, 0);
  763. |                         pthread_cleanup_pop(0) /* ; */
  764. |   ;
  765. |   return 0;
  766. | }
  767. configure:9209: result: no
  768. configure:9112: checking whether pthreads work with -Kthread
  769. configure:9200: gcc -o conftest -g -O2 -Kthread   -DBOOST_SPIRIT_THREADSAFE -DHAVE_BUILD_INFO -D__STDC_FORMAT_MACROS  conftest.c   >&5
  770. gcc: error: unrecognized command line option '-Kthread'
  771. configure:9200: $? = 1
  772. configure: failed program was:
  773. | /* confdefs.h */
  774. | #define PACKAGE_NAME "Bitcoin Core"
  775. | #define PACKAGE_TARNAME "bitcoin"
  776. | #define PACKAGE_VERSION "0.9.2"
  777. | #define PACKAGE_STRING "Bitcoin Core 0.9.2"
  778. | #define PACKAGE_BUGREPORT "[email protected]"
  779. | #define PACKAGE_URL ""
  780. | #define STDC_HEADERS 1
  781. | #define HAVE_SYS_TYPES_H 1
  782. | #define HAVE_SYS_STAT_H 1
  783. | #define HAVE_STDLIB_H 1
  784. | #define HAVE_STRING_H 1
  785. | #define HAVE_MEMORY_H 1
  786. | #define HAVE_STRINGS_H 1
  787. | #define HAVE_INTTYPES_H 1
  788. | #define HAVE_STDINT_H 1
  789. | #define HAVE_UNISTD_H 1
  790. | /* end confdefs.h.  */
  791. | #include <pthread.h>
  792. |                         static void routine(void *a) { a = 0; }
  793. |                         static void *start_routine(void *a) { return a; }
  794. | int
  795. | main ()
  796. | {
  797. | pthread_t th; pthread_attr_t attr;
  798. |                         pthread_create(&th, 0, start_routine, 0);
  799. |                         pthread_join(th, 0);
  800. |                         pthread_attr_init(&attr);
  801. |                         pthread_cleanup_push(routine, 0);
  802. |                         pthread_cleanup_pop(0) /* ; */
  803. |   ;
  804. |   return 0;
  805. | }
  806. configure:9209: result: no
  807. configure:9112: checking whether pthreads work with -kthread
  808. configure:9200: gcc -o conftest -g -O2 -kthread   -DBOOST_SPIRIT_THREADSAFE -DHAVE_BUILD_INFO -D__STDC_FORMAT_MACROS  conftest.c   >&5
  809. gcc: error: unrecognized command line option '-kthread'
  810. configure:9200: $? = 1
  811. configure: failed program was:
  812. | /* confdefs.h */
  813. | #define PACKAGE_NAME "Bitcoin Core"
  814. | #define PACKAGE_TARNAME "bitcoin"
  815. | #define PACKAGE_VERSION "0.9.2"
  816. | #define PACKAGE_STRING "Bitcoin Core 0.9.2"
  817. | #define PACKAGE_BUGREPORT "[email protected]"
  818. | #define PACKAGE_URL ""
  819. | #define STDC_HEADERS 1
  820. | #define HAVE_SYS_TYPES_H 1
  821. | #define HAVE_SYS_STAT_H 1
  822. | #define HAVE_STDLIB_H 1
  823. | #define HAVE_STRING_H 1
  824. | #define HAVE_MEMORY_H 1
  825. | #define HAVE_STRINGS_H 1
  826. | #define HAVE_INTTYPES_H 1
  827. | #define HAVE_STDINT_H 1
  828. | #define HAVE_UNISTD_H 1
  829. | /* end confdefs.h.  */
  830. | #include <pthread.h>
  831. |                         static void routine(void *a) { a = 0; }
  832. |                         static void *start_routine(void *a) { return a; }
  833. | int
  834. | main ()
  835. | {
  836. | pthread_t th; pthread_attr_t attr;
  837. |                         pthread_create(&th, 0, start_routine, 0);
  838. |                         pthread_join(th, 0);
  839. |                         pthread_attr_init(&attr);
  840. |                         pthread_cleanup_push(routine, 0);
  841. |                         pthread_cleanup_pop(0) /* ; */
  842. |   ;
  843. |   return 0;
  844. | }
  845. configure:9209: result: no
  846. configure:9162: checking for the pthreads library -llthread
  847. configure:9200: gcc -o conftest -g -O2    -DBOOST_SPIRIT_THREADSAFE -DHAVE_BUILD_INFO -D__STDC_FORMAT_MACROS  conftest.c -llthread  >&5
  848. /usr/bin/ld: cannot find -llthread
  849. collect2: error: ld returned 1 exit status
  850. configure:9200: $? = 1
  851. configure: failed program was:
  852. | /* confdefs.h */
  853. | #define PACKAGE_NAME "Bitcoin Core"
  854. | #define PACKAGE_TARNAME "bitcoin"
  855. | #define PACKAGE_VERSION "0.9.2"
  856. | #define PACKAGE_STRING "Bitcoin Core 0.9.2"
  857. | #define PACKAGE_BUGREPORT "[email protected]"
  858. | #define PACKAGE_URL ""
  859. | #define STDC_HEADERS 1
  860. | #define HAVE_SYS_TYPES_H 1
  861. | #define HAVE_SYS_STAT_H 1
  862. | #define HAVE_STDLIB_H 1
  863. | #define HAVE_STRING_H 1
  864. | #define HAVE_MEMORY_H 1
  865. | #define HAVE_STRINGS_H 1
  866. | #define HAVE_INTTYPES_H 1
  867. | #define HAVE_STDINT_H 1
  868. | #define HAVE_UNISTD_H 1
  869. | /* end confdefs.h.  */
  870. | #include <pthread.h>
  871. |                         static void routine(void *a) { a = 0; }
  872. |                         static void *start_routine(void *a) { return a; }
  873. | int
  874. | main ()
  875. | {
  876. | pthread_t th; pthread_attr_t attr;
  877. |                         pthread_create(&th, 0, start_routine, 0);
  878. |                         pthread_join(th, 0);
  879. |                         pthread_attr_init(&attr);
  880. |                         pthread_cleanup_push(routine, 0);
  881. |                         pthread_cleanup_pop(0) /* ; */
  882. |   ;
  883. |   return 0;
  884. | }
  885. configure:9209: result: no
  886. configure:9112: checking whether pthreads work with -pthread
  887. configure:9200: gcc -o conftest -g -O2 -pthread   -DBOOST_SPIRIT_THREADSAFE -DHAVE_BUILD_INFO -D__STDC_FORMAT_MACROS  conftest.c   >&5
  888. configure:9200: $? = 0
  889. configure:9209: result: yes
  890. configure:9228: checking for joinable pthread attribute
  891. configure:9243: gcc -o conftest -g -O2 -pthread  -DBOOST_SPIRIT_THREADSAFE -DHAVE_BUILD_INFO -D__STDC_FORMAT_MACROS  conftest.c   >&5
  892. configure:9243: $? = 0
  893. configure:9249: result: PTHREAD_CREATE_JOINABLE
  894. configure:9259: checking if more special flags are required for pthreads
  895. configure:9274: result: no
  896. configure:9280: checking for PTHREAD_PRIO_INHERIT
  897. configure:9297: gcc -o conftest -g -O2 -pthread  -DBOOST_SPIRIT_THREADSAFE -DHAVE_BUILD_INFO -D__STDC_FORMAT_MACROS  conftest.c   >&5
  898. configure:9297: $? = 0
  899. configure:9306: result: yes
  900. configure:9417: checking for special C compiler options needed for large files
  901. configure:9462: result: no
  902. configure:9468: checking for _FILE_OFFSET_BITS value needed for large files
  903. configure:9493: g++ -c -g -O2 -Wall -Wextra -Wformat -Wformat-security -Wno-unused-parameter  -DBOOST_SPIRIT_THREADSAFE -DHAVE_BUILD_INFO -D__STDC_FORMAT_MACROS conftest.cpp >&5
  904. conftest.cpp:29:17: error: size of array 'off_t_is_large' is negative
  905.         ? 1 : -1];
  906.                 ^
  907. configure:9493: $? = 1
  908. configure: failed program was:
  909. | /* confdefs.h */
  910. | #define PACKAGE_NAME "Bitcoin Core"
  911. | #define PACKAGE_TARNAME "bitcoin"
  912. | #define PACKAGE_VERSION "0.9.2"
  913. | #define PACKAGE_STRING "Bitcoin Core 0.9.2"
  914. | #define PACKAGE_BUGREPORT "[email protected]"
  915. | #define PACKAGE_URL ""
  916. | #define STDC_HEADERS 1
  917. | #define HAVE_SYS_TYPES_H 1
  918. | #define HAVE_SYS_STAT_H 1
  919. | #define HAVE_STDLIB_H 1
  920. | #define HAVE_STRING_H 1
  921. | #define HAVE_MEMORY_H 1
  922. | #define HAVE_STRINGS_H 1
  923. | #define HAVE_INTTYPES_H 1
  924. | #define HAVE_STDINT_H 1
  925. | #define HAVE_UNISTD_H 1
  926. | #define HAVE_PTHREAD_PRIO_INHERIT 1
  927. | #define HAVE_PTHREAD 1
  928. | /* end confdefs.h.  */
  929. | #include <sys/types.h>
  930. |  /* Check that off_t can represent 2**63 - 1 correctly.
  931. |     We can't simply define LARGE_OFF_T to be 9223372036854775807,
  932. |     since some C++ compilers masquerading as C compilers
  933. |     incorrectly reject 9223372036854775807.  */
  934. | #define LARGE_OFF_T ((((off_t) 1 << 31) << 31) - 1 + (((off_t) 1 << 31) << 31))
  935. |   int off_t_is_large[(LARGE_OFF_T % 2147483629 == 721
  936. |              && LARGE_OFF_T % 2147483647 == 1)
  937. |             ? 1 : -1];
  938. | int
  939. | main ()
  940. | {
  941. |
  942. |   ;
  943. |   return 0;
  944. | }
  945. configure:9517: g++ -c -g -O2 -Wall -Wextra -Wformat -Wformat-security -Wno-unused-parameter  -DBOOST_SPIRIT_THREADSAFE -DHAVE_BUILD_INFO -D__STDC_FORMAT_MACROS conftest.cpp >&5
  946. configure:9517: $? = 0
  947. configure:9525: result: 64
  948. configure:9611: checking whether strerror_r is declared
  949. configure:9611: g++ -c -g -O2 -Wall -Wextra -Wformat -Wformat-security -Wno-unused-parameter  -DBOOST_SPIRIT_THREADSAFE -DHAVE_BUILD_INFO -D__STDC_FORMAT_MACROS conftest.cpp >&5
  950. configure:9611: $? = 0
  951. configure:9611: result: yes
  952. configure:9624: checking for strerror_r
  953. configure:9624: g++ -o conftest -g -O2 -Wall -Wextra -Wformat -Wformat-security -Wno-unused-parameter  -DBOOST_SPIRIT_THREADSAFE -DHAVE_BUILD_INFO -D__STDC_FORMAT_MACROS  conftest.cpp  >&5
  954. configure:9624: $? = 0
  955. configure:9624: result: yes
  956. configure:9633: checking whether strerror_r returns char *
  957. configure:9657: g++ -c -g -O2 -Wall -Wextra -Wformat -Wformat-security -Wno-unused-parameter  -DBOOST_SPIRIT_THREADSAFE -DHAVE_BUILD_INFO -D__STDC_FORMAT_MACROS conftest.cpp >&5
  958. configure:9657: $? = 0
  959. configure:9695: result: yes
  960. configure:9716: checking whether the linker accepts -Wl,--large-address-aware
  961. configure:9735: g++ -o conftest -g -O2 -Wall -Wextra -Wformat -Wformat-security -Wno-unused-parameter  -DBOOST_SPIRIT_THREADSAFE -DHAVE_BUILD_INFO -D__STDC_FORMAT_MACROS -D_FILE_OFFSET_BITS=64   -Wl,--large-address-aware conftest.cpp  >&5
  962. /usr/bin/ld: unrecognized option '--large-address-aware'
  963. /usr/bin/ld: use the --help option for usage information
  964. collect2: error: ld returned 1 exit status
  965. configure:9735: $? = 1
  966. configure: failed program was:
  967. | /* confdefs.h */
  968. | #define PACKAGE_NAME "Bitcoin Core"
  969. | #define PACKAGE_TARNAME "bitcoin"
  970. | #define PACKAGE_VERSION "0.9.2"
  971. | #define PACKAGE_STRING "Bitcoin Core 0.9.2"
  972. | #define PACKAGE_BUGREPORT "[email protected]"
  973. | #define PACKAGE_URL ""
  974. | #define STDC_HEADERS 1
  975. | #define HAVE_SYS_TYPES_H 1
  976. | #define HAVE_SYS_STAT_H 1
  977. | #define HAVE_STDLIB_H 1
  978. | #define HAVE_STRING_H 1
  979. | #define HAVE_MEMORY_H 1
  980. | #define HAVE_STRINGS_H 1
  981. | #define HAVE_INTTYPES_H 1
  982. | #define HAVE_STDINT_H 1
  983. | #define HAVE_UNISTD_H 1
  984. | #define HAVE_PTHREAD_PRIO_INHERIT 1
  985. | #define HAVE_PTHREAD 1
  986. | #define _FILE_OFFSET_BITS 64
  987. | #define HAVE_DECL_STRERROR_R 1
  988. | #define HAVE_STRERROR_R 1
  989. | #define STRERROR_R_CHAR_P 1
  990. | /* end confdefs.h.  */
  991. |
  992. | int
  993. | main ()
  994. | {
  995. |
  996. |   ;
  997. |   return 0;
  998. | }
  999. configure:9744: result: no
  1000. configure:9789: checking whether C++ compiler accepts -Wstack-protector
  1001. configure:9808: g++ -c -g -O2 -Wall -Wextra -Wformat -Wformat-security -Wno-unused-parameter  -Wstack-protector  -DBOOST_SPIRIT_THREADSAFE -DHAVE_BUILD_INFO -D__STDC_FORMAT_MACROS -D_FILE_OFFSET_BITS=64 conftest.cpp >&5
  1002. configure:9808: $? = 0
  1003. configure:9816: result: yes
  1004. configure:9824: checking whether C++ compiler accepts -fstack-protector-all
  1005. configure:9843: g++ -c -g -O2 -Wall -Wextra -Wformat -Wformat-security -Wno-unused-parameter  -fstack-protector-all  -DBOOST_SPIRIT_THREADSAFE -DHAVE_BUILD_INFO -D__STDC_FORMAT_MACROS -D_FILE_OFFSET_BITS=64 conftest.cpp >&5
  1006. configure:9843: $? = 0
  1007. configure:9851: result: yes
  1008. configure:9859: checking whether C++ compiler accepts -fPIE
  1009. configure:9878: g++ -c -g -O2 -Wall -Wextra -Wformat -Wformat-security -Wno-unused-parameter  -fPIE  -DBOOST_SPIRIT_THREADSAFE -DHAVE_BUILD_INFO -D__STDC_FORMAT_MACROS -D_FILE_OFFSET_BITS=64 conftest.cpp >&5
  1010. configure:9878: $? = 0
  1011. configure:9886: result: yes
  1012. configure:9895: checking whether C++ preprocessor accepts -D_FORTIFY_SOURCE=2
  1013. configure:9914: g++ -E  -DBOOST_SPIRIT_THREADSAFE -DHAVE_BUILD_INFO -D__STDC_FORMAT_MACROS -D_FILE_OFFSET_BITS=64  -D_FORTIFY_SOURCE=2 conftest.cpp
  1014. configure:9914: $? = 0
  1015. configure:9922: result: yes
  1016. configure:9926: checking whether C++ preprocessor accepts -U_FORTIFY_SOURCE
  1017. configure:9945: g++ -E  -DBOOST_SPIRIT_THREADSAFE -DHAVE_BUILD_INFO -D__STDC_FORMAT_MACROS -D_FILE_OFFSET_BITS=64  -U_FORTIFY_SOURCE conftest.cpp
  1018. configure:9945: $? = 0
  1019. configure:9953: result: yes
  1020. configure:9970: checking whether the linker accepts -Wl,--dynamicbase
  1021. configure:9989: g++ -o conftest -g -O2 -Wall -Wextra -Wformat -Wformat-security -Wno-unused-parameter  -DBOOST_SPIRIT_THREADSAFE -DHAVE_BUILD_INFO -D__STDC_FORMAT_MACROS -D_FILE_OFFSET_BITS=64   -Wl,--dynamicbase conftest.cpp  >&5
  1022. /usr/bin/ld: unrecognized option '--dynamicbase'
  1023. /usr/bin/ld: use the --help option for usage information
  1024. collect2: error: ld returned 1 exit status
  1025. configure:9989: $? = 1
  1026. configure: failed program was:
  1027. | /* confdefs.h */
  1028. | #define PACKAGE_NAME "Bitcoin Core"
  1029. | #define PACKAGE_TARNAME "bitcoin"
  1030. | #define PACKAGE_VERSION "0.9.2"
  1031. | #define PACKAGE_STRING "Bitcoin Core 0.9.2"
  1032. | #define PACKAGE_BUGREPORT "[email protected]"
  1033. | #define PACKAGE_URL ""
  1034. | #define STDC_HEADERS 1
  1035. | #define HAVE_SYS_TYPES_H 1
  1036. | #define HAVE_SYS_STAT_H 1
  1037. | #define HAVE_STDLIB_H 1
  1038. | #define HAVE_STRING_H 1
  1039. | #define HAVE_MEMORY_H 1
  1040. | #define HAVE_STRINGS_H 1
  1041. | #define HAVE_INTTYPES_H 1
  1042. | #define HAVE_STDINT_H 1
  1043. | #define HAVE_UNISTD_H 1
  1044. | #define HAVE_PTHREAD_PRIO_INHERIT 1
  1045. | #define HAVE_PTHREAD 1
  1046. | #define _FILE_OFFSET_BITS 64
  1047. | #define HAVE_DECL_STRERROR_R 1
  1048. | #define HAVE_STRERROR_R 1
  1049. | #define STRERROR_R_CHAR_P 1
  1050. | /* end confdefs.h.  */
  1051. |
  1052. | int
  1053. | main ()
  1054. | {
  1055. |
  1056. |   ;
  1057. |   return 0;
  1058. | }
  1059. configure:9998: result: no
  1060. configure:10006: checking whether the linker accepts -Wl,--nxcompat
  1061. configure:10025: g++ -o conftest -g -O2 -Wall -Wextra -Wformat -Wformat-security -Wno-unused-parameter  -DBOOST_SPIRIT_THREADSAFE -DHAVE_BUILD_INFO -D__STDC_FORMAT_MACROS -D_FILE_OFFSET_BITS=64   -Wl,--nxcompat conftest.cpp  >&5
  1062. /usr/bin/ld: unrecognized option '--nxcompat'
  1063. /usr/bin/ld: use the --help option for usage information
  1064. collect2: error: ld returned 1 exit status
  1065. configure:10025: $? = 1
  1066. configure: failed program was:
  1067. | /* confdefs.h */
  1068. | #define PACKAGE_NAME "Bitcoin Core"
  1069. | #define PACKAGE_TARNAME "bitcoin"
  1070. | #define PACKAGE_VERSION "0.9.2"
  1071. | #define PACKAGE_STRING "Bitcoin Core 0.9.2"
  1072. | #define PACKAGE_BUGREPORT "[email protected]"
  1073. | #define PACKAGE_URL ""
  1074. | #define STDC_HEADERS 1
  1075. | #define HAVE_SYS_TYPES_H 1
  1076. | #define HAVE_SYS_STAT_H 1
  1077. | #define HAVE_STDLIB_H 1
  1078. | #define HAVE_STRING_H 1
  1079. | #define HAVE_MEMORY_H 1
  1080. | #define HAVE_STRINGS_H 1
  1081. | #define HAVE_INTTYPES_H 1
  1082. | #define HAVE_STDINT_H 1
  1083. | #define HAVE_UNISTD_H 1
  1084. | #define HAVE_PTHREAD_PRIO_INHERIT 1
  1085. | #define HAVE_PTHREAD 1
  1086. | #define _FILE_OFFSET_BITS 64
  1087. | #define HAVE_DECL_STRERROR_R 1
  1088. | #define HAVE_STRERROR_R 1
  1089. | #define STRERROR_R_CHAR_P 1
  1090. | /* end confdefs.h.  */
  1091. |
  1092. | int
  1093. | main ()
  1094. | {
  1095. |
  1096. |   ;
  1097. |   return 0;
  1098. | }
  1099. configure:10034: result: no
  1100. configure:10042: checking whether the linker accepts -Wl,-z,relro
  1101. configure:10061: g++ -o conftest -g -O2 -Wall -Wextra -Wformat -Wformat-security -Wno-unused-parameter  -DBOOST_SPIRIT_THREADSAFE -DHAVE_BUILD_INFO -D__STDC_FORMAT_MACROS -D_FILE_OFFSET_BITS=64   -Wl,-z,relro conftest.cpp  >&5
  1102. configure:10061: $? = 0
  1103. configure:10070: result: yes
  1104. configure:10078: checking whether the linker accepts -Wl,-z,now
  1105. configure:10097: g++ -o conftest -g -O2 -Wall -Wextra -Wformat -Wformat-security -Wno-unused-parameter  -DBOOST_SPIRIT_THREADSAFE -DHAVE_BUILD_INFO -D__STDC_FORMAT_MACROS -D_FILE_OFFSET_BITS=64   -Wl,-z,now conftest.cpp  >&5
  1106. configure:10097: $? = 0
  1107. configure:10106: result: yes
  1108. configure:10117: checking whether the linker accepts -pie
  1109. configure:10136: g++ -o conftest -g -O2 -Wall -Wextra -Wformat -Wformat-security -Wno-unused-parameter  -DBOOST_SPIRIT_THREADSAFE -DHAVE_BUILD_INFO -D__STDC_FORMAT_MACROS -D_FILE_OFFSET_BITS=64   -pie conftest.cpp  >&5
  1110. configure:10136: $? = 0
  1111. configure:10145: result: yes
  1112. configure:10203: checking stdio.h usability
  1113. configure:10203: g++ -c -g -O2 -Wall -Wextra -Wformat -Wformat-security -Wno-unused-parameter  -Wstack-protector -fstack-protector-all -fPIE  -DBOOST_SPIRIT_THREADSAFE -DHAVE_BUILD_INFO -D__STDC_FORMAT_MACROS -D_FILE_OFFSET_BITS=64  -U_FORTIFY_SOURCE -D_FORTIFY_SOURCE=2 conftest.cpp >&5
  1114. configure:10203: $? = 0
  1115. configure:10203: result: yes
  1116. configure:10203: checking stdio.h presence
  1117. configure:10203: g++ -E  -DBOOST_SPIRIT_THREADSAFE -DHAVE_BUILD_INFO -D__STDC_FORMAT_MACROS -D_FILE_OFFSET_BITS=64  -U_FORTIFY_SOURCE -D_FORTIFY_SOURCE=2 conftest.cpp
  1118. configure:10203: $? = 0
  1119. configure:10203: result: yes
  1120. configure:10203: checking for stdio.h
  1121. configure:10203: result: yes
  1122. configure:10203: checking for stdlib.h
  1123. configure:10203: result: yes
  1124. configure:10203: checking for unistd.h
  1125. configure:10203: result: yes
  1126. configure:10203: checking for strings.h
  1127. configure:10203: result: yes
  1128. configure:10203: checking for sys/types.h
  1129. configure:10203: result: yes
  1130. configure:10203: checking for sys/stat.h
  1131. configure:10203: result: yes
  1132. configure:10214: checking for MSG_NOSIGNAL
  1133. configure:10227: g++ -c -g -O2 -Wall -Wextra -Wformat -Wformat-security -Wno-unused-parameter  -Wstack-protector -fstack-protector-all -fPIE  -DBOOST_SPIRIT_THREADSAFE -DHAVE_BUILD_INFO -D__STDC_FORMAT_MACROS -D_FILE_OFFSET_BITS=64  -U_FORTIFY_SOURCE -D_FORTIFY_SOURCE=2 conftest.cpp >&5
  1134. conftest.cpp: In function 'int main()':
  1135. conftest.cpp:35:6: warning: unused variable 'f' [-Wunused-variable]
  1136.   int f = MSG_NOSIGNAL;
  1137.       ^
  1138. configure:10227: $? = 0
  1139. configure:10228: result: yes
  1140. configure:10428: checking miniupnpc/miniwget.h usability
  1141. configure:10428: g++ -c -g -O2 -Wall -Wextra -Wformat -Wformat-security -Wno-unused-parameter  -Wstack-protector -fstack-protector-all -fPIE  -DBOOST_SPIRIT_THREADSAFE -DHAVE_BUILD_INFO -D__STDC_FORMAT_MACROS -D_FILE_OFFSET_BITS=64  -U_FORTIFY_SOURCE -D_FORTIFY_SOURCE=2 conftest.cpp >&5
  1142. configure:10428: $? = 0
  1143. configure:10428: result: yes
  1144. configure:10428: checking miniupnpc/miniwget.h presence
  1145. configure:10428: g++ -E  -DBOOST_SPIRIT_THREADSAFE -DHAVE_BUILD_INFO -D__STDC_FORMAT_MACROS -D_FILE_OFFSET_BITS=64  -U_FORTIFY_SOURCE -D_FORTIFY_SOURCE=2 conftest.cpp
  1146. configure:10428: $? = 0
  1147. configure:10428: result: yes
  1148. configure:10428: checking for miniupnpc/miniwget.h
  1149. configure:10428: result: yes
  1150. configure:10433: checking for main in -lminiupnpc
  1151. configure:10452: g++ -o conftest -g -O2 -Wall -Wextra -Wformat -Wformat-security -Wno-unused-parameter  -Wstack-protector -fstack-protector-all -fPIE  -DBOOST_SPIRIT_THREADSAFE -DHAVE_BUILD_INFO -D__STDC_FORMAT_MACROS -D_FILE_OFFSET_BITS=64  -U_FORTIFY_SOURCE -D_FORTIFY_SOURCE=2   -Wl,-z,relro -Wl,-z,now -pie conftest.cpp -lminiupnpc   >&5
  1152. configure:10452: $? = 0
  1153. configure:10461: result: yes
  1154. configure:10428: checking miniupnpc/miniupnpc.h usability
  1155. configure:10428: g++ -c -g -O2 -Wall -Wextra -Wformat -Wformat-security -Wno-unused-parameter  -Wstack-protector -fstack-protector-all -fPIE  -DBOOST_SPIRIT_THREADSAFE -DHAVE_BUILD_INFO -D__STDC_FORMAT_MACROS -D_FILE_OFFSET_BITS=64  -U_FORTIFY_SOURCE -D_FORTIFY_SOURCE=2 conftest.cpp >&5
  1156. configure:10428: $? = 0
  1157. configure:10428: result: yes
  1158. configure:10428: checking miniupnpc/miniupnpc.h presence
  1159. configure:10428: g++ -E  -DBOOST_SPIRIT_THREADSAFE -DHAVE_BUILD_INFO -D__STDC_FORMAT_MACROS -D_FILE_OFFSET_BITS=64  -U_FORTIFY_SOURCE -D_FORTIFY_SOURCE=2 conftest.cpp
  1160. configure:10428: $? = 0
  1161. configure:10428: result: yes
  1162. configure:10428: checking for miniupnpc/miniupnpc.h
  1163. configure:10428: result: yes
  1164. configure:10433: checking for main in -lminiupnpc
  1165. configure:10461: result: yes
  1166. configure:10428: checking miniupnpc/upnpcommands.h usability
  1167. configure:10428: g++ -c -g -O2 -Wall -Wextra -Wformat -Wformat-security -Wno-unused-parameter  -Wstack-protector -fstack-protector-all -fPIE  -DBOOST_SPIRIT_THREADSAFE -DHAVE_BUILD_INFO -D__STDC_FORMAT_MACROS -D_FILE_OFFSET_BITS=64  -U_FORTIFY_SOURCE -D_FORTIFY_SOURCE=2 conftest.cpp >&5
  1168. configure:10428: $? = 0
  1169. configure:10428: result: yes
  1170. configure:10428: checking miniupnpc/upnpcommands.h presence
  1171. configure:10428: g++ -E  -DBOOST_SPIRIT_THREADSAFE -DHAVE_BUILD_INFO -D__STDC_FORMAT_MACROS -D_FILE_OFFSET_BITS=64  -U_FORTIFY_SOURCE -D_FORTIFY_SOURCE=2 conftest.cpp
  1172. configure:10428: $? = 0
  1173. configure:10428: result: yes
  1174. configure:10428: checking for miniupnpc/upnpcommands.h
  1175. configure:10428: result: yes
  1176. configure:10433: checking for main in -lminiupnpc
  1177. configure:10461: result: yes
  1178. configure:10428: checking miniupnpc/upnperrors.h usability
  1179. configure:10428: g++ -c -g -O2 -Wall -Wextra -Wformat -Wformat-security -Wno-unused-parameter  -Wstack-protector -fstack-protector-all -fPIE  -DBOOST_SPIRIT_THREADSAFE -DHAVE_BUILD_INFO -D__STDC_FORMAT_MACROS -D_FILE_OFFSET_BITS=64  -U_FORTIFY_SOURCE -D_FORTIFY_SOURCE=2 conftest.cpp >&5
  1180. configure:10428: $? = 0
  1181. configure:10428: result: yes
  1182. configure:10428: checking miniupnpc/upnperrors.h presence
  1183. configure:10428: g++ -E  -DBOOST_SPIRIT_THREADSAFE -DHAVE_BUILD_INFO -D__STDC_FORMAT_MACROS -D_FILE_OFFSET_BITS=64  -U_FORTIFY_SOURCE -D_FORTIFY_SOURCE=2 conftest.cpp
  1184. configure:10428: $? = 0
  1185. configure:10428: result: yes
  1186. configure:10428: checking for miniupnpc/upnperrors.h
  1187. configure:10428: result: yes
  1188. configure:10433: checking for main in -lminiupnpc
  1189. configure:10461: result: yes
  1190. configure:10531: checking for boostlib >= 1.20.0
  1191. configure:10614: g++ -c -g -O2 -Wall -Wextra -Wformat -Wformat-security -Wno-unused-parameter  -Wstack-protector -fstack-protector-all -fPIE  -DBOOST_SPIRIT_THREADSAFE -DHAVE_BUILD_INFO -D__STDC_FORMAT_MACROS -D_FILE_OFFSET_BITS=64  -U_FORTIFY_SOURCE -D_FORTIFY_SOURCE=2 -I/usr/include conftest.cpp >&5
  1192. configure:10614: $? = 0
  1193. configure:10616: result: yes
  1194. configure:10800: checking whether the Boost::System library is available
  1195. configure:10824: g++ -c -g -O2 -Wall -Wextra -Wformat -Wformat-security -Wno-unused-parameter  -Wstack-protector -fstack-protector-all -fPIE  -DBOOST_SPIRIT_THREADSAFE -DHAVE_BUILD_INFO -D__STDC_FORMAT_MACROS -D_FILE_OFFSET_BITS=64  -U_FORTIFY_SOURCE -D_FORTIFY_SOURCE=2 -I/usr/include conftest.cpp >&5
  1196. conftest.cpp: In function 'int main()':
  1197. conftest.cpp:46:3: warning: statement is a reference, not call, to function 'boost::system::system_category' [-Waddress]
  1198.    ;
  1199.    ^
  1200. conftest.cpp:46:3: warning: statement has no effect [-Wunused-value]
  1201. configure:10824: $? = 0
  1202. configure:10839: result: yes
  1203. configure:10855: checking for exit in -lboost_system
  1204. configure:10880: g++ -o conftest -g -O2 -Wall -Wextra -Wformat -Wformat-security -Wno-unused-parameter  -Wstack-protector -fstack-protector-all -fPIE  -DBOOST_SPIRIT_THREADSAFE -DHAVE_BUILD_INFO -D__STDC_FORMAT_MACROS -D_FILE_OFFSET_BITS=64  -U_FORTIFY_SOURCE -D_FORTIFY_SOURCE=2 -I/usr/include   -Wl,-z,relro -Wl,-z,now -pie -L/usr/lib conftest.cpp -lboost_system  -lminiupnpc -lminiupnpc -lminiupnpc -lminiupnpc  >&5
  1205. configure:10880: $? = 0
  1206. configure:10890: result: yes
  1207. configure:11045: checking whether the Boost::Filesystem library is available
  1208. configure:11069: g++ -c -g -O2 -Wall -Wextra -Wformat -Wformat-security -Wno-unused-parameter  -Wstack-protector -fstack-protector-all -fPIE  -DBOOST_SPIRIT_THREADSAFE -DHAVE_BUILD_INFO -D__STDC_FORMAT_MACROS -D_FILE_OFFSET_BITS=64  -U_FORTIFY_SOURCE -D_FORTIFY_SOURCE=2 -I/usr/include conftest.cpp >&5
  1209. configure:11069: $? = 0
  1210. configure:11083: result: yes
  1211. configure:11095: checking for exit in -lboost_filesystem
  1212. configure:11120: g++ -o conftest -g -O2 -Wall -Wextra -Wformat -Wformat-security -Wno-unused-parameter  -Wstack-protector -fstack-protector-all -fPIE  -DBOOST_SPIRIT_THREADSAFE -DHAVE_BUILD_INFO -D__STDC_FORMAT_MACROS -D_FILE_OFFSET_BITS=64  -U_FORTIFY_SOURCE -D_FORTIFY_SOURCE=2 -I/usr/include   -Wl,-z,relro -Wl,-z,now -pie -L/usr/lib conftest.cpp -lboost_filesystem  -lminiupnpc -lminiupnpc -lminiupnpc -lminiupnpc  -lboost_system >&5
  1213. configure:11120: $? = 0
  1214. configure:11130: result: yes
  1215. configure:11280: checking whether the Boost::Program_Options library is available
  1216. configure:11304: g++ -c -g -O2 -Wall -Wextra -Wformat -Wformat-security -Wno-unused-parameter  -Wstack-protector -fstack-protector-all -fPIE  -DBOOST_SPIRIT_THREADSAFE -DHAVE_BUILD_INFO -D__STDC_FORMAT_MACROS -D_FILE_OFFSET_BITS=64  -U_FORTIFY_SOURCE -D_FORTIFY_SOURCE=2 -I/usr/include conftest.cpp >&5
  1217. configure:11304: $? = 0
  1218. configure:11318: result: yes
  1219. configure:11330: checking for exit in -lboost_program_options
  1220. configure:11355: g++ -o conftest -g -O2 -Wall -Wextra -Wformat -Wformat-security -Wno-unused-parameter  -Wstack-protector -fstack-protector-all -fPIE  -DBOOST_SPIRIT_THREADSAFE -DHAVE_BUILD_INFO -D__STDC_FORMAT_MACROS -D_FILE_OFFSET_BITS=64  -U_FORTIFY_SOURCE -D_FORTIFY_SOURCE=2 -I/usr/include   -Wl,-z,relro -Wl,-z,now -pie -L/usr/lib conftest.cpp -lboost_program_options  -lminiupnpc -lminiupnpc -lminiupnpc -lminiupnpc  >&5
  1221. configure:11355: $? = 0
  1222. configure:11365: result: yes
  1223. configure:11508: checking whether the Boost::Thread library is available
  1224. configure:11540: g++ -c -pthread -g -O2 -Wall -Wextra -Wformat -Wformat-security -Wno-unused-parameter  -Wstack-protector -fstack-protector-all -fPIE  -DBOOST_SPIRIT_THREADSAFE -DHAVE_BUILD_INFO -D__STDC_FORMAT_MACROS -D_FILE_OFFSET_BITS=64  -U_FORTIFY_SOURCE -D_FORTIFY_SOURCE=2 -I/usr/include conftest.cpp >&5
  1225. configure:11540: $? = 0
  1226. configure:11555: result: yes
  1227. configure:11585: checking for exit in -lboost_thread
  1228. configure:11610: g++ -o conftest -g -O2 -Wall -Wextra -Wformat -Wformat-security -Wno-unused-parameter  -Wstack-protector -fstack-protector-all -fPIE  -DBOOST_SPIRIT_THREADSAFE -DHAVE_BUILD_INFO -D__STDC_FORMAT_MACROS -D_FILE_OFFSET_BITS=64  -U_FORTIFY_SOURCE -D_FORTIFY_SOURCE=2 -I/usr/include   -Wl,-z,relro -Wl,-z,now -pie -L/usr/lib conftest.cpp -lboost_thread  -lminiupnpc -lminiupnpc -lminiupnpc -lminiupnpc  >&5
  1229. configure:11610: $? = 0
  1230. configure:11620: result: yes
  1231. configure:11780: checking whether the Boost::Chrono library is available
  1232. configure:11804: g++ -c -g -O2 -Wall -Wextra -Wformat -Wformat-security -Wno-unused-parameter  -Wstack-protector -fstack-protector-all -fPIE  -DBOOST_SPIRIT_THREADSAFE -DHAVE_BUILD_INFO -D__STDC_FORMAT_MACROS -D_FILE_OFFSET_BITS=64  -U_FORTIFY_SOURCE -D_FORTIFY_SOURCE=2 -pthread -I/usr/include conftest.cpp >&5
  1233. configure:11804: $? = 0
  1234. configure:11819: result: yes
  1235. configure:11835: checking for exit in -lboost_chrono
  1236. configure:11860: g++ -o conftest -g -O2 -Wall -Wextra -Wformat -Wformat-security -Wno-unused-parameter  -Wstack-protector -fstack-protector-all -fPIE  -DBOOST_SPIRIT_THREADSAFE -DHAVE_BUILD_INFO -D__STDC_FORMAT_MACROS -D_FILE_OFFSET_BITS=64  -U_FORTIFY_SOURCE -D_FORTIFY_SOURCE=2 -pthread -I/usr/include   -Wl,-z,relro -Wl,-z,now -pie -L/usr/lib conftest.cpp -lboost_chrono  -lminiupnpc -lminiupnpc -lminiupnpc -lminiupnpc  >&5
  1237. configure:11860: $? = 0
  1238. configure:11870: result: yes
  1239. configure:12029: checking whether the Boost::Unit_Test_Framework library is available
  1240. configure:12052: g++ -c -g -O2 -Wall -Wextra -Wformat -Wformat-security -Wno-unused-parameter  -Wstack-protector -fstack-protector-all -fPIE  -DBOOST_SPIRIT_THREADSAFE -DHAVE_BUILD_INFO -D__STDC_FORMAT_MACROS -D_FILE_OFFSET_BITS=64  -U_FORTIFY_SOURCE -D_FORTIFY_SOURCE=2 -pthread -I/usr/include conftest.cpp >&5
  1241. conftest.cpp: In function 'int main()':
  1242. conftest.cpp:51:21: warning: unused variable 'test' [-Wunused-variable]
  1243.          test_suite* test= BOOST_TEST_SUITE( "Unit test example 1" ); return 0;
  1244.                      ^
  1245. configure:12052: $? = 0
  1246. configure:12066: result: yes
  1247. configure:12178: checking for dynamic linked boost test
  1248. configure:12193: g++ -o conftest -g -O2 -Wall -Wextra -Wformat -Wformat-security -Wno-unused-parameter  -Wstack-protector -fstack-protector-all -fPIE  -DBOOST_SPIRIT_THREADSAFE -DHAVE_BUILD_INFO -D__STDC_FORMAT_MACROS -D_FILE_OFFSET_BITS=64  -U_FORTIFY_SOURCE -D_FORTIFY_SOURCE=2 -pthread -I/usr/include   -Wl,-z,relro -Wl,-z,now -pie conftest.cpp -lminiupnpc -lminiupnpc -lminiupnpc -lminiupnpc  -lboost_unit_test_framework >&5
  1249. configure:12193: $? = 0
  1250. configure:12194: result: yes
  1251. configure:12237: g++ -o conftest -g -O2 -Wall -Wextra -Wformat -Wformat-security -Wno-unused-parameter  -Wstack-protector -fstack-protector-all -fPIE  -DBOOST_SPIRIT_THREADSAFE -DHAVE_BUILD_INFO -D__STDC_FORMAT_MACROS -D_FILE_OFFSET_BITS=64  -U_FORTIFY_SOURCE -D_FORTIFY_SOURCE=2 -pthread -I/usr/include   -Wl,-z,relro -Wl,-z,now -pie conftest.cpp -lminiupnpc -lminiupnpc -lminiupnpc -lminiupnpc  -L/usr/lib -lboost_system -lboost_filesystem -lboost_program_options -lboost_thread -lboost_chrono  >&5
  1252. configure:12237: $? = 0
  1253. configure:12373: checking for SSL
  1254. configure:12380: $PKG_CONFIG --exists --print-errors "libssl"
  1255. configure:12383: $? = 0
  1256. configure:12397: $PKG_CONFIG --exists --print-errors "libssl"
  1257. configure:12400: $? = 0
  1258. configure:12438: result: yes
  1259. configure:12444: checking for CRYPTO
  1260. configure:12451: $PKG_CONFIG --exists --print-errors "libcrypto"
  1261. configure:12454: $? = 0
  1262. configure:12468: $PKG_CONFIG --exists --print-errors "libcrypto"
  1263. configure:12471: $? = 0
  1264. configure:12509: result: yes
  1265. configure:13045: checking whether to build bitcoind
  1266. configure:13055: result: yes
  1267. configure:13058: checking whether to build bitcoin-cli
  1268. configure:13068: result: yes
  1269. configure:15200: checking whether to build Bitcoin Core GUI
  1270. configure:15230: result: no (Qt)
  1271. configure:15253: checking if ccache should be used
  1272. configure:15266: result: no
  1273. configure:15270: checking if wallet should be enabled
  1274. configure:15282: result: no
  1275. configure:15286: checking whether to build with support for UPnP
  1276. configure:15296: result: yes
  1277. configure:15298: checking whether to build with UPnP enabled by default
  1278. configure:15306: result: no
  1279. configure:15373: checking whether to build test_bitcoin
  1280. configure:15376: result: yes
  1281. configure:15617: checking that generated files are newer than configure
  1282. configure:15623: result: done
  1283. configure:15711: creating ./config.status
  1284.  
  1285. ## ---------------------- ##
  1286. ## Running config.status. ##
  1287. ## ---------------------- ##
  1288.  
  1289. This file was extended by Bitcoin Core config.status 0.9.2, which was
  1290. generated by GNU Autoconf 2.69.  Invocation command line was
  1291.  
  1292.   CONFIG_FILES    =
  1293.   CONFIG_HEADERS  =
  1294.   CONFIG_LINKS    =
  1295.   CONFIG_COMMANDS =
  1296.   $ ./config.status
  1297.  
  1298. on raspberrypi
  1299.  
  1300. config.status:1031: creating Makefile
  1301. config.status:1031: creating src/Makefile
  1302. config.status:1031: creating src/test/Makefile
  1303. config.status:1031: creating src/qt/Makefile
  1304. config.status:1031: creating src/qt/test/Makefile
  1305. config.status:1031: creating share/setup.nsi
  1306. config.status:1031: creating share/qt/Info.plist
  1307. config.status:1031: creating qa/pull-tester/run-bitcoind-for-test.sh
  1308. config.status:1031: creating qa/pull-tester/build-tests.sh
  1309. config.status:1031: creating src/bitcoin-config.h
  1310. config.status:1260: executing depfiles commands
  1311.  
  1312. ## ---------------- ##
  1313. ## Cache variables. ##
  1314. ## ---------------- ##
  1315.  
  1316. ac_cv_build=armv6l-unknown-linux-gnueabihf
  1317. ac_cv_c_bigendian=no
  1318. ac_cv_c_compiler_gnu=yes
  1319. ac_cv_cxx_compiler_gnu=yes
  1320. ac_cv_env_CCC_set=
  1321. ac_cv_env_CCC_value=
  1322. ac_cv_env_CC_set=
  1323. ac_cv_env_CC_value=
  1324. ac_cv_env_CFLAGS_set=
  1325. ac_cv_env_CFLAGS_value=
  1326. ac_cv_env_CPPFLAGS_set=
  1327. ac_cv_env_CPPFLAGS_value=
  1328. ac_cv_env_CPP_set=
  1329. ac_cv_env_CPP_value=
  1330. ac_cv_env_CRYPTO_CFLAGS_set=
  1331. ac_cv_env_CRYPTO_CFLAGS_value=
  1332. ac_cv_env_CRYPTO_LIBS_set=
  1333. ac_cv_env_CRYPTO_LIBS_value=
  1334. ac_cv_env_CXXCPP_set=
  1335. ac_cv_env_CXXCPP_value=
  1336. ac_cv_env_CXXFLAGS_set=
  1337. ac_cv_env_CXXFLAGS_value=
  1338. ac_cv_env_CXX_set=
  1339. ac_cv_env_CXX_value=
  1340. ac_cv_env_LDFLAGS_set=
  1341. ac_cv_env_LDFLAGS_value=
  1342. ac_cv_env_LIBS_set=
  1343. ac_cv_env_LIBS_value=
  1344. ac_cv_env_OBJCFLAGS_set=
  1345. ac_cv_env_OBJCFLAGS_value=
  1346. ac_cv_env_OBJCXXFLAGS_set=
  1347. ac_cv_env_OBJCXXFLAGS_value=
  1348. ac_cv_env_OBJCXX_set=
  1349. ac_cv_env_OBJCXX_value=
  1350. ac_cv_env_OBJC_set=
  1351. ac_cv_env_OBJC_value=
  1352. ac_cv_env_PKG_CONFIG_LIBDIR_set=
  1353. ac_cv_env_PKG_CONFIG_LIBDIR_value=
  1354. ac_cv_env_PKG_CONFIG_PATH_set=
  1355. ac_cv_env_PKG_CONFIG_PATH_value=
  1356. ac_cv_env_PKG_CONFIG_set=
  1357. ac_cv_env_PKG_CONFIG_value=
  1358. ac_cv_env_PROTOBUF_CFLAGS_set=
  1359. ac_cv_env_PROTOBUF_CFLAGS_value=
  1360. ac_cv_env_PROTOBUF_LIBS_set=
  1361. ac_cv_env_PROTOBUF_LIBS_value=
  1362. ac_cv_env_QR_CFLAGS_set=
  1363. ac_cv_env_QR_CFLAGS_value=
  1364. ac_cv_env_QR_LIBS_set=
  1365. ac_cv_env_QR_LIBS_value=
  1366. ac_cv_env_QT_CFLAGS_set=
  1367. ac_cv_env_QT_CFLAGS_value=
  1368. ac_cv_env_QT_DBUS_CFLAGS_set=
  1369. ac_cv_env_QT_DBUS_CFLAGS_value=
  1370. ac_cv_env_QT_DBUS_LIBS_set=
  1371. ac_cv_env_QT_DBUS_LIBS_value=
  1372. ac_cv_env_QT_LIBS_set=
  1373. ac_cv_env_QT_LIBS_value=
  1374. ac_cv_env_QT_TEST_CFLAGS_set=
  1375. ac_cv_env_QT_TEST_CFLAGS_value=
  1376. ac_cv_env_QT_TEST_LIBS_set=
  1377. ac_cv_env_QT_TEST_LIBS_value=
  1378. ac_cv_env_SSL_CFLAGS_set=
  1379. ac_cv_env_SSL_CFLAGS_value=
  1380. ac_cv_env_SSL_LIBS_set=
  1381. ac_cv_env_SSL_LIBS_value=
  1382. ac_cv_env_build_alias_set=
  1383. ac_cv_env_build_alias_value=
  1384. ac_cv_env_host_alias_set=
  1385. ac_cv_env_host_alias_value=
  1386. ac_cv_env_target_alias_set=
  1387. ac_cv_env_target_alias_value=
  1388. ac_cv_func_strerror_r=yes
  1389. ac_cv_func_strerror_r_char_p=yes
  1390. ac_cv_have_decl_strerror_r=yes
  1391. ac_cv_header_inttypes_h=yes
  1392. ac_cv_header_memory_h=yes
  1393. ac_cv_header_miniupnpc_miniupnpc_h=yes
  1394. ac_cv_header_miniupnpc_miniwget_h=yes
  1395. ac_cv_header_miniupnpc_upnpcommands_h=yes
  1396. ac_cv_header_miniupnpc_upnperrors_h=yes
  1397. ac_cv_header_stdc=yes
  1398. ac_cv_header_stdint_h=yes
  1399. ac_cv_header_stdio_h=yes
  1400. ac_cv_header_stdlib_h=yes
  1401. ac_cv_header_string_h=yes
  1402. ac_cv_header_strings_h=yes
  1403. ac_cv_header_sys_stat_h=yes
  1404. ac_cv_header_sys_types_h=yes
  1405. ac_cv_header_unistd_h=yes
  1406. ac_cv_host=armv6l-unknown-linux-gnueabihf
  1407. ac_cv_lib_boost_chrono___exit=yes
  1408. ac_cv_lib_boost_filesystem___exit=yes
  1409. ac_cv_lib_boost_program_options___exit=yes
  1410. ac_cv_lib_boost_system___exit=yes
  1411. ac_cv_lib_boost_thread___exit=yes
  1412. ac_cv_lib_miniupnpc_main=yes
  1413. ac_cv_objc_compiler_gnu=no
  1414. ac_cv_objcxx_compiler_gnu=no
  1415. ac_cv_objext=o
  1416. ac_cv_path_EGREP='/bin/grep -E'
  1417. ac_cv_path_GIT=/usr/bin/git
  1418. ac_cv_path_GREP=/bin/grep
  1419. ac_cv_path_HEXDUMP=/usr/bin/hexdump
  1420. ac_cv_path_JAVA=/usr/bin/java
  1421. ac_cv_path_SED=/bin/sed
  1422. ac_cv_path_XGETTEXT=/usr/bin/xgettext
  1423. ac_cv_path_ac_pt_AR=/usr/bin/ar
  1424. ac_cv_path_ac_pt_GCOV=/usr/bin/gcov
  1425. ac_cv_path_ac_pt_PKG_CONFIG=/usr/bin/pkg-config
  1426. ac_cv_path_ac_pt_RANLIB=/usr/bin/ranlib
  1427. ac_cv_path_ac_pt_STRIP=/usr/bin/strip
  1428. ac_cv_path_install='/usr/bin/install -c'
  1429. ac_cv_path_mkdir=/bin/mkdir
  1430. ac_cv_prog_AWK=mawk
  1431. ac_cv_prog_CPP='gcc -E'
  1432. ac_cv_prog_CXXCPP='g++ -E'
  1433. ac_cv_prog_ac_ct_CC=gcc
  1434. ac_cv_prog_ac_ct_CXX=g++
  1435. ac_cv_prog_ac_ct_OBJC=gcc
  1436. ac_cv_prog_ac_ct_OBJCXX=g++
  1437. ac_cv_prog_cc_c89=
  1438. ac_cv_prog_cc_g=yes
  1439. ac_cv_prog_cxx_g=yes
  1440. ac_cv_prog_make_make_set=yes
  1441. ac_cv_prog_objc_g=no
  1442. ac_cv_prog_objcxx_g=no
  1443. ac_cv_sys_file_offset_bits=64
  1444. ac_cv_sys_largefile_CC=no
  1445. am_cv_CC_dependencies_compiler_type=gcc3
  1446. am_cv_CXX_dependencies_compiler_type=gcc3
  1447. am_cv_OBJCXX_dependencies_compiler_type=gcc3
  1448. am_cv_OBJC_dependencies_compiler_type=gcc3
  1449. am_cv_make_support_nested_variables=yes
  1450. am_cv_prog_cc_c_o=yes
  1451. ax_cv_PTHREAD_PRIO_INHERIT=yes
  1452. ax_cv_boost_chrono=yes
  1453. ax_cv_boost_filesystem=yes
  1454. ax_cv_boost_program_options=yes
  1455. ax_cv_boost_system=yes
  1456. ax_cv_boost_thread=yes
  1457. ax_cv_boost_unit_test_framework=yes
  1458. ax_cv_check_cxxcppflags___D_FORTIFY_SOURCE_2=yes
  1459. ax_cv_check_cxxcppflags___U_FORTIFY_SOURCE=yes
  1460. ax_cv_check_cxxflags___Wstack_protector=yes
  1461. ax_cv_check_cxxflags___fPIE=yes
  1462. ax_cv_check_cxxflags___fstack_protector_all=yes
  1463. ax_cv_check_ldflags___Wl___dynamicbase=no
  1464. ax_cv_check_ldflags___Wl___large_address_aware=no
  1465. ax_cv_check_ldflags___Wl___nxcompat=no
  1466. ax_cv_check_ldflags___Wl__z_now=yes
  1467. ax_cv_check_ldflags___Wl__z_relro=yes
  1468. ax_cv_check_ldflags___pie=yes
  1469. pkg_cv_CRYPTO_CFLAGS=
  1470. pkg_cv_CRYPTO_LIBS='-lcrypto '
  1471. pkg_cv_SSL_CFLAGS=
  1472. pkg_cv_SSL_LIBS='-lssl -lcrypto '
  1473.  
  1474. ## ----------------- ##
  1475. ## Output variables. ##
  1476. ## ----------------- ##
  1477.  
  1478. ACLOCAL='${SHELL} /home/pi/bitcoin/src/build-aux/missing aclocal-1.14'
  1479. AMDEPBACKSLASH='\'
  1480. AMDEP_FALSE='#'
  1481. AMDEP_TRUE=''
  1482. AMTAR='$${TAR-tar}'
  1483. AM_BACKSLASH='\'
  1484. AM_DEFAULT_V='$(AM_DEFAULT_VERBOSITY)'
  1485. AM_DEFAULT_VERBOSITY='0'
  1486. AM_V='$(V)'
  1487. AR='/usr/bin/ar'
  1488. AUTOCONF='${SHELL} /home/pi/bitcoin/src/build-aux/missing autoconf'
  1489. AUTOHEADER='${SHELL} /home/pi/bitcoin/src/build-aux/missing autoheader'
  1490. AUTOMAKE='${SHELL} /home/pi/bitcoin/src/build-aux/missing automake-1.14'
  1491. AWK='mawk'
  1492. BDB_CPPFLAGS=''
  1493. BDB_LIBS=''
  1494. BOOST_CHRONO_LIB='-lboost_chrono '
  1495. BOOST_CPPFLAGS='-pthread -I/usr/include'
  1496. BOOST_FILESYSTEM_LIB='-lboost_filesystem'
  1497. BOOST_LDFLAGS='-L/usr/lib'
  1498. BOOST_LIBS='-L/usr/lib -lboost_system -lboost_filesystem -lboost_program_options -lboost_thread -lboost_chrono '
  1499. BOOST_PROGRAM_OPTIONS_LIB='-lboost_program_options'
  1500. BOOST_SYSTEM_LIB='-lboost_system'
  1501. BOOST_THREAD_LIB='-lboost_thread'
  1502. BOOST_UNIT_TEST_FRAMEWORK_LIB='-lboost_unit_test_framework'
  1503. BREW=''
  1504. BUILD_BITCOIND_FALSE='#'
  1505. BUILD_BITCOIND_TRUE=''
  1506. BUILD_BITCOIN_CLI_FALSE='#'
  1507. BUILD_BITCOIN_CLI_TRUE=''
  1508. BUILD_DARWIN_FALSE=''
  1509. BUILD_DARWIN_TRUE='#'
  1510. BUILD_QT=''
  1511. BUILD_TEST='test'
  1512. BUILD_TEST_QT=''
  1513. CC='gcc'
  1514. CCACHE=''
  1515. CCDEPMODE='depmode=gcc3'
  1516. CFLAGS='-g -O2'
  1517. CLIENT_VERSION_BUILD='0'
  1518. CLIENT_VERSION_IS_RELEASE='true'
  1519. CLIENT_VERSION_MAJOR='0'
  1520. CLIENT_VERSION_MINOR='9'
  1521. CLIENT_VERSION_REVISION='2'
  1522. COMPARISON_TOOL_REORG_TESTS='0'
  1523. COPYRIGHT_YEAR='2014'
  1524. CPP='gcc -E'
  1525. CPPFLAGS=' -DBOOST_SPIRIT_THREADSAFE -DHAVE_BUILD_INFO -D__STDC_FORMAT_MACROS -D_FILE_OFFSET_BITS=64  -U_FORTIFY_SOURCE -D_FORTIFY_SOURCE=2'
  1526. CRYPTO_CFLAGS=''
  1527. CRYPTO_LIBS='-lcrypto '
  1528. CXX='g++'
  1529. CXXCPP='g++ -E'
  1530. CXXDEPMODE='depmode=gcc3'
  1531. CXXFLAGS='-g -O2 -Wall -Wextra -Wformat -Wformat-security -Wno-unused-parameter  -Wstack-protector -fstack-protector-all -fPIE'
  1532. CYGPATH_W='echo'
  1533. DEFS='-DHAVE_CONFIG_H'
  1534. DEPDIR='.deps'
  1535. ECHO_C=''
  1536. ECHO_N='-n'
  1537. ECHO_T=''
  1538. EGREP='/bin/grep -E'
  1539. EMBEDDED_LEVELDB_FALSE='#'
  1540. EMBEDDED_LEVELDB_TRUE=''
  1541. ENABLE_WALLET_FALSE=''
  1542. ENABLE_WALLET_TRUE='#'
  1543. EXEEXT=''
  1544. GCOV='/usr/bin/gcov'
  1545. GENHTML=''
  1546. GENISOIMAGE=''
  1547. GIT='/usr/bin/git'
  1548. GLIBC_BACK_COMPAT_FALSE=''
  1549. GLIBC_BACK_COMPAT_TRUE='#'
  1550. GREP='/bin/grep'
  1551. HEXDUMP='/usr/bin/hexdump'
  1552. INCLUDES=' -pthread  '
  1553. INSTALLNAMETOOL=''
  1554. INSTALL_DATA='${INSTALL} -m 644'
  1555. INSTALL_PROGRAM='${INSTALL}'
  1556. INSTALL_SCRIPT='${INSTALL}'
  1557. INSTALL_STRIP_PROGRAM='$(install_sh) -c -s'
  1558. JAVA='/usr/bin/java'
  1559. JAVA_COMPARISON_TOOL=''
  1560. LCOV=''
  1561. LDFLAGS='  -Wl,-z,relro -Wl,-z,now -pie'
  1562. LEVELDB_CPPFLAGS=''
  1563. LEVELDB_TARGET_FLAGS=''
  1564. LIBLEVELDB=''
  1565. LIBMEMENV=''
  1566. LIBOBJS=''
  1567. LIBS='-lminiupnpc -lminiupnpc -lminiupnpc -lminiupnpc  -lssl -lcrypto  -lcrypto '
  1568. LN_S='ln -s'
  1569. LRELEASE=''
  1570. LTLIBOBJS=''
  1571. LUPDATE=''
  1572. MAINT=''
  1573. MAINTAINER_MODE_FALSE='#'
  1574. MAINTAINER_MODE_TRUE=''
  1575. MAKEINFO='${SHELL} /home/pi/bitcoin/src/build-aux/missing makeinfo'
  1576. MAKENSIS=''
  1577. MKDIR_P='/bin/mkdir -p'
  1578. MOC=''
  1579. MOC_DEFS='-DHAVE_CONFIG_H -I$(top_srcdir)/src'
  1580. OBJC='gcc'
  1581. OBJCDEPMODE='depmode=gcc3'
  1582. OBJCFLAGS=''
  1583. OBJCXX='g++'
  1584. OBJCXXDEPMODE='depmode=gcc3'
  1585. OBJCXXFLAGS='-g -O2 -Wall -Wextra -Wformat -Wformat-security -Wno-unused-parameter  -Wstack-protector -fstack-protector-all -fPIE'
  1586. OBJEXT='o'
  1587. OTOOL=''
  1588. PACKAGE='bitcoin'
  1589. PACKAGE_BUGREPORT='[email protected]'
  1590. PACKAGE_NAME='Bitcoin Core'
  1591. PACKAGE_STRING='Bitcoin Core 0.9.2'
  1592. PACKAGE_TARNAME='bitcoin'
  1593. PACKAGE_URL=''
  1594. PACKAGE_VERSION='0.9.2'
  1595. PATH_SEPARATOR=':'
  1596. PKG_CONFIG='/usr/bin/pkg-config'
  1597. PKG_CONFIG_LIBDIR=''
  1598. PKG_CONFIG_PATH=''
  1599. PORT=''
  1600. PROTOBUF_CFLAGS=''
  1601. PROTOBUF_LIBS=''
  1602. PROTOC=''
  1603. PTHREAD_CC='gcc'
  1604. PTHREAD_CFLAGS='-pthread'
  1605. PTHREAD_LIBS=''
  1606. QR_CFLAGS=''
  1607. QR_LIBS=''
  1608. QT_CFLAGS=''
  1609. QT_DBUS_CFLAGS=''
  1610. QT_DBUS_INCLUDES=''
  1611. QT_DBUS_LIBS=''
  1612. QT_INCLUDES=''
  1613. QT_LDFLAGS=''
  1614. QT_LIBS=''
  1615. QT_SELECT='qt'
  1616. QT_TEST_CFLAGS=''
  1617. QT_TEST_INCLUDES=''
  1618. QT_TEST_LIBS=''
  1619. RANLIB='/usr/bin/ranlib'
  1620. RCC=''
  1621. SED='/bin/sed'
  1622. SET_MAKE=''
  1623. SHELL='/bin/bash'
  1624. SSL_CFLAGS=''
  1625. SSL_LIBS='-lssl -lcrypto '
  1626. STRIP='/usr/bin/strip'
  1627. TARGET_DARWIN_FALSE=''
  1628. TARGET_DARWIN_TRUE='#'
  1629. TARGET_WINDOWS_FALSE=''
  1630. TARGET_WINDOWS_TRUE='#'
  1631. TESTDEFS=' -DBOOST_TEST_DYN_LINK'
  1632. UIC=''
  1633. USE_COMPARISON_TOOL_FALSE=''
  1634. USE_COMPARISON_TOOL_REORG_TESTS_FALSE='#'
  1635. USE_COMPARISON_TOOL_REORG_TESTS_TRUE=''
  1636. USE_COMPARISON_TOOL_TRUE='#'
  1637. USE_LCOV_FALSE=''
  1638. USE_LCOV_TRUE='#'
  1639. USE_QRCODE=''
  1640. USE_QRCODE_FALSE=''
  1641. USE_QRCODE_TRUE='#'
  1642. USE_UPNP=''
  1643. VERSION='0.9.2'
  1644. WINDOWS_BITS=''
  1645. WINDRES=''
  1646. XGETTEXT='/usr/bin/xgettext'
  1647. ac_ct_CC='gcc'
  1648. ac_ct_CXX='g++'
  1649. ac_ct_OBJC='gcc'
  1650. ac_ct_OBJCXX='g++'
  1651. am__EXEEXT_FALSE=''
  1652. am__EXEEXT_TRUE='#'
  1653. am__fastdepCC_FALSE='#'
  1654. am__fastdepCC_TRUE=''
  1655. am__fastdepCXX_FALSE='#'
  1656. am__fastdepCXX_TRUE=''
  1657. am__fastdepOBJCXX_FALSE='#'
  1658. am__fastdepOBJCXX_TRUE=''
  1659. am__fastdepOBJC_FALSE='#'
  1660. am__fastdepOBJC_TRUE=''
  1661. am__include='include'
  1662. am__isrc=''
  1663. am__leading_dot='.'
  1664. am__nodep='_no'
  1665. am__quote=''
  1666. am__tar='$${TAR-tar} chof - "$$tardir"'
  1667. am__untar='$${TAR-tar} xf -'
  1668. ax_pthread_config=''
  1669. bindir='${exec_prefix}/bin'
  1670. build='armv6l-unknown-linux-gnueabihf'
  1671. build_alias=''
  1672. build_cpu='armv6l'
  1673. build_os='linux-gnueabihf'
  1674. build_vendor='unknown'
  1675. datadir='${datarootdir}'
  1676. datarootdir='${prefix}/share'
  1677. docdir='${datarootdir}/doc/${PACKAGE_TARNAME}'
  1678. dvidir='${docdir}'
  1679. exec_prefix='${prefix}'
  1680. host='armv6l-unknown-linux-gnueabihf'
  1681. host_alias=''
  1682. host_cpu='armv6l'
  1683. host_os='linux-gnueabihf'
  1684. host_vendor='unknown'
  1685. htmldir='${docdir}'
  1686. includedir='${prefix}/include'
  1687. infodir='${datarootdir}/info'
  1688. install_sh='${SHELL} /home/pi/bitcoin/src/build-aux/install-sh'
  1689. libdir='${exec_prefix}/lib'
  1690. libexecdir='${exec_prefix}/libexec'
  1691. localedir='${datarootdir}/locale'
  1692. localstatedir='${prefix}/var'
  1693. mandir='${datarootdir}/man'
  1694. mkdir_p='$(MKDIR_P)'
  1695. oldincludedir='/usr/include'
  1696. pdfdir='${docdir}'
  1697. prefix='/usr/local'
  1698. program_transform_name='s,x,x,'
  1699. psdir='${docdir}'
  1700. sbindir='${exec_prefix}/sbin'
  1701. sharedstatedir='${prefix}/com'
  1702. sysconfdir='${prefix}/etc'
  1703. target_alias=''
  1704.  
  1705. ## ----------- ##
  1706. ## confdefs.h. ##
  1707. ## ----------- ##
  1708.  
  1709. /* confdefs.h */
  1710. #define PACKAGE_NAME "Bitcoin Core"
  1711. #define PACKAGE_TARNAME "bitcoin"
  1712. #define PACKAGE_VERSION "0.9.2"
  1713. #define PACKAGE_STRING "Bitcoin Core 0.9.2"
  1714. #define PACKAGE_BUGREPORT "[email protected]"
  1715. #define PACKAGE_URL ""
  1716. #define STDC_HEADERS 1
  1717. #define HAVE_SYS_TYPES_H 1
  1718. #define HAVE_SYS_STAT_H 1
  1719. #define HAVE_STDLIB_H 1
  1720. #define HAVE_STRING_H 1
  1721. #define HAVE_MEMORY_H 1
  1722. #define HAVE_STRINGS_H 1
  1723. #define HAVE_INTTYPES_H 1
  1724. #define HAVE_STDINT_H 1
  1725. #define HAVE_UNISTD_H 1
  1726. #define HAVE_PTHREAD_PRIO_INHERIT 1
  1727. #define HAVE_PTHREAD 1
  1728. #define _FILE_OFFSET_BITS 64
  1729. #define HAVE_DECL_STRERROR_R 1
  1730. #define HAVE_STRERROR_R 1
  1731. #define STRERROR_R_CHAR_P 1
  1732. #define HAVE_STDIO_H 1
  1733. #define HAVE_STDLIB_H 1
  1734. #define HAVE_UNISTD_H 1
  1735. #define HAVE_STRINGS_H 1
  1736. #define HAVE_SYS_TYPES_H 1
  1737. #define HAVE_SYS_STAT_H 1
  1738. #define HAVE_MSG_NOSIGNAL 1
  1739. #define HAVE_MINIUPNPC_MINIWGET_H 1
  1740. #define HAVE_LIBMINIUPNPC 1
  1741. #define HAVE_MINIUPNPC_MINIUPNPC_H 1
  1742. #define HAVE_LIBMINIUPNPC 1
  1743. #define HAVE_MINIUPNPC_UPNPCOMMANDS_H 1
  1744. #define HAVE_LIBMINIUPNPC 1
  1745. #define HAVE_MINIUPNPC_UPNPERRORS_H 1
  1746. #define HAVE_LIBMINIUPNPC 1
  1747. #define HAVE_BOOST /**/
  1748. #define HAVE_BOOST_SYSTEM /**/
  1749. #define HAVE_BOOST_FILESYSTEM /**/
  1750. #define HAVE_BOOST_PROGRAM_OPTIONS /**/
  1751. #define HAVE_BOOST_THREAD /**/
  1752. #define HAVE_BOOST_CHRONO /**/
  1753. #define HAVE_BOOST_UNIT_TEST_FRAMEWORK /**/
  1754. #define HAVE_WORKING_BOOST_SLEEP_FOR 1
  1755. #define USE_UPNP 0
  1756. #define CLIENT_VERSION_MAJOR 0
  1757. #define CLIENT_VERSION_MINOR 9
  1758. #define CLIENT_VERSION_REVISION 2
  1759. #define CLIENT_VERSION_BUILD 0
  1760. #define CLIENT_VERSION_IS_RELEASE true
  1761. #define COPYRIGHT_YEAR 2014
  1762.  
  1763. configure: exit 0
Advertisement
Add Comment
Please, Sign In to add comment