Guest User

cudarray make error log

a guest
May 27th, 2016
133
0
Never
Not a member of Pastebin yet? Sign Up, it unlocks many cool features!
Bash 9.95 KB | None | 0 0
  1.  
  2. user@Arch: ~/devel/cudarray master!
  3.  $ make
  4. nvcc -gencode arch=compute_20,code=sm_20 -gencode arch=compute_20,code=compute_20 -gencode arch=compute_30,code=sm_30 -gencode arch=compute_30,code=compute_30 -gencode arch=compute_35,code=sm_35 -gencode arch=compute_35,code=compute_35 -O3 --compiler-options '-O3 -fPIC -Wall -Wfatal-errors' --ftz=true --prec-div=false -prec-sqrt=false --fmad=true -I./include -I/usr/local/cuda/include -c -o src/nnet/pool_b01.o src/nnet/pool_b01.cu
  5. /usr/lib/gcc/x86_64-pc-linux-gnu/6.1.1/include/stddef.h(436): error: identifier "nullptr" is undefined
  6.  
  7. /usr/lib/gcc/x86_64-pc-linux-gnu/6.1.1/include/stddef.h(436): error: expected a ";"
  8.  
  9. /usr/include/c++/6.1.1/x86_64-pc-linux-gnu/bits/c++config.h(202): error: expected a ";"
  10.  
  11. /usr/include/c++/6.1.1/exception(63): error: expected a ";"
  12.  
  13. /usr/include/c++/6.1.1/exception(69): error: expected a ";"
  14.  
  15. /usr/include/c++/6.1.1/exception(77): error: expected a ";"
  16.  
  17. /usr/include/c++/6.1.1/exception(85): error: expected a ";"
  18.  
  19. /usr/include/c++/6.1.1/exception(95): error: expected a "{"
  20.  
  21. /usr/include/c++/6.1.1/bits/exception_ptr.h(64): error: function "std::current_exception" returns incomplete type "std::__exception_ptr::exception_ptr"
  22.  
  23. /usr/include/c++/6.1.1/bits/exception_ptr.h(64): error: expected a "{"
  24.  
  25. /usr/include/c++/6.1.1/bits/exception_ptr.h(71): error: namespace "std" has no member "rethrow_exception"
  26.  
  27. /usr/include/c++/6.1.1/bits/exception_ptr.h(81): error: expected a ";"
  28.  
  29. /usr/include/c++/6.1.1/bits/exception_ptr.h(83): error: expected a ";"
  30.  
  31. /usr/include/c++/6.1.1/bits/exception_ptr.h(84): error: expected a ";"
  32.  
  33. /usr/include/c++/6.1.1/bits/exception_ptr.h(86): error: expected a ";"
  34.  
  35. /usr/include/c++/6.1.1/bits/exception_ptr.h(88): error: declaration is incompatible with previous "std::current_exception"
  36. (64): here
  37.  
  38. /usr/include/c++/6.1.1/bits/exception_ptr.h(88): error: use of a local type to declare a function
  39.  
  40. /usr/include/c++/6.1.1/bits/exception_ptr.h(88): error: expected a ";"
  41.  
  42. /usr/include/c++/6.1.1/bits/exception_ptr.h(89): error: use of a local type to declare a function
  43.  
  44. /usr/include/c++/6.1.1/bits/exception_ptr.h(92): error: expected a ";"
  45.  
  46. /usr/include/c++/6.1.1/bits/exception_ptr.h(94): error: expected a ";"
  47.  
  48. /usr/include/c++/6.1.1/bits/exception_ptr.h(97): error: incomplete type is not allowed
  49.  
  50. /usr/include/c++/6.1.1/bits/exception_ptr.h(97): error: expected a ";"
  51.  
  52. /usr/include/c++/6.1.1/bits/exception_ptr.h(118): error: expected a ";"
  53.  
  54. /usr/include/c++/6.1.1/bits/exception_ptr.h(128): error: expected a ";"
  55.  
  56. /usr/include/c++/6.1.1/bits/exception_ptr.h(145): error: use of a local type to declare a function
  57.  
  58. /usr/include/c++/6.1.1/bits/exception_ptr.h(146): error: expected a ";"
  59.  
  60. /usr/include/c++/6.1.1/bits/exception_ptr.h(149): error: expected a ";"
  61.  
  62. /usr/include/c++/6.1.1/bits/exception_ptr.h(154): error: use of a local type to declare a function
  63.  
  64. /usr/include/c++/6.1.1/bits/exception_ptr.h(155): error: expected a ";"
  65.  
  66. /usr/include/c++/6.1.1/bits/exception_ptr.h(158): error: use of a local type to declare a function
  67.  
  68. /usr/include/c++/6.1.1/bits/exception_ptr.h(159): error: expected a ";"
  69.  
  70. /usr/include/c++/6.1.1/bits/exception_ptr.h(162): error: use of a local type to declare a function
  71.  
  72. /usr/include/c++/6.1.1/bits/exception_ptr.h(163): error: expected a ";"
  73.  
  74. /usr/include/c++/6.1.1/bits/exception_ptr.h(171): error: expected a ";"
  75.  
  76. /usr/include/c++/6.1.1/bits/exception_ptr.h(197): error: expected a ";"
  77.  
  78. /usr/include/c++/6.1.1/bits/move.h(47): error: expected a ";"
  79.  
  80. /usr/include/c++/6.1.1/type_traits(71): error: identifier "constexpr" is undefined
  81.  
  82. /usr/include/c++/6.1.1/type_traits(71): error: template parameter "_Tp" may not be redeclared in this scope
  83.  
  84. /usr/include/c++/6.1.1/type_traits(71): error: expected a ";"
  85.  
  86. /usr/include/c++/6.1.1/type_traits(72): error: member "std::integral_constant<_Tp, __v>::_Tp" is not a type name
  87.  
  88. /usr/include/c++/6.1.1/type_traits(73): error: member "std::integral_constant<_Tp, __v>::_Tp" is not a type name
  89.  
  90. /usr/include/c++/6.1.1/type_traits(74): error: identifier "constexpr" is undefined
  91.  
  92. /usr/include/c++/6.1.1/type_traits(79): error: identifier "constexpr" is undefined
  93.  
  94. /usr/include/c++/6.1.1/type_traits(79): error: "value_type" has already been declared in the current scope
  95.  
  96. /usr/include/c++/6.1.1/type_traits(79): error: expected a ";"
  97.  
  98. /usr/include/c++/6.1.1/type_traits(84): error: identifier "constexpr" is undefined
  99.  
  100. /usr/include/c++/6.1.1/type_traits(84): error: "_Tp" is not a function or static data member
  101.  
  102. /usr/include/c++/6.1.1/type_traits(93): error: expected a declaration
  103.  
  104. /usr/include/c++/6.1.1/type_traits(93): error: expected a ";"
  105.  
  106. /usr/include/c++/6.1.1/type_traits(126): error: space required between adjacent ">" delimiters of nested template argument lists (">>" is the right shift operator)
  107.  
  108. /usr/include/c++/6.1.1/type_traits(235): error: identifier "char16_t" is undefined
  109.  
  110. /usr/include/c++/6.1.1/type_traits(239): error: identifier "char32_t" is undefined
  111.  
  112. /usr/include/c++/6.1.1/type_traits(239): error: class "std::__is_integral_helper<<error-type>>" has already been defined
  113.  
  114. /usr/include/c++/6.1.1/type_traits(337): error: identifier "__float128" is undefined
  115.  
  116. /usr/include/c++/6.1.1/type_traits(453): error: expected a ">"
  117.  
  118. /usr/include/c++/6.1.1/type_traits(457): error: expected a ">"
  119.  
  120. /usr/include/c++/6.1.1/type_traits(465): error: expected a ">"
  121.  
  122. /usr/include/c++/6.1.1/type_traits(469): error: expected a ">"
  123.  
  124. /usr/include/c++/6.1.1/type_traits(477): error: expected a ">"
  125.  
  126. /usr/include/c++/6.1.1/type_traits(481): error: expected a ">"
  127.  
  128. /usr/include/c++/6.1.1/type_traits(489): error: expected a ">"
  129.  
  130. /usr/include/c++/6.1.1/type_traits(493): error: expected a ">"
  131.  
  132. /usr/include/c++/6.1.1/type_traits(501): error: expected a ">"
  133.  
  134. /usr/include/c++/6.1.1/type_traits(505): error: expected a ">"
  135.  
  136. /usr/include/c++/6.1.1/type_traits(513): error: expected a ">"
  137.  
  138. /usr/include/c++/6.1.1/type_traits(517): error: expected a ">"
  139.  
  140. /usr/include/c++/6.1.1/type_traits(525): error: expected a ">"
  141.  
  142. /usr/include/c++/6.1.1/type_traits(529): error: expected a ">"
  143.  
  144. /usr/include/c++/6.1.1/type_traits(537): error: expected a ">"
  145.  
  146. /usr/include/c++/6.1.1/type_traits(541): error: expected a ">"
  147.  
  148. /usr/include/c++/6.1.1/type_traits(551): error: namespace "std" has no member "nullptr_t"
  149.  
  150. /usr/include/c++/6.1.1/type_traits(572): error: space required between adjacent ">" delimiters of nested template argument lists (">>" is the right shift operator)
  151.  
  152. /usr/include/c++/6.1.1/type_traits(578): error: space required between adjacent ">" delimiters of nested template argument lists (">>" is the right shift operator)
  153.  
  154. /usr/include/c++/6.1.1/type_traits(585): error: space required between adjacent ">" delimiters of nested template argument lists (">>" is the right shift operator)
  155.  
  156. /usr/include/c++/6.1.1/type_traits(592): error: space required between adjacent ">" delimiters of nested template argument lists (">>" is the right shift operator)
  157.  
  158. /usr/include/c++/6.1.1/type_traits(602): error: space required between adjacent ">" delimiters of nested template argument lists (">>" is the right shift operator)
  159.  
  160. /usr/include/c++/6.1.1/type_traits(628): error: space required between adjacent ">" delimiters of nested template argument lists (">>" is the right shift operator)
  161.  
  162. /usr/include/c++/6.1.1/type_traits(738): error: space required between adjacent ">" delimiters of nested template argument lists (">>" is the right shift operator)
  163.  
  164. /usr/include/c++/6.1.1/type_traits(752): error: expected a ";"
  165.  
  166. /usr/include/c++/6.1.1/type_traits(767): error: space required between adjacent ">" delimiters of nested template argument lists (">>" is the right shift operator)
  167.  
  168. /usr/include/c++/6.1.1/type_traits(777): error: expected a ")"
  169.  
  170. /usr/include/c++/6.1.1/type_traits(788): error: an explicit template argument list is not allowed on this declaration
  171.  
  172. /usr/include/c++/6.1.1/type_traits(788): error: expected a type specifier
  173.  
  174. /usr/include/c++/6.1.1/type_traits(788): error: function returning function is not allowed
  175.  
  176. /usr/include/c++/6.1.1/type_traits(788): error: expected a ";"
  177.  
  178. /usr/include/c++/6.1.1/type_traits(794): error: space required between adjacent ">" delimiters of nested template argument lists (">>" is the right shift operator)
  179.  
  180. /usr/include/c++/6.1.1/type_traits(795): error: space required between adjacent ">" delimiters of nested template argument lists (">>" is the right shift operator)
  181.  
  182. /usr/include/c++/6.1.1/type_traits(825): error: identifier "noexcept" is undefined
  183.  
  184. /usr/include/c++/6.1.1/type_traits(825): error: function call is not allowed in a constant expression
  185.  
  186. /usr/include/c++/6.1.1/type_traits(825): error: function call is not allowed in a constant expression
  187.  
  188. /usr/include/c++/6.1.1/type_traits(825): error: this operator is not allowed in a template argument expression
  189.  
  190. /usr/include/c++/6.1.1/type_traits(836): error: an explicit template argument list is not allowed on this declaration
  191.  
  192. /usr/include/c++/6.1.1/type_traits(836): error: expected a type specifier
  193.  
  194. /usr/include/c++/6.1.1/type_traits(836): error: function returning function is not allowed
  195.  
  196. /usr/include/c++/6.1.1/type_traits(836): error: expected a ";"
  197.  
  198. /usr/include/c++/6.1.1/type_traits(842): error: space required between adjacent ">" delimiters of nested template argument lists (">>" is the right shift operator)
  199.  
  200. /usr/include/c++/6.1.1/type_traits(843): error: space required between adjacent ">" delimiters of nested template argument lists (">>" is the right shift operator)
  201.  
  202. /usr/include/c++/6.1.1/type_traits(868): error: function returning function is not allowed
  203.  
  204. /usr/include/c++/6.1.1/type_traits(879): error: an explicit template argument list is not allowed on this declaration
  205.  
  206. Error limit reached.
  207. 100 errors detected in the compilation of "/tmp/tmpxft_0000042f_00000000-13_pool_b01.compute_35.cpp1.ii".
  208. Compilation terminated.
  209. Makefile:78: recipe for target 'src/nnet/pool_b01.o' failed
  210. make: *** [src/nnet/pool_b01.o] Error 4
  211. FAIL
Advertisement
Add Comment
Please, Sign In to add comment