SHARE
TWEET

Untitled

a guest Oct 31st, 2010 112 Never
  1. /home/biont/rockbox/apps/settings_list.c:469: error: expected identifier or '(' before '||' token
  2. /home/biont/rockbox/apps/settings_list.c:1729: error: 'tsc_load_from_cfg' undeclared here (not in a function)
  3. make: *** [/home/biont/rockbox/build/apps/settings_list.o] Fehler 1
RAW Paste Data
Top