Pastebin launched a little side project called VERYVIRAL.com, check it out ;-) Want more features on Pastebin? Sign Up, it's FREE!
Guest

Untitled

By: a guest on Aug 17th, 2012  |  syntax: None  |  size: 43.00 KB  |  views: 30  |  expires: Never
download  |  raw  |  embed  |  report abuse  |  print
Text below is selected. Please press Ctrl+C to copy to your clipboard. (⌘+C on Mac)
  1. This file contains any messages produced by compilers while
  2. running configure, to aid debugging if configure makes a mistake.
  3.  
  4. It was created by eyesight configure 0.0.1, which was
  5. generated by GNU Autoconf 2.69.  Invocation command line was
  6.  
  7.   $ ./configure --prefix=/usr --libdir=/usr/lib --mandir=/usr/man --infodir=/usr/info --enable-pdf --enable-postscript --enable-txt --enable-shared --disable-static --build=i486-slackware-linux
  8.  
  9. ## --------- ##
  10. ## Platform. ##
  11. ## --------- ##
  12.  
  13. hostname = garik
  14. uname -m = i686
  15. uname -r = 3.2.26-smp
  16. uname -s = Linux
  17. uname -v = #1 SMP Tue Aug 7 13:03:30 CDT 2012
  18.  
  19. /usr/bin/uname -p = Intel(R) Celeron(R) CPU 2.00GHz
  20. /bin/uname -X     = unknown
  21.  
  22. /bin/arch              = i686
  23. /usr/bin/arch -k       = unknown
  24. /usr/convex/getsysinfo = unknown
  25. /usr/bin/hostinfo      = unknown
  26. /bin/machine           = unknown
  27. /usr/bin/oslevel       = unknown
  28. /bin/universe          = unknown
  29.  
  30. PATH: /usr/local/sbin
  31. PATH: /usr/sbin
  32. PATH: /sbin
  33. PATH: /usr/local/bin
  34. PATH: /usr/bin
  35. PATH: /bin
  36. PATH: /usr/games
  37. PATH: /usr/lib/kde4/libexec
  38. PATH: /usr/lib/qt/bin
  39. PATH: /usr/lib/qt/bin
  40. PATH: /usr/share/texmf/bin
  41.  
  42.  
  43. ## ----------- ##
  44. ## Core tests. ##
  45. ## ----------- ##
  46.  
  47. configure:2349: checking build system type
  48. configure:2363: result: i486-slackware-linux-gnu
  49. configure:2383: checking host system type
  50. configure:2396: result: i486-slackware-linux-gnu
  51. configure:2433: checking for a BSD-compatible install
  52. configure:2501: result: /usr/bin/ginstall -c
  53. configure:2512: checking whether build environment is sane
  54. configure:2562: result: yes
  55. configure:2703: checking for a thread-safe mkdir -p
  56. configure:2742: result: /usr/bin/mkdir -p
  57. configure:2755: checking for gawk
  58. configure:2771: found /usr/bin/gawk
  59. configure:2782: result: gawk
  60. configure:2793: checking whether make sets $(MAKE)
  61. configure:2815: result: yes
  62. configure:2906: checking whether make supports nested variables
  63. configure:2923: result: yes
  64. configure:2981: checking how to print strings
  65. configure:3008: result: printf
  66. configure:3041: checking for style of include used by make
  67. configure:3069: result: GNU
  68. configure:3140: checking for gcc
  69. configure:3156: found /usr/bin/gcc
  70. configure:3167: result: gcc
  71. configure:3396: checking for C compiler version
  72. configure:3405: gcc --version >&5
  73. gcc (GCC) 4.7.1
  74. Copyright (C) 2012 Free Software Foundation, Inc.
  75. This is free software; see the source for copying conditions.  There is NO
  76. warranty; not even for MERCHANTABILITY or FITNESS FOR A PARTICULAR PURPOSE.
  77.  
  78. configure:3416: $? = 0
  79. configure:3405: gcc -v >&5
  80. Reading specs from /usr/lib/gcc/i486-slackware-linux/4.7.1/specs
  81. COLLECT_GCC=gcc
  82. COLLECT_LTO_WRAPPER=/usr/libexec/gcc/i486-slackware-linux/4.7.1/lto-wrapper
  83. Target: i486-slackware-linux
  84. Configured with: ../gcc-4.7.1/configure --prefix=/usr --libdir=/usr/lib --mandir=/usr/man --infodir=/usr/info --enable-shared --enable-bootstrap --enable-languages=ada,c,c++,fortran,go,java,lto,objc --enable-threads=posix --enable-checking=release --enable-objc-gc --with-system-zlib --with-python-dir=/lib/python2.7/site-packages --disable-libunwind-exceptions --enable-__cxa_atexit --enable-libssp --enable-lto --with-gnu-ld --verbose --enable-java-home --with-java-home=/usr/lib/jvm/jre --with-jvm-root-dir=/usr/lib/jvm --with-jvm-jar-dir=/usr/lib/jvm/jvm-exports --with-arch-directory=i386 --with-antlr-jar=/root/slackware-current/source/d/gcc/antlr-runtime-3.4.jar --enable-java-awt=gtk --disable-gtktest --with-arch=i486 --target=i486-slackware-linux --build=i486-slackware-linux --host=i486-slackware-linux
  85. Thread model: posix
  86. gcc version 4.7.1 (GCC)
  87. configure:3416: $? = 0
  88. configure:3405: gcc -V >&5
  89. gcc: error: unrecognized command line option '-V'
  90. gcc: fatal error: no input files
  91. compilation terminated.
  92. configure:3416: $? = 1
  93. configure:3405: gcc -qversion >&5
  94. gcc: error: unrecognized command line option '-qversion'
  95. gcc: fatal error: no input files
  96. compilation terminated.
  97. configure:3416: $? = 1
  98. configure:3436: checking whether the C compiler works
  99. configure:3458: gcc -O3 -march=i686 -mtune=native -pipe -fomit-frame-pointer -O3 -march=i686 -mtune=native -pipe -fomit-frame-pointer  conftest.c  >&5
  100. configure:3462: $? = 0
  101. configure:3510: result: yes
  102. configure:3513: checking for C compiler default output file name
  103. configure:3515: result: a.out
  104. configure:3521: checking for suffix of executables
  105. configure:3528: gcc -o conftest -O3 -march=i686 -mtune=native -pipe -fomit-frame-pointer -O3 -march=i686 -mtune=native -pipe -fomit-frame-pointer  conftest.c  >&5
  106. configure:3532: $? = 0
  107. configure:3554: result:
  108. configure:3576: checking whether we are cross compiling
  109. configure:3584: gcc -o conftest -O3 -march=i686 -mtune=native -pipe -fomit-frame-pointer -O3 -march=i686 -mtune=native -pipe -fomit-frame-pointer  conftest.c  >&5
  110. configure:3588: $? = 0
  111. configure:3595: ./conftest
  112. configure:3599: $? = 0
  113. configure:3614: result: no
  114. configure:3619: checking for suffix of object files
  115. configure:3641: gcc -c -O3 -march=i686 -mtune=native -pipe -fomit-frame-pointer -O3 -march=i686 -mtune=native -pipe -fomit-frame-pointer conftest.c >&5
  116. configure:3645: $? = 0
  117. configure:3666: result: o
  118. configure:3670: checking whether we are using the GNU C compiler
  119. configure:3689: gcc -c -O3 -march=i686 -mtune=native -pipe -fomit-frame-pointer -O3 -march=i686 -mtune=native -pipe -fomit-frame-pointer conftest.c >&5
  120. configure:3689: $? = 0
  121. configure:3698: result: yes
  122. configure:3707: checking whether gcc accepts -g
  123. configure:3727: gcc -c -g -O3 -march=i686 -mtune=native -pipe -fomit-frame-pointer conftest.c >&5
  124. configure:3727: $? = 0
  125. configure:3768: result: yes
  126. configure:3785: checking for gcc option to accept ISO C89
  127. configure:3848: gcc  -c -O3 -march=i686 -mtune=native -pipe -fomit-frame-pointer -O3 -march=i686 -mtune=native -pipe -fomit-frame-pointer conftest.c >&5
  128. configure:3848: $? = 0
  129. configure:3861: result: none needed
  130. configure:3883: checking dependency style of gcc
  131. configure:3994: result: gcc3
  132. configure:4009: checking for a sed that does not truncate output
  133. configure:4073: result: /usr/bin/sed
  134. configure:4091: checking for grep that handles long lines and -e
  135. configure:4149: result: /usr/bin/grep
  136. configure:4154: checking for egrep
  137. configure:4216: result: /usr/bin/grep -E
  138. configure:4221: checking for fgrep
  139. configure:4283: result: /usr/bin/grep -F
  140. configure:4318: checking for ld used by gcc
  141. configure:4385: result: /usr/i486-slackware-linux/bin/ld
  142. configure:4392: checking if the linker (/usr/i486-slackware-linux/bin/ld) is GNU ld
  143. configure:4407: result: yes
  144. configure:4419: checking for BSD- or MS-compatible name lister (nm)
  145. configure:4468: result: /usr/bin/nm -B
  146. configure:4598: checking the name lister (/usr/bin/nm -B) interface
  147. configure:4605: gcc -c -O3 -march=i686 -mtune=native -pipe -fomit-frame-pointer -O3 -march=i686 -mtune=native -pipe -fomit-frame-pointer conftest.c >&5
  148. configure:4608: /usr/bin/nm -B "conftest.o"
  149. configure:4611: output
  150. 00000000 B some_variable
  151. configure:4618: result: BSD nm
  152. configure:4621: checking whether ln -s works
  153. configure:4625: result: yes
  154. configure:4633: checking the maximum length of command line arguments
  155. configure:4758: result: 1572864
  156. configure:4775: checking whether the shell understands some XSI constructs
  157. configure:4785: result: yes
  158. configure:4789: checking whether the shell understands "+="
  159. configure:4795: result: yes
  160. configure:4830: checking how to convert i486-slackware-linux-gnu file names to i486-slackware-linux-gnu format
  161. configure:4870: result: func_convert_file_noop
  162. configure:4877: checking how to convert i486-slackware-linux-gnu file names to toolchain format
  163. configure:4897: result: func_convert_file_noop
  164. configure:4904: checking for /usr/i486-slackware-linux/bin/ld option to reload object files
  165. configure:4911: result: -r
  166. configure:4985: checking for objdump
  167. configure:5001: found /usr/bin/objdump
  168. configure:5012: result: objdump
  169. configure:5041: checking how to recognize dependent libraries
  170. configure:5243: result: pass_all
  171. configure:5328: checking for dlltool
  172. configure:5344: found /usr/bin/dlltool
  173. configure:5355: result: dlltool
  174. configure:5385: checking how to associate runtime and link libraries
  175. configure:5412: result: printf %s\n
  176. configure:5473: checking for ar
  177. configure:5489: found /usr/bin/ar
  178. configure:5500: result: ar
  179. configure:5537: checking for archiver @FILE support
  180. configure:5554: gcc -c -O3 -march=i686 -mtune=native -pipe -fomit-frame-pointer -O3 -march=i686 -mtune=native -pipe -fomit-frame-pointer conftest.c >&5
  181. configure:5554: $? = 0
  182. configure:5557: ar cru libconftest.a @conftest.lst >&5
  183. configure:5560: $? = 0
  184. configure:5565: ar cru libconftest.a @conftest.lst >&5
  185. ar: conftest.o: No such file or directory
  186. configure:5568: $? = 1
  187. configure:5580: result: @
  188. configure:5638: checking for strip
  189. configure:5654: found /usr/bin/strip
  190. configure:5665: result: strip
  191. configure:5737: checking for ranlib
  192. configure:5753: found /usr/bin/ranlib
  193. configure:5764: result: ranlib
  194. configure:5866: checking command to parse /usr/bin/nm -B output from gcc object
  195. configure:5985: gcc -c -O3 -march=i686 -mtune=native -pipe -fomit-frame-pointer -O3 -march=i686 -mtune=native -pipe -fomit-frame-pointer conftest.c >&5
  196. configure:5988: $? = 0
  197. configure:5992: /usr/bin/nm -B conftest.o \| sed -n -e 's/^.*[ ]\([ABCDGIRSTW][ABCDGIRSTW]*\)[ ][ ]*\([_A-Za-z][_A-Za-z0-9]*\)$/\1 \2 \2/p' | sed '/ __gnu_lto/d' \> conftest.nm
  198. configure:5995: $? = 0
  199. configure:6061: gcc -o conftest -O3 -march=i686 -mtune=native -pipe -fomit-frame-pointer -O3 -march=i686 -mtune=native -pipe -fomit-frame-pointer  conftest.c conftstm.o >&5
  200. configure:6064: $? = 0
  201. configure:6102: result: ok
  202. configure:6139: checking for sysroot
  203. configure:6169: result: no
  204. configure:6412: checking for mt
  205. configure:6442: result: no
  206. configure:6462: checking if : is a manifest tool
  207. configure:6468: : '-?'
  208. configure:6476: result: no
  209. configure:7108: checking how to run the C preprocessor
  210. configure:7139: gcc -E -O3 -march=i686 -mtune=native -pipe -fomit-frame-pointer conftest.c
  211. configure:7139: $? = 0
  212. configure:7153: gcc -E -O3 -march=i686 -mtune=native -pipe -fomit-frame-pointer conftest.c
  213. conftest.c:11:28: fatal error: ac_nonexistent.h: No such file or directory
  214. compilation terminated.
  215. configure:7153: $? = 1
  216. configure: failed program was:
  217. | /* confdefs.h */
  218. | #define PACKAGE_NAME "eyesight"
  219. | #define PACKAGE_TARNAME "eyesight"
  220. | #define PACKAGE_VERSION "0.0.1"
  221. | #define PACKAGE_STRING "eyesight 0.0.1"
  222. | #define PACKAGE_BUGREPORT "enlightenment-devel@lists.sourceforge.net"
  223. | #define PACKAGE_URL ""
  224. | #define PACKAGE "eyesight"
  225. | #define VERSION "0.0.1"
  226. | /* end confdefs.h.  */
  227. | #include <ac_nonexistent.h>
  228. configure:7178: result: gcc -E
  229. configure:7198: gcc -E -O3 -march=i686 -mtune=native -pipe -fomit-frame-pointer conftest.c
  230. configure:7198: $? = 0
  231. configure:7212: gcc -E -O3 -march=i686 -mtune=native -pipe -fomit-frame-pointer conftest.c
  232. conftest.c:11:28: fatal error: ac_nonexistent.h: No such file or directory
  233. compilation terminated.
  234. configure:7212: $? = 1
  235. configure: failed program was:
  236. | /* confdefs.h */
  237. | #define PACKAGE_NAME "eyesight"
  238. | #define PACKAGE_TARNAME "eyesight"
  239. | #define PACKAGE_VERSION "0.0.1"
  240. | #define PACKAGE_STRING "eyesight 0.0.1"
  241. | #define PACKAGE_BUGREPORT "enlightenment-devel@lists.sourceforge.net"
  242. | #define PACKAGE_URL ""
  243. | #define PACKAGE "eyesight"
  244. | #define VERSION "0.0.1"
  245. | /* end confdefs.h.  */
  246. | #include <ac_nonexistent.h>
  247. configure:7241: checking for ANSI C header files
  248. configure:7261: gcc -c -O3 -march=i686 -mtune=native -pipe -fomit-frame-pointer -O3 -march=i686 -mtune=native -pipe -fomit-frame-pointer conftest.c >&5
  249. configure:7261: $? = 0
  250. configure:7334: gcc -o conftest -O3 -march=i686 -mtune=native -pipe -fomit-frame-pointer -O3 -march=i686 -mtune=native -pipe -fomit-frame-pointer  conftest.c  >&5
  251. configure:7334: $? = 0
  252. configure:7334: ./conftest
  253. configure:7334: $? = 0
  254. configure:7345: result: yes
  255. configure:7358: checking for sys/types.h
  256. configure:7358: gcc -c -O3 -march=i686 -mtune=native -pipe -fomit-frame-pointer -O3 -march=i686 -mtune=native -pipe -fomit-frame-pointer conftest.c >&5
  257. configure:7358: $? = 0
  258. configure:7358: result: yes
  259. configure:7358: checking for sys/stat.h
  260. configure:7358: gcc -c -O3 -march=i686 -mtune=native -pipe -fomit-frame-pointer -O3 -march=i686 -mtune=native -pipe -fomit-frame-pointer conftest.c >&5
  261. configure:7358: $? = 0
  262. configure:7358: result: yes
  263. configure:7358: checking for stdlib.h
  264. configure:7358: gcc -c -O3 -march=i686 -mtune=native -pipe -fomit-frame-pointer -O3 -march=i686 -mtune=native -pipe -fomit-frame-pointer conftest.c >&5
  265. configure:7358: $? = 0
  266. configure:7358: result: yes
  267. configure:7358: checking for string.h
  268. configure:7358: gcc -c -O3 -march=i686 -mtune=native -pipe -fomit-frame-pointer -O3 -march=i686 -mtune=native -pipe -fomit-frame-pointer conftest.c >&5
  269. configure:7358: $? = 0
  270. configure:7358: result: yes
  271. configure:7358: checking for memory.h
  272. configure:7358: gcc -c -O3 -march=i686 -mtune=native -pipe -fomit-frame-pointer -O3 -march=i686 -mtune=native -pipe -fomit-frame-pointer conftest.c >&5
  273. configure:7358: $? = 0
  274. configure:7358: result: yes
  275. configure:7358: checking for strings.h
  276. configure:7358: gcc -c -O3 -march=i686 -mtune=native -pipe -fomit-frame-pointer -O3 -march=i686 -mtune=native -pipe -fomit-frame-pointer conftest.c >&5
  277. configure:7358: $? = 0
  278. configure:7358: result: yes
  279. configure:7358: checking for inttypes.h
  280. configure:7358: gcc -c -O3 -march=i686 -mtune=native -pipe -fomit-frame-pointer -O3 -march=i686 -mtune=native -pipe -fomit-frame-pointer conftest.c >&5
  281. configure:7358: $? = 0
  282. configure:7358: result: yes
  283. configure:7358: checking for stdint.h
  284. configure:7358: gcc -c -O3 -march=i686 -mtune=native -pipe -fomit-frame-pointer -O3 -march=i686 -mtune=native -pipe -fomit-frame-pointer conftest.c >&5
  285. configure:7358: $? = 0
  286. configure:7358: result: yes
  287. configure:7358: checking for unistd.h
  288. configure:7358: gcc -c -O3 -march=i686 -mtune=native -pipe -fomit-frame-pointer -O3 -march=i686 -mtune=native -pipe -fomit-frame-pointer conftest.c >&5
  289. configure:7358: $? = 0
  290. configure:7358: result: yes
  291. configure:7372: checking for dlfcn.h
  292. configure:7372: gcc -c -O3 -march=i686 -mtune=native -pipe -fomit-frame-pointer -O3 -march=i686 -mtune=native -pipe -fomit-frame-pointer conftest.c >&5
  293. configure:7372: $? = 0
  294. configure:7372: result: yes
  295. configure:7857: checking for objdir
  296. configure:7872: result: .libs
  297. configure:8143: checking if gcc supports -fno-rtti -fno-exceptions
  298. configure:8161: gcc -c -O3 -march=i686 -mtune=native -pipe -fomit-frame-pointer -O3 -march=i686 -mtune=native -pipe -fomit-frame-pointer -fno-rtti -fno-exceptions conftest.c >&5
  299. cc1: warning: command line option '-fno-rtti' is valid for C++/ObjC++ but not for C [enabled by default]
  300. configure:8165: $? = 0
  301. configure:8178: result: no
  302. configure:8488: checking for gcc option to produce PIC
  303. configure:8495: result: -fPIC -DPIC
  304. configure:8503: checking if gcc PIC flag -fPIC -DPIC works
  305. configure:8521: gcc -c -O3 -march=i686 -mtune=native -pipe -fomit-frame-pointer -O3 -march=i686 -mtune=native -pipe -fomit-frame-pointer -fPIC -DPIC -DPIC conftest.c >&5
  306. configure:8525: $? = 0
  307. configure:8538: result: yes
  308. configure:8567: checking if gcc static flag -static works
  309. configure:8595: result: yes
  310. configure:8610: checking if gcc supports -c -o file.o
  311. configure:8631: gcc -c -O3 -march=i686 -mtune=native -pipe -fomit-frame-pointer -O3 -march=i686 -mtune=native -pipe -fomit-frame-pointer -o out/conftest2.o conftest.c >&5
  312. configure:8635: $? = 0
  313. configure:8657: result: yes
  314. configure:8665: checking if gcc supports -c -o file.o
  315. configure:8712: result: yes
  316. configure:8745: checking whether the gcc linker (/usr/i486-slackware-linux/bin/ld) supports shared libraries
  317. configure:9903: result: yes
  318. configure:9940: checking whether -lc should be explicitly linked in
  319. configure:9948: gcc -c -O3 -march=i686 -mtune=native -pipe -fomit-frame-pointer -O3 -march=i686 -mtune=native -pipe -fomit-frame-pointer conftest.c >&5
  320. configure:9951: $? = 0
  321. configure:9966: gcc -shared  -fPIC -DPIC conftest.o  -v -Wl,-soname -Wl,conftest -o conftest 2\>\&1 \| /usr/bin/grep  -lc  \>/dev/null 2\>\&1
  322. configure:9969: $? = 0
  323. configure:9983: result: no
  324. configure:10148: checking dynamic linker characteristics
  325. configure:10662: gcc -o conftest -O3 -march=i686 -mtune=native -pipe -fomit-frame-pointer -O3 -march=i686 -mtune=native -pipe -fomit-frame-pointer  -Wl,-rpath -Wl,/foo conftest.c  >&5
  326. configure:10662: $? = 0
  327. configure:10884: result: GNU/Linux ld.so
  328. configure:10991: checking how to hardcode library paths into programs
  329. configure:11016: result: immediate
  330. configure:11556: checking whether stripping libraries is possible
  331. configure:11561: result: yes
  332. configure:11596: checking if libtool supports shared libraries
  333. configure:11598: result: yes
  334. configure:11601: checking whether to build shared libraries
  335. configure:11622: result: yes
  336. configure:11625: checking whether to build static libraries
  337. configure:11629: result: no
  338. configure:11693: checking whether mupdf CJK fonts are enabled
  339. configure:11695: result:
  340. configure:11700: checking for gcc option to accept ISO C99
  341. configure:11849: gcc  -c -O3 -march=i686 -mtune=native -pipe -fomit-frame-pointer -O3 -march=i686 -mtune=native -pipe -fomit-frame-pointer conftest.c >&5
  342. conftest.c:73:29: error: expected ';', ',' or ')' before 'text'
  343. conftest.c: In function 'main':
  344. conftest.c:127:18: error: expected '=', ',', ';', 'asm' or '__attribute__' before 'newvar'
  345. conftest.c:127:18: error: 'newvar' undeclared (first use in this function)
  346. conftest.c:127:18: note: each undeclared identifier is reported only once for each function it appears in
  347. conftest.c:137:3: error: 'for' loop initial declarations are only allowed in C99 mode
  348. conftest.c:137:3: note: use option -std=c99 or -std=gnu99 to compile your code
  349. configure:11849: $? = 1
  350. configure: failed program was:
  351. | /* confdefs.h */
  352. | #define PACKAGE_NAME "eyesight"
  353. | #define PACKAGE_TARNAME "eyesight"
  354. | #define PACKAGE_VERSION "0.0.1"
  355. | #define PACKAGE_STRING "eyesight 0.0.1"
  356. | #define PACKAGE_BUGREPORT "enlightenment-devel@lists.sourceforge.net"
  357. | #define PACKAGE_URL ""
  358. | #define PACKAGE "eyesight"
  359. | #define VERSION "0.0.1"
  360. | #define STDC_HEADERS 1
  361. | #define HAVE_SYS_TYPES_H 1
  362. | #define HAVE_SYS_STAT_H 1
  363. | #define HAVE_STDLIB_H 1
  364. | #define HAVE_STRING_H 1
  365. | #define HAVE_MEMORY_H 1
  366. | #define HAVE_STRINGS_H 1
  367. | #define HAVE_INTTYPES_H 1
  368. | #define HAVE_STDINT_H 1
  369. | #define HAVE_UNISTD_H 1
  370. | #define HAVE_DLFCN_H 1
  371. | #define LT_OBJDIR ".libs/"
  372. | /* end confdefs.h.  */
  373. | #include <stdarg.h>
  374. | #include <stdbool.h>
  375. | #include <stdlib.h>
  376. | #include <wchar.h>
  377. | #include <stdio.h>
  378. |
  379. | // Check varargs macros.  These examples are taken from C99 6.10.3.5.
  380. | #define debug(...) fprintf (stderr, __VA_ARGS__)
  381. | #define showlist(...) puts (#__VA_ARGS__)
  382. | #define report(test,...) ((test) ? puts (#test) : printf (__VA_ARGS__))
  383. | static void
  384. | test_varargs_macros (void)
  385. | {
  386. |   int x = 1234;
  387. |   int y = 5678;
  388. |   debug ("Flag");
  389. |   debug ("X = %d\n", x);
  390. |   showlist (The first, second, and third items.);
  391. |   report (x>y, "x is %d but y is %d", x, y);
  392. | }
  393. |
  394. | // Check long long types.
  395. | #define BIG64 18446744073709551615ull
  396. | #define BIG32 4294967295ul
  397. | #define BIG_OK (BIG64 / BIG32 == 4294967297ull && BIG64 % BIG32 == 0)
  398. | #if !BIG_OK
  399. |   your preprocessor is broken;
  400. | #endif
  401. | #if BIG_OK
  402. | #else
  403. |   your preprocessor is broken;
  404. | #endif
  405. | static long long int bignum = -9223372036854775807LL;
  406. | static unsigned long long int ubignum = BIG64;
  407. |
  408. | struct incomplete_array
  409. | {
  410. |   int datasize;
  411. |   double data[];
  412. | };
  413. |
  414. | struct named_init {
  415. |   int number;
  416. |   const wchar_t *name;
  417. |   double average;
  418. | };
  419. |
  420. | typedef const char *ccp;
  421. |
  422. | static inline int
  423. | test_restrict (ccp restrict text)
  424. | {
  425. |   // See if C++-style comments work.
  426. |   // Iterate through items via the restricted pointer.
  427. |   // Also check for declarations in for loops.
  428. |   for (unsigned int i = 0; *(text+i) != '\0'; ++i)
  429. |     continue;
  430. |   return 0;
  431. | }
  432. |
  433. | // Check varargs and va_copy.
  434. | static void
  435. | test_varargs (const char *format, ...)
  436. | {
  437. |   va_list args;
  438. |   va_start (args, format);
  439. |   va_list args_copy;
  440. |   va_copy (args_copy, args);
  441. |
  442. |   const char *str;
  443. |   int number;
  444. |   float fnumber;
  445. |
  446. |   while (*format)
  447. |     {
  448. |       switch (*format++)
  449. |       {
  450. |       case 's': // string
  451. |         str = va_arg (args_copy, const char *);
  452. |         break;
  453. |       case 'd': // int
  454. |         number = va_arg (args_copy, int);
  455. |         break;
  456. |       case 'f': // float
  457. |         fnumber = va_arg (args_copy, double);
  458. |         break;
  459. |       default:
  460. |         break;
  461. |       }
  462. |     }
  463. |   va_end (args_copy);
  464. |   va_end (args);
  465. | }
  466. |
  467. | int
  468. | main ()
  469. | {
  470. |
  471. |   // Check bool.
  472. |   _Bool success = false;
  473. |
  474. |   // Check restrict.
  475. |   if (test_restrict ("String literal") == 0)
  476. |     success = true;
  477. |   char *restrict newvar = "Another string";
  478. |
  479. |   // Check varargs.
  480. |   test_varargs ("s, d' f .", "string", 65, 34.234);
  481. |   test_varargs_macros ();
  482. |
  483. |   // Check flexible array members.
  484. |   struct incomplete_array *ia =
  485. |     malloc (sizeof (struct incomplete_array) + (sizeof (double) * 10));
  486. |   ia->datasize = 10;
  487. |   for (int i = 0; i < ia->datasize; ++i)
  488. |     ia->data[i] = i * 1.234;
  489. |
  490. |   // Check named initializers.
  491. |   struct named_init ni = {
  492. |     .number = 34,
  493. |     .name = L"Test wide string",
  494. |     .average = 543.34343,
  495. |   };
  496. |
  497. |   ni.number = 58;
  498. |
  499. |   int dynamic_array[ni.number];
  500. |   dynamic_array[ni.number - 1] = 543;
  501. |
  502. |   // work around unused variable warnings
  503. |   return (!success || bignum == 0LL || ubignum == 0uLL || newvar[0] == 'x'
  504. |         || dynamic_array[ni.number - 1] != 543);
  505. |
  506. |   ;
  507. |   return 0;
  508. | }
  509. configure:11849: gcc -std=gnu99 -c -O3 -march=i686 -mtune=native -pipe -fomit-frame-pointer -O3 -march=i686 -mtune=native -pipe -fomit-frame-pointer conftest.c >&5
  510. configure:11849: $? = 0
  511. configure:11869: result: -std=gnu99
  512. configure:11932: checking for pkg-config
  513. configure:11950: found /usr/bin/pkg-config
  514. configure:11962: result: /usr/bin/pkg-config
  515. configure:11987: checking pkg-config is at least version 0.9.0
  516. configure:11990: result: yes
  517. configure:12025: checking whether to build eyesight binary
  518. configure:12027: result: yes
  519. configure:12064: edje_cc set to /usr/bin/edje_cc
  520. configure:12091: checking whether to build documentation
  521. configure:12093: result: yes
  522. configure:12157: checking for doxygen
  523. configure:12185: result: no
  524. configure:12202: WARNING: no doxygen detected. Documentation will not be built
  525. configure:12279: $PKG_CONFIG --exists --print-errors "zlib >= 1.2.5"
  526. configure:12282: $? = 0
  527. configure:12355: $PKG_CONFIG --exists --print-errors "freetype2"
  528. configure:12358: $? = 0
  529. configure:12368: $PKG_CONFIG --exists --print-errors "libopenjpeg1 >= 1.4"
  530. Package libopenjpeg1 was not found in the pkg-config search path.
  531. Perhaps you should add the directory containing `libopenjpeg1.pc'
  532. to the PKG_CONFIG_PATH environment variable
  533. No package 'libopenjpeg1' found
  534. configure:12371: $? = 1
  535. configure:12383: $PKG_CONFIG --exists --print-errors "libopenjpeg >= 1.4"
  536. Package libopenjpeg was not found in the pkg-config search path.
  537. Perhaps you should add the directory containing `libopenjpeg.pc'
  538. to the PKG_CONFIG_PATH environment variable
  539. No package 'libopenjpeg' found
  540. configure:12386: $? = 1
  541. configure:12398: no pkg-config file for openjpeg, checking files individually
  542. configure:12400: checking openjpeg.h usability
  543. configure:12400: gcc -std=gnu99 -c -O3 -march=i686 -mtune=native -pipe -fomit-frame-pointer -O3 -march=i686 -mtune=native -pipe -fomit-frame-pointer conftest.c >&5
  544. conftest.c:56:22: fatal error: openjpeg.h: No such file or directory
  545. compilation terminated.
  546. configure:12400: $? = 1
  547. configure: failed program was:
  548. | /* confdefs.h */
  549. | #define PACKAGE_NAME "eyesight"
  550. | #define PACKAGE_TARNAME "eyesight"
  551. | #define PACKAGE_VERSION "0.0.1"
  552. | #define PACKAGE_STRING "eyesight 0.0.1"
  553. | #define PACKAGE_BUGREPORT "enlightenment-devel@lists.sourceforge.net"
  554. | #define PACKAGE_URL ""
  555. | #define PACKAGE "eyesight"
  556. | #define VERSION "0.0.1"
  557. | #define STDC_HEADERS 1
  558. | #define HAVE_SYS_TYPES_H 1
  559. | #define HAVE_SYS_STAT_H 1
  560. | #define HAVE_STDLIB_H 1
  561. | #define HAVE_STRING_H 1
  562. | #define HAVE_MEMORY_H 1
  563. | #define HAVE_STRINGS_H 1
  564. | #define HAVE_INTTYPES_H 1
  565. | #define HAVE_STDINT_H 1
  566. | #define HAVE_UNISTD_H 1
  567. | #define HAVE_DLFCN_H 1
  568. | #define LT_OBJDIR ".libs/"
  569. | /* end confdefs.h.  */
  570. | #include <stdio.h>
  571. | #ifdef HAVE_SYS_TYPES_H
  572. | # include <sys/types.h>
  573. | #endif
  574. | #ifdef HAVE_SYS_STAT_H
  575. | # include <sys/stat.h>
  576. | #endif
  577. | #ifdef STDC_HEADERS
  578. | # include <stdlib.h>
  579. | # include <stddef.h>
  580. | #else
  581. | # ifdef HAVE_STDLIB_H
  582. | #  include <stdlib.h>
  583. | # endif
  584. | #endif
  585. | #ifdef HAVE_STRING_H
  586. | # if !defined STDC_HEADERS && defined HAVE_MEMORY_H
  587. | #  include <memory.h>
  588. | # endif
  589. | # include <string.h>
  590. | #endif
  591. | #ifdef HAVE_STRINGS_H
  592. | # include <strings.h>
  593. | #endif
  594. | #ifdef HAVE_INTTYPES_H
  595. | # include <inttypes.h>
  596. | #endif
  597. | #ifdef HAVE_STDINT_H
  598. | # include <stdint.h>
  599. | #endif
  600. | #ifdef HAVE_UNISTD_H
  601. | # include <unistd.h>
  602. | #endif
  603. | #include <openjpeg.h>
  604. configure:12400: result: no
  605. configure:12400: checking openjpeg.h presence
  606. configure:12400: gcc -E -O3 -march=i686 -mtune=native -pipe -fomit-frame-pointer conftest.c
  607. conftest.c:23:22: fatal error: openjpeg.h: No such file or directory
  608. compilation terminated.
  609. configure:12400: $? = 1
  610. configure: failed program was:
  611. | /* confdefs.h */
  612. | #define PACKAGE_NAME "eyesight"
  613. | #define PACKAGE_TARNAME "eyesight"
  614. | #define PACKAGE_VERSION "0.0.1"
  615. | #define PACKAGE_STRING "eyesight 0.0.1"
  616. | #define PACKAGE_BUGREPORT "enlightenment-devel@lists.sourceforge.net"
  617. | #define PACKAGE_URL ""
  618. | #define PACKAGE "eyesight"
  619. | #define VERSION "0.0.1"
  620. | #define STDC_HEADERS 1
  621. | #define HAVE_SYS_TYPES_H 1
  622. | #define HAVE_SYS_STAT_H 1
  623. | #define HAVE_STDLIB_H 1
  624. | #define HAVE_STRING_H 1
  625. | #define HAVE_MEMORY_H 1
  626. | #define HAVE_STRINGS_H 1
  627. | #define HAVE_INTTYPES_H 1
  628. | #define HAVE_STDINT_H 1
  629. | #define HAVE_UNISTD_H 1
  630. | #define HAVE_DLFCN_H 1
  631. | #define LT_OBJDIR ".libs/"
  632. | /* end confdefs.h.  */
  633. | #include <openjpeg.h>
  634. configure:12400: result: no
  635. configure:12400: checking for openjpeg.h
  636. configure:12400: result: no
  637. configure:12518: checking for MUPDF
  638. configure:12525: $PKG_CONFIG --exists --print-errors "${requirements_pc}"
  639. configure:12528: $? = 0
  640. configure:12541: $PKG_CONFIG --exists --print-errors "${requirements_pc}"
  641. configure:12544: $? = 0
  642. configure:12581: result: yes
  643. configure:12622: checking whether to enable PDF module built
  644. configure:12624: result: yes
  645. configure:12705: checking for POSTSCRIPT
  646. configure:12712: $PKG_CONFIG --exists --print-errors "libspectre"
  647. configure:12715: $? = 0
  648. configure:12728: $PKG_CONFIG --exists --print-errors "libspectre"
  649. configure:12731: $? = 0
  650. configure:12768: result: yes
  651. configure:12789: checking whether to enable Postscript module built
  652. configure:12791: result: yes
  653. configure:12878: checking whether to enable Txt module built
  654. configure:12880: result: yes
  655. configure:12961: checking for ECORE_FILE
  656. configure:12968: $PKG_CONFIG --exists --print-errors "ecore-file"
  657. configure:12971: $? = 0
  658. configure:12984: $PKG_CONFIG --exists --print-errors "ecore-file"
  659. configure:12987: $? = 0
  660. configure:13024: result: yes
  661. configure:13046: checking whether to enable Img module built
  662. configure:13048: result: yes
  663. configure:13098: checking for EYESIGHT
  664. configure:13105: $PKG_CONFIG --exists --print-errors "${requirements_pc_eyesight}"
  665. configure:13108: $? = 0
  666. configure:13121: $PKG_CONFIG --exists --print-errors "${requirements_pc_eyesight}"
  667. configure:13124: $? = 0
  668. configure:13181: result: yes
  669. configure:13189: checking for EYESIGHT_BIN
  670. configure:13196: $PKG_CONFIG --exists --print-errors "elementary >= 1.0.0 efreet >= 1.0.0 edbus >= 1.0.0 ecore-input >= 1.2.0"
  671. configure:13199: $? = 0
  672. configure:13212: $PKG_CONFIG --exists --print-errors "elementary >= 1.0.0 efreet >= 1.0.0 edbus >= 1.0.0 ecore-input >= 1.2.0"
  673. configure:13215: $? = 0
  674. configure:13252: result: yes
  675. configure:13270: checking whether gcc -std=gnu99 and cc understand -c and -o together
  676. configure:13301: gcc -std=gnu99 -c conftest.c -o conftest2.o >&5
  677. configure:13305: $? = 0
  678. configure:13311: gcc -std=gnu99 -c conftest.c -o conftest2.o >&5
  679. configure:13315: $? = 0
  680. configure:13326: cc -c conftest.c >&5
  681. configure:13330: $? = 0
  682. configure:13338: cc -c conftest.c -o conftest2.o >&5
  683. configure:13342: $? = 0
  684. configure:13348: cc -c conftest.c -o conftest2.o >&5
  685. configure:13352: $? = 0
  686. configure:13370: result: yes
  687. configure:13396: checking for __attribute__ ((unused))
  688. configure:13412: gcc -std=gnu99 -c -O3 -march=i686 -mtune=native -pipe -fomit-frame-pointer -O3 -march=i686 -mtune=native -pipe -fomit-frame-pointer conftest.c >&5
  689. configure:13412: $? = 0
  690. configure:13418: result: yes
  691. configure:13456: checking whether the compiler supports -Wall
  692. configure:13470: gcc -std=gnu99 -c -O3 -march=i686 -mtune=native -pipe -fomit-frame-pointer -Wall -O3 -march=i686 -mtune=native -pipe -fomit-frame-pointer conftest.c >&5
  693. configure:13470: $? = 0
  694. configure:13476: result: yes
  695. configure:13519: checking whether the compiler supports -Wextra
  696. configure:13533: gcc -std=gnu99 -c -O3 -march=i686 -mtune=native -pipe -fomit-frame-pointer -Wextra -O3 -march=i686 -mtune=native -pipe -fomit-frame-pointer conftest.c >&5
  697. configure:13533: $? = 0
  698. configure:13539: result: yes
  699. configure:13582: checking whether the compiler supports -Wshadow
  700. configure:13596: gcc -std=gnu99 -c -O3 -march=i686 -mtune=native -pipe -fomit-frame-pointer -Wshadow -O3 -march=i686 -mtune=native -pipe -fomit-frame-pointer conftest.c >&5
  701. configure:13596: $? = 0
  702. configure:13602: result: yes
  703. configure:13842: creating ./config.status
  704.  
  705. ## ---------------------- ##
  706. ## Running config.status. ##
  707. ## ---------------------- ##
  708.  
  709. This file was extended by eyesight config.status 0.0.1, which was
  710. generated by GNU Autoconf 2.69.  Invocation command line was
  711.  
  712.   CONFIG_FILES    =
  713.   CONFIG_HEADERS  =
  714.   CONFIG_LINKS    =
  715.   CONFIG_COMMANDS =
  716.   $ ./config.status
  717.  
  718. on garik
  719.  
  720. config.status:1158: creating Makefile
  721. config.status:1158: creating eyesight.pc
  722. config.status:1158: creating src/Makefile
  723. config.status:1158: creating eyesight.spec
  724. config.status:1158: creating src/bin/Makefile
  725. config.status:1158: creating src/lib/Makefile
  726. config.status:1158: creating src/modules/Makefile
  727. config.status:1158: creating src/modules/img/Makefile
  728. config.status:1158: creating src/modules/pdf/Makefile
  729. config.status:1158: creating src/modules/pdf/mupdf-1.1/Makefile
  730. config.status:1158: creating src/modules/ps/Makefile
  731. config.status:1158: creating src/modules/txt/Makefile
  732. config.status:1158: creating data/Makefile
  733. config.status:1158: creating config.h
  734. config.status:1339: config.h is unchanged
  735. config.status:1387: executing depfiles commands
  736. config.status:1387: executing libtool commands
  737.  
  738. ## ---------------- ##
  739. ## Cache variables. ##
  740. ## ---------------- ##
  741.  
  742. ac_cv_build=i486-slackware-linux-gnu
  743. ac_cv_c_compiler_gnu=yes
  744. ac_cv_env_CC_set=
  745. ac_cv_env_CC_value=
  746. ac_cv_env_CFLAGS_set=set
  747. ac_cv_env_CFLAGS_value='-O3 -march=i686 -mtune=native -pipe -fomit-frame-pointer'
  748. ac_cv_env_CPPFLAGS_set=set
  749. ac_cv_env_CPPFLAGS_value='-O3 -march=i686 -mtune=native -pipe -fomit-frame-pointer'
  750. ac_cv_env_CPP_set=
  751. ac_cv_env_CPP_value=
  752. ac_cv_env_ECORE_FILE_CFLAGS_set=
  753. ac_cv_env_ECORE_FILE_CFLAGS_value=
  754. ac_cv_env_ECORE_FILE_LIBS_set=
  755. ac_cv_env_ECORE_FILE_LIBS_value=
  756. ac_cv_env_EYESIGHT_BIN_CFLAGS_set=
  757. ac_cv_env_EYESIGHT_BIN_CFLAGS_value=
  758. ac_cv_env_EYESIGHT_BIN_LIBS_set=
  759. ac_cv_env_EYESIGHT_BIN_LIBS_value=
  760. ac_cv_env_EYESIGHT_CFLAGS_set=
  761. ac_cv_env_EYESIGHT_CFLAGS_value=
  762. ac_cv_env_EYESIGHT_LIBS_set=
  763. ac_cv_env_EYESIGHT_LIBS_value=
  764. ac_cv_env_LDFLAGS_set=
  765. ac_cv_env_LDFLAGS_value=
  766. ac_cv_env_LIBS_set=
  767. ac_cv_env_LIBS_value=
  768. ac_cv_env_MUPDF_CFLAGS_set=
  769. ac_cv_env_MUPDF_CFLAGS_value=
  770. ac_cv_env_MUPDF_LIBS_set=
  771. ac_cv_env_MUPDF_LIBS_value=
  772. ac_cv_env_PKG_CONFIG_LIBDIR_set=
  773. ac_cv_env_PKG_CONFIG_LIBDIR_value=
  774. ac_cv_env_PKG_CONFIG_PATH_set=set
  775. ac_cv_env_PKG_CONFIG_PATH_value=/usr/local/lib/pkgconfig:/usr/lib/pkgconfig
  776. ac_cv_env_PKG_CONFIG_set=
  777. ac_cv_env_PKG_CONFIG_value=
  778. ac_cv_env_POSTSCRIPT_CFLAGS_set=
  779. ac_cv_env_POSTSCRIPT_CFLAGS_value=
  780. ac_cv_env_POSTSCRIPT_LIBS_set=
  781. ac_cv_env_POSTSCRIPT_LIBS_value=
  782. ac_cv_env_build_alias_set=set
  783. ac_cv_env_build_alias_value=i486-slackware-linux
  784. ac_cv_env_host_alias_set=
  785. ac_cv_env_host_alias_value=
  786. ac_cv_env_target_alias_set=
  787. ac_cv_env_target_alias_value=
  788. ac_cv_header_dlfcn_h=yes
  789. ac_cv_header_inttypes_h=yes
  790. ac_cv_header_memory_h=yes
  791. ac_cv_header_openjpeg_h=no
  792. ac_cv_header_stdc=yes
  793. ac_cv_header_stdint_h=yes
  794. ac_cv_header_stdlib_h=yes
  795. ac_cv_header_string_h=yes
  796. ac_cv_header_strings_h=yes
  797. ac_cv_header_sys_stat_h=yes
  798. ac_cv_header_sys_types_h=yes
  799. ac_cv_header_unistd_h=yes
  800. ac_cv_host=i486-slackware-linux-gnu
  801. ac_cv_objext=o
  802. ac_cv_path_EGREP='/usr/bin/grep -E'
  803. ac_cv_path_FGREP='/usr/bin/grep -F'
  804. ac_cv_path_GREP=/usr/bin/grep
  805. ac_cv_path_SED=/usr/bin/sed
  806. ac_cv_path_ac_pt_PKG_CONFIG=/usr/bin/pkg-config
  807. ac_cv_path_install='/usr/bin/ginstall -c'
  808. ac_cv_path_mkdir=/usr/bin/mkdir
  809. ac_cv_prog_AWK=gawk
  810. ac_cv_prog_CPP='gcc -E'
  811. ac_cv_prog_ac_ct_AR=ar
  812. ac_cv_prog_ac_ct_CC=gcc
  813. ac_cv_prog_ac_ct_DLLTOOL=dlltool
  814. ac_cv_prog_ac_ct_OBJDUMP=objdump
  815. ac_cv_prog_ac_ct_RANLIB=ranlib
  816. ac_cv_prog_ac_ct_STRIP=strip
  817. ac_cv_prog_cc_c89=
  818. ac_cv_prog_cc_c99=-std=gnu99
  819. ac_cv_prog_cc_g=yes
  820. ac_cv_prog_cc_gcc_c_o=yes
  821. ac_cv_prog_efl_have_doxygen=no
  822. ac_cv_prog_make_make_set=yes
  823. am_cv_CC_dependencies_compiler_type=gcc3
  824. am_cv_make_support_nested_variables=yes
  825. lt_cv_ar_at_file=@
  826. lt_cv_archive_cmds_need_lc=no
  827. lt_cv_deplibs_check_method=pass_all
  828. lt_cv_file_magic_cmd='$MAGIC_CMD'
  829. lt_cv_file_magic_test_file=
  830. lt_cv_ld_reload_flag=-r
  831. lt_cv_nm_interface='BSD nm'
  832. lt_cv_objdir=.libs
  833. lt_cv_path_LD=/usr/i486-slackware-linux/bin/ld
  834. lt_cv_path_NM='/usr/bin/nm -B'
  835. lt_cv_path_mainfest_tool=no
  836. lt_cv_prog_compiler_c_o=yes
  837. lt_cv_prog_compiler_pic='-fPIC -DPIC'
  838. lt_cv_prog_compiler_pic_works=yes
  839. lt_cv_prog_compiler_rtti_exceptions=no
  840. lt_cv_prog_compiler_static_works=yes
  841. lt_cv_prog_gnu_ld=yes
  842. lt_cv_sharedlib_from_linklib_cmd='printf %s\n'
  843. lt_cv_shlibpath_overrides_runpath=no
  844. lt_cv_sys_global_symbol_pipe='sed -n -e '\''s/^.*[       ]\([ABCDGIRSTW][ABCDGIRSTW]*\)[         ][      ]*\([_A-Za-z][_A-Za-z0-9]*\)$/\1 \2 \2/p'\'' | sed '\''/ __gnu_lto/d'\'''
  845. lt_cv_sys_global_symbol_to_c_name_address='sed -n -e '\''s/^: \([^ ]*\)[ ]*$/  {\"\1\", (void *) 0},/p'\'' -e '\''s/^[ABCDGIRSTW]* \([^ ]*\) \([^ ]*\)$/  {"\2", (void *) \&\2},/p'\'''
  846. lt_cv_sys_global_symbol_to_c_name_address_lib_prefix='sed -n -e '\''s/^: \([^ ]*\)[ ]*$/  {\"\1\", (void *) 0},/p'\'' -e '\''s/^[ABCDGIRSTW]* \([^ ]*\) \(lib[^ ]*\)$/  {"\2", (void *) \&\2},/p'\'' -e '\''s/^[ABCDGIRSTW]* \([^ ]*\) \([^ ]*\)$/  {"lib\2", (void *) \&\2},/p'\'''
  847. lt_cv_sys_global_symbol_to_cdecl='sed -n -e '\''s/^T .* \(.*\)$/extern int \1();/p'\'' -e '\''s/^[ABCDGIRSTW]* .* \(.*\)$/extern char \1;/p'\'''
  848. lt_cv_sys_max_cmd_len=1572864
  849. lt_cv_to_host_file_cmd=func_convert_file_noop
  850. lt_cv_to_tool_file_cmd=func_convert_file_noop
  851. pkg_cv_ECORE_FILE_CFLAGS='-I/usr/include/ecore-1 -I/usr/include/eina-1 -I/usr/include/eina-1/eina -I/usr/include/p11-kit-1 -I/usr/include/glib-2.0 -I/usr/lib/glib-2.0/include -I/usr/include/valgrind  '
  852. pkg_cv_ECORE_FILE_LIBS='-lecore_file  '
  853. pkg_cv_EYESIGHT_BIN_CFLAGS='-I/usr/include/elementary-1 -I/usr/include/ethumb-1 -I/usr/include/efreet-1 -I/usr/include/e_dbus-1 -I/usr/include/ecore-1 -I/usr/include/emotion-1 -I/usr/include/eio-1 -I/usr/include/edje-1 -I/usr/include/evas-1 -I/usr/include/eet-1 -I/usr/include/eina-1 -I/usr/include/eina-1/eina -I/usr/include/valgrind -I/usr/include/glib-2.0 -I/usr/lib/glib-2.0/include -I/usr/include/p11-kit-1 -I/usr/include/fribidi -I/usr/include/freetype2 -I/usr/include/embryo-1 -I/usr/include/dbus-1.0 -I/usr/lib/dbus-1.0/include -I/usr/include/eeze-1  '
  854. pkg_cv_EYESIGHT_BIN_LIBS='-pthread -lelementary -lm -leet -levas -lecore -leina -lecore_evas -lecore_file -ledje -lefreet_mime -lefreet_trash -lethumb_client -lemap -lecore_imf -lecore_con -lefreet -ledbus -ldbus-1 -lpthread -lrt -lecore_input  '
  855. pkg_cv_EYESIGHT_CFLAGS='-I/usr/include/eina-1 -I/usr/include/eina-1/eina -I/usr/include/valgrind -I/usr/include/evas-1 -I/usr/include/eet-1 -I/usr/include/fribidi -I/usr/include/freetype2 -I/usr/include/p11-kit-1 -I/usr/include/efreet-1 -I/usr/include/ecore-1 -I/usr/include/glib-2.0 -I/usr/lib/glib-2.0/include  '
  856. pkg_cv_EYESIGHT_LIBS='-pthread -levas -leina -lrt -lefreet_mime  '
  857. pkg_cv_MUPDF_CFLAGS='-I/usr/include/freetype2  '
  858. pkg_cv_MUPDF_LIBS='-lfreetype -lz  '
  859. pkg_cv_POSTSCRIPT_CFLAGS=' '
  860. pkg_cv_POSTSCRIPT_LIBS='-lspectre  '
  861.  
  862. ## ----------------- ##
  863. ## Output variables. ##
  864. ## ----------------- ##
  865.  
  866. ACLOCAL='${SHELL} /tmp/tgz/e17/eyesight/missing --run aclocal-1.11'
  867. AMDEPBACKSLASH='\'
  868. AMDEP_FALSE='#'
  869. AMDEP_TRUE=''
  870. AMTAR='$${TAR-tar}'
  871. AM_BACKSLASH='\'
  872. AM_DEFAULT_V='$(AM_DEFAULT_VERBOSITY)'
  873. AM_DEFAULT_VERBOSITY='0'
  874. AM_V='$(V)'
  875. AR='ar'
  876. AS='as'
  877. AUTOCONF='${SHELL} /tmp/tgz/e17/eyesight/missing --run autoconf'
  878. AUTOHEADER='${SHELL} /tmp/tgz/e17/eyesight/missing --run autoheader'
  879. AUTOMAKE='${SHELL} /tmp/tgz/e17/eyesight/missing --run automake-1.11'
  880. AWK='gawk'
  881. BUILD_EYESIGHT_FALSE='#'
  882. BUILD_EYESIGHT_TRUE=''
  883. BUILD_MUPDF_CJK_FONTS='-DNOCJK'
  884. BUILD_MUPDF_CJK_FONTS_FALSE=''
  885. BUILD_MUPDF_CJK_FONTS_TRUE='#'
  886. CC='gcc -std=gnu99'
  887. CCDEPMODE='depmode=gcc3'
  888. CFLAGS='-O3 -march=i686 -mtune=native -pipe -fomit-frame-pointer'
  889. CPP='gcc -E'
  890. CPPFLAGS='-O3 -march=i686 -mtune=native -pipe -fomit-frame-pointer'
  891. CYGPATH_W='echo'
  892. DEFS='-DHAVE_CONFIG_H'
  893. DEPDIR='.deps'
  894. DLLTOOL='dlltool'
  895. DSYMUTIL=''
  896. DUMPBIN=''
  897. ECHO_C=''
  898. ECHO_N='-n'
  899. ECHO_T=''
  900. ECORE_FILE_CFLAGS='-I/usr/include/ecore-1 -I/usr/include/eina-1 -I/usr/include/eina-1/eina -I/usr/include/p11-kit-1 -I/usr/include/glib-2.0 -I/usr/lib/glib-2.0/include -I/usr/include/valgrind  '
  901. ECORE_FILE_LIBS='-lecore_file  '
  902. EFL_BUILD_DOC_FALSE=''
  903. EFL_BUILD_DOC_TRUE='#'
  904. EFL_EYESIGHT_BUILD=''
  905. EFL_HAVE_WALL_FALSE='#'
  906. EFL_HAVE_WALL_TRUE=''
  907. EFL_HAVE_WEXTRA_FALSE='#'
  908. EFL_HAVE_WEXTRA_TRUE=''
  909. EFL_HAVE_WSHADOW_FALSE='#'
  910. EFL_HAVE_WSHADOW_TRUE=''
  911. EGREP='/usr/bin/grep -E'
  912. EXEEXT=''
  913. EYESIGHT_BIN_CFLAGS='-I/usr/include/elementary-1 -I/usr/include/ethumb-1 -I/usr/include/efreet-1 -I/usr/include/e_dbus-1 -I/usr/include/ecore-1 -I/usr/include/emotion-1 -I/usr/include/eio-1 -I/usr/include/edje-1 -I/usr/include/evas-1 -I/usr/include/eet-1 -I/usr/include/eina-1 -I/usr/include/eina-1/eina -I/usr/include/valgrind -I/usr/include/glib-2.0 -I/usr/lib/glib-2.0/include -I/usr/include/p11-kit-1 -I/usr/include/fribidi -I/usr/include/freetype2 -I/usr/include/embryo-1 -I/usr/include/dbus-1.0 -I/usr/lib/dbus-1.0/include -I/usr/include/eeze-1  '
  914. EYESIGHT_BIN_LIBS='-pthread -lelementary -lm -leet -levas -lecore -leina -lecore_evas -lecore_file -ledje -lefreet_mime -lefreet_trash -lethumb_client -lemap -lecore_imf -lecore_con -lefreet -ledbus -ldbus-1 -lpthread -lrt -lecore_input  '
  915. EYESIGHT_BUILD_IMG_FALSE='#'
  916. EYESIGHT_BUILD_IMG_TRUE=''
  917. EYESIGHT_BUILD_PDF_FALSE='#'
  918. EYESIGHT_BUILD_PDF_TRUE=''
  919. EYESIGHT_BUILD_POSTSCRIPT_FALSE='#'
  920. EYESIGHT_BUILD_POSTSCRIPT_TRUE=''
  921. EYESIGHT_BUILD_TXT_FALSE='#'
  922. EYESIGHT_BUILD_TXT_TRUE=''
  923. EYESIGHT_CFLAGS='-I/usr/include/eina-1 -I/usr/include/eina-1/eina -I/usr/include/valgrind -I/usr/include/evas-1 -I/usr/include/eet-1 -I/usr/include/fribidi -I/usr/include/freetype2 -I/usr/include/p11-kit-1 -I/usr/include/efreet-1 -I/usr/include/ecore-1 -I/usr/include/glib-2.0 -I/usr/lib/glib-2.0/include   -Wall -Wextra -Wshadow'
  924. EYESIGHT_LIBS='-pthread -levas -leina -lrt -lefreet_mime  '
  925. EYESIGHT_PRG='eyesight'
  926. EYESIGHT_STATIC_BUILD_IMG_FALSE=''
  927. EYESIGHT_STATIC_BUILD_IMG_TRUE='#'
  928. EYESIGHT_STATIC_BUILD_PDF_FALSE=''
  929. EYESIGHT_STATIC_BUILD_PDF_TRUE='#'
  930. EYESIGHT_STATIC_BUILD_POSTSCRIPT_FALSE=''
  931. EYESIGHT_STATIC_BUILD_POSTSCRIPT_TRUE='#'
  932. EYESIGHT_STATIC_BUILD_TXT_FALSE=''
  933. EYESIGHT_STATIC_BUILD_TXT_TRUE='#'
  934. FGREP='/usr/bin/grep -F'
  935. GREP='/usr/bin/grep'
  936. INSTALL_DATA='${INSTALL} -m 644'
  937. INSTALL_PROGRAM='${INSTALL}'
  938. INSTALL_SCRIPT='${INSTALL}'
  939. INSTALL_STRIP_PROGRAM='$(install_sh) -c -s'
  940. LD='/usr/i486-slackware-linux/bin/ld'
  941. LDFLAGS=''
  942. LIBOBJS=''
  943. LIBS=''
  944. LIBTOOL='$(SHELL) $(top_builddir)/libtool'
  945. LIPO=''
  946. LN_S='ln -s'
  947. LTLIBOBJS=''
  948. MAKEINFO='${SHELL} /tmp/tgz/e17/eyesight/missing --run makeinfo'
  949. MANIFEST_TOOL=':'
  950. MKDIR_P='/usr/bin/mkdir -p'
  951. MUPDF_CFLAGS='-I/usr/include/freetype2  '
  952. MUPDF_LIBS=' -lfreetype -lz  '
  953. NM='/usr/bin/nm -B'
  954. NMEDIT=''
  955. OBJDUMP='objdump'
  956. OBJEXT='o'
  957. OTOOL64=''
  958. OTOOL=''
  959. PACKAGE='eyesight'
  960. PACKAGE_BUGREPORT='enlightenment-devel@lists.sourceforge.net'
  961. PACKAGE_NAME='eyesight'
  962. PACKAGE_STRING='eyesight 0.0.1'
  963. PACKAGE_TARNAME='eyesight'
  964. PACKAGE_URL=''
  965. PACKAGE_VERSION='0.0.1'
  966. PATH_SEPARATOR=':'
  967. PKG_CONFIG='/usr/bin/pkg-config'
  968. PKG_CONFIG_LIBDIR=''
  969. PKG_CONFIG_PATH='/usr/local/lib/pkgconfig:/usr/lib/pkgconfig'
  970. POSTSCRIPT_CFLAGS=' '
  971. POSTSCRIPT_LIBS='-lspectre  '
  972. RANLIB='ranlib'
  973. SED='/usr/bin/sed'
  974. SET_MAKE=''
  975. SHELL='/bin/sh'
  976. STRIP='strip'
  977. VERSION='0.0.1'
  978. ac_ct_AR='ar'
  979. ac_ct_CC='gcc'
  980. ac_ct_DUMPBIN=''
  981. am__EXEEXT_FALSE=''
  982. am__EXEEXT_TRUE='#'
  983. am__fastdepCC_FALSE='#'
  984. am__fastdepCC_TRUE=''
  985. am__include='include'
  986. am__isrc=''
  987. am__leading_dot='.'
  988. am__nodep='_no'
  989. am__quote=''
  990. am__tar='$${TAR-tar} chof - "$$tardir"'
  991. am__untar='$${TAR-tar} xf -'
  992. bindir='${exec_prefix}/bin'
  993. build='i486-slackware-linux-gnu'
  994. build_alias='i486-slackware-linux'
  995. build_cpu='i486'
  996. build_os='linux-gnu'
  997. build_vendor='slackware'
  998. datadir='${datarootdir}'
  999. datarootdir='${prefix}/share'
  1000. docdir='${datarootdir}/doc/${PACKAGE_TARNAME}'
  1001. dvidir='${docdir}'
  1002. edje_cc='/usr/bin/edje_cc'
  1003. efl_doxygen='doxygen'
  1004. efl_have_doxygen='no'
  1005. exec_prefix='${prefix}'
  1006. host='i486-slackware-linux-gnu'
  1007. host_alias=''
  1008. host_cpu='i486'
  1009. host_os='linux-gnu'
  1010. host_vendor='slackware'
  1011. htmldir='${docdir}'
  1012. includedir='${prefix}/include'
  1013. infodir='/usr/info'
  1014. install_sh='${SHELL} /tmp/tgz/e17/eyesight/install-sh'
  1015. libdir='/usr/lib'
  1016. libexecdir='${exec_prefix}/libexec'
  1017. localedir='${datarootdir}/locale'
  1018. localstatedir='${prefix}/var'
  1019. lt_enable_auto_import=''
  1020. mandir='/usr/man'
  1021. mkdir_p='/usr/bin/mkdir -p'
  1022. oldincludedir='/usr/include'
  1023. pdfdir='${docdir}'
  1024. pkgconfig_requires_private='Requires.private'
  1025. prefix='/usr'
  1026. program_transform_name='s,x,x,'
  1027. psdir='${docdir}'
  1028. requirements_libs_eyesight=''
  1029. requirements_pc_eyesight='eina >= 1.2.0, evas >= 1.2.0 efreet-mime >= 1.2.0'
  1030. sbindir='${exec_prefix}/sbin'
  1031. sharedstatedir='${prefix}/com'
  1032. sysconfdir='${prefix}/etc'
  1033. target_alias=''
  1034. version_info='0:1:0'
  1035.  
  1036. ## ----------- ##
  1037. ## confdefs.h. ##
  1038. ## ----------- ##
  1039.  
  1040. /* confdefs.h */
  1041. #define PACKAGE_NAME "eyesight"
  1042. #define PACKAGE_TARNAME "eyesight"
  1043. #define PACKAGE_VERSION "0.0.1"
  1044. #define PACKAGE_STRING "eyesight 0.0.1"
  1045. #define PACKAGE_BUGREPORT "enlightenment-devel@lists.sourceforge.net"
  1046. #define PACKAGE_URL ""
  1047. #define PACKAGE "eyesight"
  1048. #define VERSION "0.0.1"
  1049. #define STDC_HEADERS 1
  1050. #define HAVE_SYS_TYPES_H 1
  1051. #define HAVE_SYS_STAT_H 1
  1052. #define HAVE_STDLIB_H 1
  1053. #define HAVE_STRING_H 1
  1054. #define HAVE_MEMORY_H 1
  1055. #define HAVE_STRINGS_H 1
  1056. #define HAVE_INTTYPES_H 1
  1057. #define HAVE_STDINT_H 1
  1058. #define HAVE_UNISTD_H 1
  1059. #define HAVE_DLFCN_H 1
  1060. #define LT_OBJDIR ".libs/"
  1061. #define EYESIGHT_BUILD_PDF 1
  1062. #define EYESIGHT_BUILD_POSTSCRIPT 1
  1063. #define EYESIGHT_BUILD_TXT 1
  1064. #define EYESIGHT_BUILD_IMG 1
  1065. #define __UNUSED__ __attribute__ ((unused))
  1066.  
  1067. configure: exit 0
clone this paste RAW Paste Data