This week only. Pastebin PRO Accounts Christmas Special! Don't miss out!Want more features on Pastebin? Sign Up, it's FREE!
Guest

Untitled

By: a guest on May 29th, 2010  |  syntax: None  |  size: 0.99 KB  |  views: 150  |  expires: Never
download  |  raw  |  embed  |  report abuse  |  print
Text below is selected. Please press Ctrl+C to copy to your clipboard. (⌘+C on Mac)
  1. [ 73%] Building CXX object src/cc/tools/CMakeFiles/tools.dir/KfsPwd.o
  2. [ 73%] Building CXX object src/cc/tools/CMakeFiles/tools.dir/KfsAppend.o
  3. [ 74%] Building CXX object src/cc/tools/CMakeFiles/tools.dir/utils.o
  4. Linking CXX static library libtools.a
  5. [ 74%] Built target tools
  6. Scanning dependencies of target cpfromkfs
  7. [ 75%] Building CXX object src/cc/tools/CMakeFiles/cpfromkfs.dir/cpfromkfs_main.o
  8. Linking CXX executable cpfromkfs
  9. ../qcdio/libqcdio.a(qcmutex.o): In function `GetAbsTimeout':
  10. /tmp/yaourt-tmp-tom/aur-kfs-svn/kfs-svn/src/kosmosfs/src/cc/qcdio/qcmutex.cpp:40: undefined reference to `clock_gettime'
  11. /tmp/yaourt-tmp-tom/aur-kfs-svn/kfs-svn/src/kosmosfs/src/cc/qcdio/qcmutex.cpp:40: undefined reference to `clock_gettime'
  12. collect2: ld returned 1 exit status
  13. make[2]: *** [src/cc/tools/cpfromkfs] Error 1
  14. make[1]: *** [src/cc/tools/CMakeFiles/cpfromkfs.dir/all] Error 2
  15. make: *** [all] Error 2
  16. ==> ERROR: Build Failed.
  17.     Aborting...
  18. Error: Makepkg was unable to build kfs-svn package.
clone this paste RAW Paste Data