Guest User

heapdump with io.js 3.0.0

a guest
Aug 5th, 2015
291
0
Never
Not a member of Pastebin yet? Sign Up, it unlocks many cool features!
text 62.32 KB | None | 0 0
  1. npm install heapdump
  2. /
  3. > [email protected] install ~/dev.example.com/pm2/node_modules/heapdump
  4. > node-gyp rebuild
  5.  
  6. make: Entering directory `~/dev.example.com/pm2/node_modules/heapdump/build'
  7. CXX(target) Release/obj.target/addon/src/heapdump.o
  8. In file included from ~/.node-gyp/3.0.0/include/node/node.h:42:0,
  9. from ../src/heapdump.cc:15:
  10. ~/.node-gyp/3.0.0/include/node/v8.h:336:1: error: expected unqualified-id before 'using'
  11. ~/.node-gyp/3.0.0/include/node/v8.h:468:1: error: expected unqualified-id before 'using'
  12. ~/.node-gyp/3.0.0/include/node/v8.h:499:48: error: 'Handle' does not name a type
  13. ~/.node-gyp/3.0.0/include/node/v8.h:499:48: error: ISO C++ forbids declaration of 'parameter' with no type [-fpermissive]
  14. ~/.node-gyp/3.0.0/include/node/v8.h:499:54: error: expected ',' or '...' before '<' token
  15. ~/.node-gyp/3.0.0/include/node/v8.h:520:54: error: 'Handle' does not name a type
  16. ~/.node-gyp/3.0.0/include/node/v8.h:520:54: error: ISO C++ forbids declaration of 'parameter' with no type [-fpermissive]
  17. ~/.node-gyp/3.0.0/include/node/v8.h:520:60: error: expected ',' or '...' before '<' token
  18. ~/.node-gyp/3.0.0/include/node/v8.h:533:54: error: 'Handle' does not name a type
  19. ~/.node-gyp/3.0.0/include/node/v8.h:533:54: error: ISO C++ forbids declaration of 'parameter' with no type [-fpermissive]
  20. ~/.node-gyp/3.0.0/include/node/v8.h:533:60: error: expected ',' or '...' before '<' token
  21. ~/.node-gyp/3.0.0/include/node/v8.h: In member function 'bool v8::PersistentBase<T>::operator==(int) const':
  22. ~/.node-gyp/3.0.0/include/node/v8.h:522:65: error: 'that' was not declared in this scope
  23. ~/.node-gyp/3.0.0/include/node/v8.h: In member function 'bool v8::PersistentBase<T>::operator!=(int) const':
  24. ~/.node-gyp/3.0.0/include/node/v8.h:534:24: error: 'that' was not declared in this scope
  25. ~/.node-gyp/3.0.0/include/node/v8.h: At global scope:
  26. ~/.node-gyp/3.0.0/include/node/v8.h:700:61: error: 'Handle' has not been declared
  27. ~/.node-gyp/3.0.0/include/node/v8.h:700:67: error: expected ',' or '...' before '<' token
  28. ~/.node-gyp/3.0.0/include/node/v8.h: In constructor 'v8::Persistent<T, M>::Persistent(v8::Isolate*, int)':
  29. ~/.node-gyp/3.0.0/include/node/v8.h:701:60: error: 'that' was not declared in this scope
  30. ~/.node-gyp/3.0.0/include/node/v8.h: At global scope:
  31. ~/.node-gyp/3.0.0/include/node/v8.h:793:38: error: 'Handle' has not been declared
  32. ~/.node-gyp/3.0.0/include/node/v8.h:793:44: error: expected ',' or '...' before '<' token
  33. ~/.node-gyp/3.0.0/include/node/v8.h: In constructor 'v8::Global<T>::Global(v8::Isolate*, int)':
  34. ~/.node-gyp/3.0.0/include/node/v8.h:794:60: error: 'that' was not declared in this scope
  35. ~/.node-gyp/3.0.0/include/node/v8.h: At global scope:
  36. ~/.node-gyp/3.0.0/include/node/v8.h:845:1: error: expected unqualified-id before 'using'
  37. ~/.node-gyp/3.0.0/include/node/v8.h:981:13: error: expected ')' before '<' token
  38. ~/.node-gyp/3.0.0/include/node/v8.h:995:13: error: 'Handle' does not name a type
  39. ~/.node-gyp/3.0.0/include/node/v8.h:996:13: error: 'Handle' does not name a type
  40. ~/.node-gyp/3.0.0/include/node/v8.h:997:13: error: 'Handle' does not name a type
  41. ~/.node-gyp/3.0.0/include/node/v8.h:1001:13: error: 'Handle' does not name a type
  42. ~/.node-gyp/3.0.0/include/node/v8.h:1002:13: error: 'Handle' does not name a type
  43. ~/.node-gyp/3.0.0/include/node/v8.h:1003:13: error: 'Handle' does not name a type
  44. ~/.node-gyp/3.0.0/include/node/v8.h:1004:13: error: 'Handle' does not name a type
  45. ~/.node-gyp/3.0.0/include/node/v8.h:1007:3: error: 'Handle' does not name a type
  46. ~/.node-gyp/3.0.0/include/node/v8.h:1008:3: error: 'Handle' does not name a type
  47. ~/.node-gyp/3.0.0/include/node/v8.h:1009:3: error: 'Handle' does not name a type
  48. ~/.node-gyp/3.0.0/include/node/v8.h:1010:3: error: 'Handle' does not name a type
  49. ~/.node-gyp/3.0.0/include/node/v8.h:1011:3: error: 'Handle' does not name a type
  50. ~/.node-gyp/3.0.0/include/node/v8.h:1012:3: error: 'Handle' does not name a type
  51. ~/.node-gyp/3.0.0/include/node/v8.h:1013:3: error: 'Handle' does not name a type
  52. ~/.node-gyp/3.0.0/include/node/v8.h:1028:3: error: 'Handle' does not name a type
  53. ~/.node-gyp/3.0.0/include/node/v8.h:1033:3: error: 'Handle' does not name a type
  54. ~/.node-gyp/3.0.0/include/node/v8.h:1037:3: error: 'Handle' does not name a type
  55. ~/.node-gyp/3.0.0/include/node/v8.h:1058:10: error: 'Handle' has not been declared
  56. ~/.node-gyp/3.0.0/include/node/v8.h:1058:10: error: expected ',' or '...' before '<' token
  57. ~/.node-gyp/3.0.0/include/node/v8.h:1063:31: error: 'Handle' has not been declared
  58. ~/.node-gyp/3.0.0/include/node/v8.h:1063:37: error: expected ',' or '...' before '<' token
  59. ~/.node-gyp/3.0.0/include/node/v8.h:1066:24: error: 'Handle' has not been declared
  60. ~/.node-gyp/3.0.0/include/node/v8.h:1066:24: error: expected ',' or '...' before '<' token
  61. ~/.node-gyp/3.0.0/include/node/v8.h:1066:24: error: 'static v8::Local<v8::Script> v8::Script::Compile(int)' cannot be overloaded
  62. ~/.node-gyp/3.0.0/include/node/v8.h:1058:10: error: with 'static v8::Local<v8::Script> v8::Script::Compile(int)'
  63. ~/.node-gyp/3.0.0/include/node/v8.h:1160:5: error: 'Handle' does not name a type
  64. ~/.node-gyp/3.0.0/include/node/v8.h:1161:5: error: 'Handle' does not name a type
  65. ~/.node-gyp/3.0.0/include/node/v8.h:1162:5: error: 'Handle' does not name a type
  66. ~/.node-gyp/3.0.0/include/node/v8.h:1163:5: error: 'Handle' does not name a type
  67. ~/.node-gyp/3.0.0/include/node/v8.h:1164:5: error: 'Handle' does not name a type
  68. ~/.node-gyp/3.0.0/include/node/v8.h:1165:5: error: 'Handle' does not name a type
  69. ~/.node-gyp/3.0.0/include/node/v8.h:1313:10: error: 'Handle' has not been declared
  70. ~/.node-gyp/3.0.0/include/node/v8.h:1313:10: error: expected ',' or '...' before '<' token
  71. ~/.node-gyp/3.0.0/include/node/v8.h:1320:7: error: 'Handle' has not been declared
  72. ~/.node-gyp/3.0.0/include/node/v8.h:1320:13: error: expected ',' or '...' before '<' token
  73. ~/.node-gyp/3.0.0/include/node/v8.h:1407:3: error: 'Handle' does not name a type
  74. ~/.node-gyp/3.0.0/include/node/v8.h:1414:3: error: 'Handle' does not name a type
  75. ~/.node-gyp/3.0.0/include/node/v8.h:1628:12: error: 'Handle' has not been declared
  76. ~/.node-gyp/3.0.0/include/node/v8.h:1628:18: error: expected ',' or '...' before '<' token
  77. ~/.node-gyp/3.0.0/include/node/v8.h:1629:20: error: 'Handle' has not been declared
  78. ~/.node-gyp/3.0.0/include/node/v8.h:1629:26: error: expected ',' or '...' before '<' token
  79. ~/.node-gyp/3.0.0/include/node/v8.h:1630:12: error: 'Handle' has not been declared
  80. ~/.node-gyp/3.0.0/include/node/v8.h:1630:18: error: expected ',' or '...' before '<' token
  81. ~/.node-gyp/3.0.0/include/node/v8.h:1631:15: error: 'Handle' has not been declared
  82. ~/.node-gyp/3.0.0/include/node/v8.h:1631:21: error: expected ',' or '...' before '<' token
  83. ~/.node-gyp/3.0.0/include/node/v8.h:1964:3: error: 'Handle' has not been declared
  84. ~/.node-gyp/3.0.0/include/node/v8.h:1964:3: error: expected ',' or '...' before '<' token
  85. ~/.node-gyp/3.0.0/include/node/v8.h:1966:44: error: 'Handle' has not been declared
  86. ~/.node-gyp/3.0.0/include/node/v8.h:1966:50: error: expected ',' or '...' before '<' token
  87. ~/.node-gyp/3.0.0/include/node/v8.h:1967:21: error: 'Handle' has not been declared
  88. ~/.node-gyp/3.0.0/include/node/v8.h:1967:27: error: expected ',' or '...' before '<' token
  89. ~/.node-gyp/3.0.0/include/node/v8.h:1968:18: error: 'Handle' has not been declared
  90. ~/.node-gyp/3.0.0/include/node/v8.h:1968:24: error: expected ',' or '...' before '<' token
  91. ~/.node-gyp/3.0.0/include/node/v8.h:1996:20: error: 'Handle' does not name a type
  92. ~/.node-gyp/3.0.0/include/node/v8.h:2277:31: error: 'Handle' has not been declared
  93. ~/.node-gyp/3.0.0/include/node/v8.h:2277:37: error: expected ',' or '...' before '<' token
  94. ~/.node-gyp/3.0.0/include/node/v8.h:2345:30: error: expected ')' before '<' token
  95. ~/.node-gyp/3.0.0/include/node/v8.h:2367:26: error: expected ')' before '<' token
  96. ~/.node-gyp/3.0.0/include/node/v8.h:2564:3: error: 'Handle' has not been declared
  97. ~/.node-gyp/3.0.0/include/node/v8.h:2564:3: error: expected ',' or '...' before '<' token
  98. ~/.node-gyp/3.0.0/include/node/v8.h:2569:3: error: 'Handle' has not been declared
  99. ~/.node-gyp/3.0.0/include/node/v8.h:2569:3: error: expected ',' or '...' before '<' token
  100. ~/.node-gyp/3.0.0/include/node/v8.h:2582:3: error: 'Handle' has not been declared
  101. ~/.node-gyp/3.0.0/include/node/v8.h:2582:3: error: expected ',' or '...' before '<' token
  102. ~/.node-gyp/3.0.0/include/node/v8.h:2589:3: error: 'Handle' has not been declared
  103. ~/.node-gyp/3.0.0/include/node/v8.h:2589:3: error: expected ',' or '...' before '<' token
  104. ~/.node-gyp/3.0.0/include/node/v8.h:2602:3: error: 'Handle' has not been declared
  105. ~/.node-gyp/3.0.0/include/node/v8.h:2602:3: error: expected ',' or '...' before '<' token
  106. ~/.node-gyp/3.0.0/include/node/v8.h:2615:3: error: 'Handle' has not been declared
  107. ~/.node-gyp/3.0.0/include/node/v8.h:2615:3: error: expected ',' or '...' before '<' token
  108. ~/.node-gyp/3.0.0/include/node/v8.h:2619:3: error: 'Handle' has not been declared
  109. ~/.node-gyp/3.0.0/include/node/v8.h:2619:3: error: expected ',' or '...' before '<' token
  110. ~/.node-gyp/3.0.0/include/node/v8.h:2630:3: error: 'Handle' has not been declared
  111. ~/.node-gyp/3.0.0/include/node/v8.h:2630:3: error: expected ',' or '...' before '<' token
  112. ~/.node-gyp/3.0.0/include/node/v8.h:2637:3: error: 'Handle' has not been declared
  113. ~/.node-gyp/3.0.0/include/node/v8.h:2637:3: error: expected ',' or '...' before '<' token
  114. ~/.node-gyp/3.0.0/include/node/v8.h:2637:3: error: 'bool v8::Object::SetAccessor(int)' cannot be overloaded
  115. ~/.node-gyp/3.0.0/include/node/v8.h:2630:3: error: with 'bool v8::Object::SetAccessor(int)'
  116. ~/.node-gyp/3.0.0/include/node/v8.h:2654:28: error: 'Handle' has not been declared
  117. ~/.node-gyp/3.0.0/include/node/v8.h:2654:34: error: expected ',' or '...' before '<' token
  118. ~/.node-gyp/3.0.0/include/node/v8.h:2665:19: error: 'Handle' has not been declared
  119. ~/.node-gyp/3.0.0/include/node/v8.h:2665:25: error: expected ',' or '...' before '<' token
  120. ~/.node-gyp/3.0.0/include/node/v8.h:2666:19: error: 'Handle' has not been declared
  121. ~/.node-gyp/3.0.0/include/node/v8.h:2666:25: error: expected ',' or '...' before '<' token
  122. ~/.node-gyp/3.0.0/include/node/v8.h:2667:22: error: 'Handle' has not been declared
  123. ~/.node-gyp/3.0.0/include/node/v8.h:2667:28: error: expected ',' or '...' before '<' token
  124. ~/.node-gyp/3.0.0/include/node/v8.h:2668:27: error: 'Handle' has not been declared
  125. ~/.node-gyp/3.0.0/include/node/v8.h:2668:33: error: expected ',' or '...' before '<' token
  126. ~/.node-gyp/3.0.0/include/node/v8.h:2701:3: error: 'Handle' has not been declared
  127. ~/.node-gyp/3.0.0/include/node/v8.h:2701:3: error: expected ',' or '...' before '<' token
  128. ~/.node-gyp/3.0.0/include/node/v8.h:2710:46: error: 'Handle' has not been declared
  129. ~/.node-gyp/3.0.0/include/node/v8.h:2710:52: error: expected ',' or '...' before '<' token
  130. ~/.node-gyp/3.0.0/include/node/v8.h:2739:36: error: 'Handle' has not been declared
  131. ~/.node-gyp/3.0.0/include/node/v8.h:2739:42: error: expected ',' or '...' before '<' token
  132. ~/.node-gyp/3.0.0/include/node/v8.h:2762:3: error: 'Handle' has not been declared
  133. ~/.node-gyp/3.0.0/include/node/v8.h:2762:3: error: expected ',' or '...' before '<' token
  134. ~/.node-gyp/3.0.0/include/node/v8.h:2766:3: error: 'Handle' has not been declared
  135. ~/.node-gyp/3.0.0/include/node/v8.h:2766:3: error: expected ',' or '...' before '<' token
  136. ~/.node-gyp/3.0.0/include/node/v8.h:2774:3: error: 'Handle' has not been declared
  137. ~/.node-gyp/3.0.0/include/node/v8.h:2774:3: error: expected ',' or '...' before '<' token
  138. ~/.node-gyp/3.0.0/include/node/v8.h:2783:3: error: 'Handle' has not been declared
  139. ~/.node-gyp/3.0.0/include/node/v8.h:2783:3: error: expected ',' or '...' before '<' token
  140. ~/.node-gyp/3.0.0/include/node/v8.h:2794:3: error: 'Handle' has not been declared
  141. ~/.node-gyp/3.0.0/include/node/v8.h:2794:3: error: expected ',' or '...' before '<' token
  142. ~/.node-gyp/3.0.0/include/node/v8.h:2807:3: error: 'Handle' has not been declared
  143. ~/.node-gyp/3.0.0/include/node/v8.h:2807:3: error: expected ',' or '...' before '<' token
  144. ~/.node-gyp/3.0.0/include/node/v8.h:2817:3: error: 'Handle' has not been declared
  145. ~/.node-gyp/3.0.0/include/node/v8.h:2817:3: error: expected ',' or '...' before '<' token
  146. ~/.node-gyp/3.0.0/include/node/v8.h:2852:23: error: 'Handle' has not been declared
  147. ~/.node-gyp/3.0.0/include/node/v8.h:2852:29: error: expected ',' or '...' before '<' token
  148. ~/.node-gyp/3.0.0/include/node/v8.h:2853:31: error: 'Handle' has not been declared
  149. ~/.node-gyp/3.0.0/include/node/v8.h:2853:37: error: expected ',' or '...' before '<' token
  150. ~/.node-gyp/3.0.0/include/node/v8.h:2854:26: error: 'Handle' has not been declared
  151. ~/.node-gyp/3.0.0/include/node/v8.h:2854:32: error: expected ',' or '...' before '<' token
  152. ~/.node-gyp/3.0.0/include/node/v8.h:2879:3: error: 'Handle' has not been declared
  153. ~/.node-gyp/3.0.0/include/node/v8.h:2879:3: error: expected ',' or '...' before '<' token
  154. ~/.node-gyp/3.0.0/include/node/v8.h:2883:58: error: 'Handle' has not been declared
  155. ~/.node-gyp/3.0.0/include/node/v8.h:2883:64: error: expected ',' or '...' before '<' token
  156. ~/.node-gyp/3.0.0/include/node/v8.h:2892:3: error: 'Handle' has not been declared
  157. ~/.node-gyp/3.0.0/include/node/v8.h:2892:3: error: expected ',' or '...' before '<' token
  158. ~/.node-gyp/3.0.0/include/node/v8.h:2953:50: error: 'Handle' does not name a type
  159. ~/.node-gyp/3.0.0/include/node/v8.h:2953:50: error: ISO C++ forbids declaration of 'parameter' with no type [-fpermissive]
  160. ~/.node-gyp/3.0.0/include/node/v8.h:2953:56: error: expected ',' or '...' before '<' token
  161. ~/.node-gyp/3.0.0/include/node/v8.h:3074:3: error: 'Handle' has not been declared
  162. ~/.node-gyp/3.0.0/include/node/v8.h:3074:3: error: expected ',' or '...' before '<' token
  163. ~/.node-gyp/3.0.0/include/node/v8.h:3078:41: error: 'Handle' has not been declared
  164. ~/.node-gyp/3.0.0/include/node/v8.h:3078:47: error: expected ',' or '...' before '<' token
  165. ~/.node-gyp/3.0.0/include/node/v8.h:3086:3: error: 'Handle' has not been declared
  166. ~/.node-gyp/3.0.0/include/node/v8.h:3086:3: error: expected ',' or '...' before '<' token
  167. ~/.node-gyp/3.0.0/include/node/v8.h:3090:48: error: 'Handle' has not been declared
  168. ~/.node-gyp/3.0.0/include/node/v8.h:3090:54: error: expected ',' or '...' before '<' token
  169. ~/.node-gyp/3.0.0/include/node/v8.h:3093:16: error: 'Handle' has not been declared
  170. ~/.node-gyp/3.0.0/include/node/v8.h:3093:22: error: expected ',' or '...' before '<' token
  171. ~/.node-gyp/3.0.0/include/node/v8.h:3094:3: error: 'Handle' does not name a type
  172. ~/.node-gyp/3.0.0/include/node/v8.h:3102:3: error: 'Handle' does not name a type
  173. ~/.node-gyp/3.0.0/include/node/v8.h:3108:3: error: 'Handle' does not name a type
  174. ~/.node-gyp/3.0.0/include/node/v8.h: In member function 'v8::MaybeLocal<v8::Object> v8::Function::NewInstance(v8::Local<v8::Context>) const':
  175. ~/.node-gyp/3.0.0/include/node/v8.h:3083:43: error: no matching function for call to 'v8::Function::NewInstance(v8::Local<v8::Context>&, int, std::nullptr_t) const'
  176. ~/.node-gyp/3.0.0/include/node/v8.h:3083:43: note: candidates are:
  177. ~/.node-gyp/3.0.0/include/node/v8.h:3074:3: note: v8::Local<v8::Object> v8::Function::NewInstance(int, int) const
  178. ~/.node-gyp/3.0.0/include/node/v8.h:3074:3: note: candidate expects 2 arguments, 3 provided
  179. ~/.node-gyp/3.0.0/include/node/v8.h:3077:44: note: v8::MaybeLocal<v8::Object> v8::Function::NewInstance(v8::Local<v8::Context>, int, int) const
  180. ~/.node-gyp/3.0.0/include/node/v8.h:3077:44: note: no known conversion for argument 3 from 'std::nullptr_t' to 'int'
  181. ~/.node-gyp/3.0.0/include/node/v8.h:3080:3: note: v8::Local<v8::Object> v8::Function::NewInstance() const
  182. ~/.node-gyp/3.0.0/include/node/v8.h:3080:3: note: candidate expects 0 arguments, 3 provided
  183. ~/.node-gyp/3.0.0/include/node/v8.h:3081:44: note: v8::MaybeLocal<v8::Object> v8::Function::NewInstance(v8::Local<v8::Context>) const
  184. ~/.node-gyp/3.0.0/include/node/v8.h:3081:44: note: candidate expects 1 argument, 3 provided
  185. ~/.node-gyp/3.0.0/include/node/v8.h: At global scope:
  186. ~/.node-gyp/3.0.0/include/node/v8.h:3172:5: error: 'Handle' has not been declared
  187. ~/.node-gyp/3.0.0/include/node/v8.h:3172:5: error: expected ',' or '...' before '<' token
  188. ~/.node-gyp/3.0.0/include/node/v8.h:3174:49: error: 'Handle' has not been declared
  189. ~/.node-gyp/3.0.0/include/node/v8.h:3174:55: error: expected ',' or '...' before '<' token
  190. ~/.node-gyp/3.0.0/include/node/v8.h:3176:5: error: 'Handle' has not been declared
  191. ~/.node-gyp/3.0.0/include/node/v8.h:3176:5: error: expected ',' or '...' before '<' token
  192. ~/.node-gyp/3.0.0/include/node/v8.h:3178:48: error: 'Handle' has not been declared
  193. ~/.node-gyp/3.0.0/include/node/v8.h:3178:54: error: expected ',' or '...' before '<' token
  194. ~/.node-gyp/3.0.0/include/node/v8.h:3193:3: error: 'Handle' has not been declared
  195. ~/.node-gyp/3.0.0/include/node/v8.h:3193:3: error: expected ',' or '...' before '<' token
  196. ~/.node-gyp/3.0.0/include/node/v8.h:3196:51: error: 'Handle' has not been declared
  197. ~/.node-gyp/3.0.0/include/node/v8.h:3196:57: error: expected ',' or '...' before '<' token
  198. ~/.node-gyp/3.0.0/include/node/v8.h:3198:3: error: 'Handle' has not been declared
  199. ~/.node-gyp/3.0.0/include/node/v8.h:3198:3: error: expected ',' or '...' before '<' token
  200. ~/.node-gyp/3.0.0/include/node/v8.h:3201:51: error: 'Handle' has not been declared
  201. ~/.node-gyp/3.0.0/include/node/v8.h:3201:57: error: expected ',' or '...' before '<' token
  202. ~/.node-gyp/3.0.0/include/node/v8.h:3203:3: error: 'Handle' has not been declared
  203. ~/.node-gyp/3.0.0/include/node/v8.h:3203:3: error: expected ',' or '...' before '<' token
  204. ~/.node-gyp/3.0.0/include/node/v8.h:3206:50: error: 'Handle' has not been declared
  205. ~/.node-gyp/3.0.0/include/node/v8.h:3206:56: error: expected ',' or '...' before '<' token
  206. ~/.node-gyp/3.0.0/include/node/v8.h:3448:32: error: 'Handle' has not been declared
  207. ~/.node-gyp/3.0.0/include/node/v8.h:3448:38: error: expected ',' or '...' before '<' token
  208. ~/.node-gyp/3.0.0/include/node/v8.h:3464:39: error: 'Handle' has not been declared
  209. ~/.node-gyp/3.0.0/include/node/v8.h:3464:45: error: expected ',' or '...' before '<' token
  210. ~/.node-gyp/3.0.0/include/node/v8.h:3479:31: error: 'Handle' has not been declared
  211. ~/.node-gyp/3.0.0/include/node/v8.h:3479:37: error: expected ',' or '...' before '<' token
  212. ~/.node-gyp/3.0.0/include/node/v8.h:3495:33: error: 'Handle' has not been declared
  213. ~/.node-gyp/3.0.0/include/node/v8.h:3495:39: error: expected ',' or '...' before '<' token
  214. ~/.node-gyp/3.0.0/include/node/v8.h:3511:32: error: 'Handle' has not been declared
  215. ~/.node-gyp/3.0.0/include/node/v8.h:3511:38: error: expected ',' or '...' before '<' token
  216. ~/.node-gyp/3.0.0/include/node/v8.h:3527:33: error: 'Handle' has not been declared
  217. ~/.node-gyp/3.0.0/include/node/v8.h:3527:39: error: expected ',' or '...' before '<' token
  218. ~/.node-gyp/3.0.0/include/node/v8.h:3543:32: error: 'Handle' has not been declared
  219. ~/.node-gyp/3.0.0/include/node/v8.h:3543:38: error: expected ',' or '...' before '<' token
  220. ~/.node-gyp/3.0.0/include/node/v8.h:3559:34: error: 'Handle' has not been declared
  221. ~/.node-gyp/3.0.0/include/node/v8.h:3559:40: error: expected ',' or '...' before '<' token
  222. ~/.node-gyp/3.0.0/include/node/v8.h:3575:34: error: 'Handle' has not been declared
  223. ~/.node-gyp/3.0.0/include/node/v8.h:3575:40: error: expected ',' or '...' before '<' token
  224. ~/.node-gyp/3.0.0/include/node/v8.h:3591:30: error: 'Handle' has not been declared
  225. ~/.node-gyp/3.0.0/include/node/v8.h:3591:36: error: expected ',' or '...' before '<' token
  226. ~/.node-gyp/3.0.0/include/node/v8.h:3675:27: error: 'Handle' has not been declared
  227. ~/.node-gyp/3.0.0/include/node/v8.h:3675:33: error: expected ',' or '...' before '<' token
  228. ~/.node-gyp/3.0.0/include/node/v8.h:3693:45: error: 'Handle' has not been declared
  229. ~/.node-gyp/3.0.0/include/node/v8.h:3693:51: error: expected ',' or '...' before '<' token
  230. ~/.node-gyp/3.0.0/include/node/v8.h:3730:10: error: 'Handle' has not been declared
  231. ~/.node-gyp/3.0.0/include/node/v8.h:3730:10: error: expected ',' or '...' before '<' token
  232. ~/.node-gyp/3.0.0/include/node/v8.h:3734:55: error: 'Handle' has not been declared
  233. ~/.node-gyp/3.0.0/include/node/v8.h:3734:61: error: expected ',' or '...' before '<' token
  234. ~/.node-gyp/3.0.0/include/node/v8.h:3778:12: error: 'Handle' has not been declared
  235. ~/.node-gyp/3.0.0/include/node/v8.h:3778:18: error: expected ',' or '...' before '<' token
  236. ~/.node-gyp/3.0.0/include/node/v8.h:3780:58: error: 'Handle' has not been declared
  237. ~/.node-gyp/3.0.0/include/node/v8.h:3780:64: error: expected ',' or '...' before '<' token
  238. ~/.node-gyp/3.0.0/include/node/v8.h:3820:30: error: 'Handle' has not been declared
  239. ~/.node-gyp/3.0.0/include/node/v8.h:3820:36: error: expected ',' or '...' before '<' token
  240. ~/.node-gyp/3.0.0/include/node/v8.h:3829:30: error: 'Handle' has not been declared
  241. ~/.node-gyp/3.0.0/include/node/v8.h:3829:36: error: expected ',' or '...' before '<' token
  242. ~/.node-gyp/3.0.0/include/node/v8.h:3816:8: error: default argument missing for parameter 4 of 'void v8::Template::SetNativeDataProperty(v8::Local<v8::String>, v8::AccessorGetterCallback, v8::AccessorSetterCallback, int)'
  243. ~/.node-gyp/3.0.0/include/node/v8.h:3825:8: error: default argument missing for parameter 4 of 'void v8::Template::SetNativeDataProperty(v8::Local<v8::Name>, v8::AccessorNameGetterCallback, v8::AccessorNameSetterCallback, int)'
  244. ~/.node-gyp/3.0.0/include/node/v8.h:4114:7: error: 'Handle' has not been declared
  245. ~/.node-gyp/3.0.0/include/node/v8.h:4114:13: error: expected ',' or '...' before '<' token
  246. ~/.node-gyp/3.0.0/include/node/v8.h:4129:23: error: 'Handle' has not been declared
  247. ~/.node-gyp/3.0.0/include/node/v8.h:4129:29: error: expected ',' or '...' before '<' token
  248. ~/.node-gyp/3.0.0/include/node/v8.h:4138:16: error: 'Handle' has not been declared
  249. ~/.node-gyp/3.0.0/include/node/v8.h:4138:22: error: expected ',' or '...' before '<' token
  250. ~/.node-gyp/3.0.0/include/node/v8.h:4151:21: error: 'Handle' has not been declared
  251. ~/.node-gyp/3.0.0/include/node/v8.h:4151:27: error: expected ',' or '...' before '<' token
  252. ~/.node-gyp/3.0.0/include/node/v8.h:4190:20: error: 'Handle' has not been declared
  253. ~/.node-gyp/3.0.0/include/node/v8.h:4190:26: error: expected ',' or '...' before '<' token
  254. ~/.node-gyp/3.0.0/include/node/v8.h:4111:34: error: default argument missing for parameter 3 of 'static v8::Local<v8::FunctionTemplate> v8::FunctionTemplate::New(v8::Isolate*, v8::FunctionCallback, int)'
  255. ~/.node-gyp/3.0.0/include/node/v8.h:4220:7: error: 'Handle' has not been declared
  256. ~/.node-gyp/3.0.0/include/node/v8.h:4220:13: error: expected ',' or '...' before '<' token
  257. ~/.node-gyp/3.0.0/include/node/v8.h:4235:3: error: 'Handle' does not name a type
  258. ~/.node-gyp/3.0.0/include/node/v8.h:4213:3: error: default argument missing for parameter 6 of 'v8::NamedPropertyHandlerConfiguration::NamedPropertyHandlerConfiguration(v8::GenericNamedPropertyGetterCallback, v8::GenericNamedPropertySetterCallback, v8::GenericNamedPropertyQueryCallback, v8::GenericNamedPropertyDeleterCallback, v8::GenericNamedPropertyEnumeratorCallback, int)'
  259. ~/.node-gyp/3.0.0/include/node/v8.h: In constructor 'v8::NamedPropertyHandlerConfiguration::NamedPropertyHandlerConfiguration(v8::GenericNamedPropertyGetterCallback, v8::GenericNamedPropertySetterCallback, v8::GenericNamedPropertyQueryCallback, v8::GenericNamedPropertyDeleterCallback, v8::GenericNamedPropertyEnumeratorCallback, int)':
  260. ~/.node-gyp/3.0.0/include/node/v8.h:4227:9: error: class 'v8::NamedPropertyHandlerConfiguration' does not have any field named 'data'
  261. ~/.node-gyp/3.0.0/include/node/v8.h:4227:14: error: 'data' was not declared in this scope
  262. ~/.node-gyp/3.0.0/include/node/v8.h: At global scope:
  263. ~/.node-gyp/3.0.0/include/node/v8.h:4248:7: error: 'Handle' has not been declared
  264. ~/.node-gyp/3.0.0/include/node/v8.h:4248:13: error: expected ',' or '...' before '<' token
  265. ~/.node-gyp/3.0.0/include/node/v8.h:4263:3: error: 'Handle' does not name a type
  266. ~/.node-gyp/3.0.0/include/node/v8.h:4241:3: error: default argument missing for parameter 6 of 'v8::IndexedPropertyHandlerConfiguration::IndexedPropertyHandlerConfiguration(v8::IndexedPropertyGetterCallback, v8::IndexedPropertySetterCallback, v8::IndexedPropertyQueryCallback, v8::IndexedPropertyDeleterCallback, v8::IndexedPropertyEnumeratorCallback, int)'
  267. ~/.node-gyp/3.0.0/include/node/v8.h: In constructor 'v8::IndexedPropertyHandlerConfiguration::IndexedPropertyHandlerConfiguration(v8::IndexedPropertyGetterCallback, v8::IndexedPropertySetterCallback, v8::IndexedPropertyQueryCallback, v8::IndexedPropertyDeleterCallback, v8::IndexedPropertyEnumeratorCallback, int)':
  268. ~/.node-gyp/3.0.0/include/node/v8.h:4255:9: error: class 'v8::IndexedPropertyHandlerConfiguration' does not have any field named 'data'
  269. ~/.node-gyp/3.0.0/include/node/v8.h:4255:14: error: 'data' was not declared in this scope
  270. ~/.node-gyp/3.0.0/include/node/v8.h: At global scope:
  271. ~/.node-gyp/3.0.0/include/node/v8.h:4279:7: error: 'Handle' has not been declared
  272. ~/.node-gyp/3.0.0/include/node/v8.h:4279:13: error: expected ',' or '...' before '<' token
  273. ~/.node-gyp/3.0.0/include/node/v8.h:4315:20: error: 'Handle' has not been declared
  274. ~/.node-gyp/3.0.0/include/node/v8.h:4315:26: error: expected ',' or '...' before '<' token
  275. ~/.node-gyp/3.0.0/include/node/v8.h:4323:20: error: 'Handle' has not been declared
  276. ~/.node-gyp/3.0.0/include/node/v8.h:4323:26: error: expected ',' or '...' before '<' token
  277. ~/.node-gyp/3.0.0/include/node/v8.h:4323:8: error: 'void v8::ObjectTemplate::SetAccessor(int)' cannot be overloaded
  278. ~/.node-gyp/3.0.0/include/node/v8.h:4315:8: error: with 'void v8::ObjectTemplate::SetAccessor(int)'
  279. ~/.node-gyp/3.0.0/include/node/v8.h:4359:7: error: 'Handle' has not been declared
  280. ~/.node-gyp/3.0.0/include/node/v8.h:4359:13: error: expected ',' or '...' before '<' token
  281. ~/.node-gyp/3.0.0/include/node/v8.h:4386:7: error: 'Handle' has not been declared
  282. ~/.node-gyp/3.0.0/include/node/v8.h:4386:13: error: expected ',' or '...' before '<' token
  283. ~/.node-gyp/3.0.0/include/node/v8.h:4397:33: error: 'Handle' has not been declared
  284. ~/.node-gyp/3.0.0/include/node/v8.h:4397:39: error: expected ',' or '...' before '<' token
  285. ~/.node-gyp/3.0.0/include/node/v8.h:4422:32: error: 'Handle' has not been declared
  286. ~/.node-gyp/3.0.0/include/node/v8.h:4422:38: error: expected ',' or '...' before '<' token
  287. ~/.node-gyp/3.0.0/include/node/v8.h:4440:36: error: 'Handle' has not been declared
  288. ~/.node-gyp/3.0.0/include/node/v8.h:4440:42: error: expected ',' or '...' before '<' token
  289. ~/.node-gyp/3.0.0/include/node/v8.h:4353:8: error: default argument missing for parameter 6 of 'void v8::ObjectTemplate::SetNamedPropertyHandler(v8::NamedPropertyGetterCallback, v8::NamedPropertySetterCallback, v8::NamedPropertyQueryCallback, v8::NamedPropertyDeleterCallback, v8::NamedPropertyEnumeratorCallback, int)'
  290. ~/.node-gyp/3.0.0/include/node/v8.h:4380:8: error: default argument missing for parameter 6 of 'void v8::ObjectTemplate::SetIndexedPropertyHandler(v8::IndexedPropertyGetterCallback, v8::IndexedPropertySetterCallback, v8::IndexedPropertyQueryCallback, v8::IndexedPropertyDeleterCallback, v8::IndexedPropertyEnumeratorCallback, int)'
  291. ~/.node-gyp/3.0.0/include/node/v8.h: In member function 'void v8::ObjectTemplate::SetIndexedPropertyHandler(v8::IndexedPropertyGetterCallback, v8::IndexedPropertySetterCallback, v8::IndexedPropertyQueryCallback, v8::IndexedPropertyDeleterCallback, v8::IndexedPropertyEnumeratorCallback, int)':
  292. ~/.node-gyp/3.0.0/include/node/v8.h:4388:73: error: 'data' was not declared in this scope
  293. ~/.node-gyp/3.0.0/include/node/v8.h: At global scope:
  294. ~/.node-gyp/3.0.0/include/node/v8.h:4452:7: error: 'Handle' has not been declared
  295. ~/.node-gyp/3.0.0/include/node/v8.h:4452:13: error: expected ',' or '...' before '<' token
  296. ~/.node-gyp/3.0.0/include/node/v8.h:4466:39: error: 'Handle' has not been declared
  297. ~/.node-gyp/3.0.0/include/node/v8.h:4466:45: error: expected ',' or '...' before '<' token
  298. ~/.node-gyp/3.0.0/include/node/v8.h:4480:32: error: 'Handle' has not been declared
  299. ~/.node-gyp/3.0.0/include/node/v8.h:4480:38: error: expected ',' or '...' before '<' token
  300. ~/.node-gyp/3.0.0/include/node/v8.h:4481:42: error: 'Handle' has not been declared
  301. ~/.node-gyp/3.0.0/include/node/v8.h:4481:48: error: expected ',' or '...' before '<' token
  302. ~/.node-gyp/3.0.0/include/node/v8.h:4482:13: error: 'Handle' has not been declared
  303. ~/.node-gyp/3.0.0/include/node/v8.h:4482:19: error: expected ',' or '...' before '<' token
  304. ~/.node-gyp/3.0.0/include/node/v8.h:4517:11: error: 'Handle' in namespace 'v8' does not name a type
  305. ~/.node-gyp/3.0.0/include/node/v8.h:4550:11: error: 'Handle' does not name a type
  306. ~/.node-gyp/3.0.0/include/node/v8.h:4551:11: error: 'Handle' does not name a type
  307. ~/.node-gyp/3.0.0/include/node/v8.h:4552:11: error: 'Handle' does not name a type
  308. ~/.node-gyp/3.0.0/include/node/v8.h:4553:11: error: 'Handle' does not name a type
  309. ~/.node-gyp/3.0.0/include/node/v8.h:4625:33: error: typedef 'v8::MessageCallback' is initialized (use decltype instead)
  310. ~/.node-gyp/3.0.0/include/node/v8.h:4625:33: error: 'Handle' was not declared in this scope
  311. ~/.node-gyp/3.0.0/include/node/v8.h:4625:47: error: expected primary-expression before '>' token
  312. ~/.node-gyp/3.0.0/include/node/v8.h:4625:49: error: 'message' was not declared in this scope
  313. ~/.node-gyp/3.0.0/include/node/v8.h:4625:58: error: 'Handle' was not declared in this scope
  314. ~/.node-gyp/3.0.0/include/node/v8.h:4625:70: error: expected primary-expression before '>' token
  315. ~/.node-gyp/3.0.0/include/node/v8.h:4625:72: error: 'error' was not declared in this scope
  316. ~/.node-gyp/3.0.0/include/node/v8.h:4637:34: error: 'Handle' has not been declared
  317. ~/.node-gyp/3.0.0/include/node/v8.h:4637:40: error: expected ',' or '...' before '<' token
  318. ~/.node-gyp/3.0.0/include/node/v8.h:4638:38: error: 'Handle' has not been declared
  319. ~/.node-gyp/3.0.0/include/node/v8.h:4638:44: error: expected ',' or '...' before '<' token
  320. ~/.node-gyp/3.0.0/include/node/v8.h:4639:35: error: 'Handle' has not been declared
  321. ~/.node-gyp/3.0.0/include/node/v8.h:4639:41: error: expected ',' or '...' before '<' token
  322. ~/.node-gyp/3.0.0/include/node/v8.h:4640:33: error: 'Handle' has not been declared
  323. ~/.node-gyp/3.0.0/include/node/v8.h:4640:39: error: expected ',' or '...' before '<' token
  324. ~/.node-gyp/3.0.0/include/node/v8.h:4641:29: error: 'Handle' has not been declared
  325. ~/.node-gyp/3.0.0/include/node/v8.h:4641:35: error: expected ',' or '...' before '<' token
  326. ~/.node-gyp/3.0.0/include/node/v8.h:4648:39: error: 'Handle' has not been declared
  327. ~/.node-gyp/3.0.0/include/node/v8.h:4648:45: error: expected ',' or '...' before '<' token
  328. ~/.node-gyp/3.0.0/include/node/v8.h:4654:42: error: 'Handle' has not been declared
  329. ~/.node-gyp/3.0.0/include/node/v8.h:4654:48: error: expected ',' or '...' before '<' token
  330. ~/.node-gyp/3.0.0/include/node/v8.h:4702:30: error: expected ')' before '<' token
  331. ~/.node-gyp/3.0.0/include/node/v8.h:4709:13: error: 'Handle' does not name a type
  332. ~/.node-gyp/3.0.0/include/node/v8.h:4711:13: error: 'Handle' does not name a type
  333. ~/.node-gyp/3.0.0/include/node/v8.h:4714:13: error: 'Handle' does not name a type
  334. ~/.node-gyp/3.0.0/include/node/v8.h:4717:3: error: 'Handle' does not name a type
  335. ~/.node-gyp/3.0.0/include/node/v8.h:4719:3: error: 'Handle' does not name a type
  336. ~/.node-gyp/3.0.0/include/node/v8.h:4720:3: error: 'Handle' does not name a type
  337. ~/.node-gyp/3.0.0/include/node/v8.h:4863:3: error: 'Handle' does not name a type
  338. ~/.node-gyp/3.0.0/include/node/v8.h:4923:36: error: 'Handle' has not been declared
  339. ~/.node-gyp/3.0.0/include/node/v8.h:4923:42: error: expected ',' or '...' before '<' token
  340. ~/.node-gyp/3.0.0/include/node/v8.h:5442:25: error: 'Handle' has not been declared
  341. ~/.node-gyp/3.0.0/include/node/v8.h:5442:31: error: expected ',' or '...' before '<' token
  342. ~/.node-gyp/3.0.0/include/node/v8.h:5593:27: error: 'MessageCallback' has not been declared
  343. ~/.node-gyp/3.0.0/include/node/v8.h:5594:27: error: 'Handle' has not been declared
  344. ~/.node-gyp/3.0.0/include/node/v8.h:5594:33: error: expected ',' or '...' before '<' token
  345. ~/.node-gyp/3.0.0/include/node/v8.h:5599:31: error: 'MessageCallback' has not been declared
  346. ~/.node-gyp/3.0.0/include/node/v8.h:5762:20: error: 'MessageCallback' has not been declared
  347. ~/.node-gyp/3.0.0/include/node/v8.h:5762:20: error: 'Handle' has not been declared
  348. ~/.node-gyp/3.0.0/include/node/v8.h:5762:20: error: expected ',' or '...' before '<' token
  349. ~/.node-gyp/3.0.0/include/node/v8.h:5770:20: error: 'MessageCallback' has not been declared
  350. ~/.node-gyp/3.0.0/include/node/v8.h:6163:3: error: 'Handle' does not name a type
  351. ~/.node-gyp/3.0.0/include/node/v8.h:6327:7: error: 'Handle' has not been declared
  352. ~/.node-gyp/3.0.0/include/node/v8.h:6327:13: error: expected ',' or '...' before '<' token
  353. ~/.node-gyp/3.0.0/include/node/v8.h:6334:25: error: 'Handle' has not been declared
  354. ~/.node-gyp/3.0.0/include/node/v8.h:6334:31: error: expected ',' or '...' before '<' token
  355. ~/.node-gyp/3.0.0/include/node/v8.h:6340:3: error: 'Handle' does not name a type
  356. ~/.node-gyp/3.0.0/include/node/v8.h:6378:35: error: 'Handle' has not been declared
  357. ~/.node-gyp/3.0.0/include/node/v8.h:6378:41: error: expected ',' or '...' before '<' token
  358. ~/.node-gyp/3.0.0/include/node/v8.h:6421:52: error: 'Handle' has not been declared
  359. ~/.node-gyp/3.0.0/include/node/v8.h:6421:58: error: expected ',' or '...' before '<' token
  360. ~/.node-gyp/3.0.0/include/node/v8.h:6429:36: error: expected ')' before '<' token
  361. ~/.node-gyp/3.0.0/include/node/v8.h:6435:5: error: 'Handle' does not name a type
  362. ~/.node-gyp/3.0.0/include/node/v8.h:6324:25: error: default argument missing for parameter 3 of 'static v8::Local<v8::Context> v8::Context::New(v8::Isolate*, v8::ExtensionConfiguration*, int)'
  363. ~/.node-gyp/3.0.0/include/node/v8.h: In destructor 'v8::Context::Scope::~Scope()':
  364. ~/.node-gyp/3.0.0/include/node/v8.h:6432:26: error: 'context_' was not declared in this scope
  365. ~/.node-gyp/3.0.0/include/node/v8.h: At global scope:
  366. ~/.node-gyp/3.0.0/include/node/v8.h:6942:55: error: 'Handle' does not name a type
  367. ~/.node-gyp/3.0.0/include/node/v8.h:6942:55: error: ISO C++ forbids declaration of 'parameter' with no type [-fpermissive]
  368. ~/.node-gyp/3.0.0/include/node/v8.h:6942:61: error: expected ',' or '...' before '<' token
  369. ~/.node-gyp/3.0.0/include/node/v8.h: In member function 'void v8::PersistentBase<T>::Reset(v8::Isolate*, int)':
  370. ~/.node-gyp/3.0.0/include/node/v8.h:6945:7: error: 'other' was not declared in this scope
  371. ~/.node-gyp/3.0.0/include/node/v8.h:6946:29: error: 'other' was not declared in this scope
  372. ~/.node-gyp/3.0.0/include/node/v8.h: At global scope:
  373. ~/.node-gyp/3.0.0/include/node/v8.h:7069:32: error: 'Handle' does not name a type
  374. ~/.node-gyp/3.0.0/include/node/v8.h:7069:32: error: ISO C++ forbids declaration of 'parameter' with no type [-fpermissive]
  375. ~/.node-gyp/3.0.0/include/node/v8.h:7069:38: error: expected ',' or '...' before '<' token
  376. ~/.node-gyp/3.0.0/include/node/v8.h: In member function 'void v8::ReturnValue<T>::Set(int)':
  377. ~/.node-gyp/3.0.0/include/node/v8.h:7071:7: error: 'handle' was not declared in this scope
  378. ~/.node-gyp/3.0.0/include/node/v8.h: At global scope:
  379. ~/.node-gyp/3.0.0/include/node/v8.h:7229:1: error: 'Handle' does not name a type
  380. ~/.node-gyp/3.0.0/include/node/v8.h:7234:1: error: 'Handle' does not name a type
  381. ~/.node-gyp/3.0.0/include/node/v8.h:7239:1: error: 'Handle' does not name a type
  382. ~/.node-gyp/3.0.0/include/node/v8.h:7244:1: error: 'Handle' does not name a type
  383. ~/.node-gyp/3.0.0/include/node/v8.h:7249:1: error: 'Handle' does not name a type
  384. ~/.node-gyp/3.0.0/include/node/v8.h:7254:1: error: 'Handle' does not name a type
  385. ~/.node-gyp/3.0.0/include/node/v8.h:7259:1: error: 'Handle' does not name a type
  386. ~/.node-gyp/3.0.0/include/node/v8.h: In constructor 'v8::ScriptCompiler::Source::Source(v8::Local<v8::String>, const v8::ScriptOrigin&, v8::ScriptCompiler::CachedData*)':
  387. ~/.node-gyp/3.0.0/include/node/v8.h:7265:7: error: class 'v8::ScriptCompiler::Source' does not have any field named 'resource_name'
  388. ~/.node-gyp/3.0.0/include/node/v8.h:7265:28: error: 'const class v8::ScriptOrigin' has no member named 'ResourceName'
  389. ~/.node-gyp/3.0.0/include/node/v8.h:7266:7: error: class 'v8::ScriptCompiler::Source' does not have any field named 'resource_line_offset'
  390. ~/.node-gyp/3.0.0/include/node/v8.h:7266:35: error: 'const class v8::ScriptOrigin' has no member named 'ResourceLineOffset'
  391. ~/.node-gyp/3.0.0/include/node/v8.h:7267:7: error: class 'v8::ScriptCompiler::Source' does not have any field named 'resource_column_offset'
  392. ~/.node-gyp/3.0.0/include/node/v8.h:7267:37: error: 'const class v8::ScriptOrigin' has no member named 'ResourceColumnOffset'
  393. ~/.node-gyp/3.0.0/include/node/v8.h:7268:7: error: class 'v8::ScriptCompiler::Source' does not have any field named 'resource_is_embedder_debug_script'
  394. ~/.node-gyp/3.0.0/include/node/v8.h:7268:48: error: 'const class v8::ScriptOrigin' has no member named 'ResourceIsEmbedderDebugScript'
  395. ~/.node-gyp/3.0.0/include/node/v8.h:7269:7: error: class 'v8::ScriptCompiler::Source' does not have any field named 'resource_is_shared_cross_origin'
  396. ~/.node-gyp/3.0.0/include/node/v8.h:7269:46: error: 'const class v8::ScriptOrigin' has no member named 'ResourceIsSharedCrossOrigin'
  397. ~/.node-gyp/3.0.0/include/node/v8.h:7270:7: error: class 'v8::ScriptCompiler::Source' does not have any field named 'source_map_url'
  398. ~/.node-gyp/3.0.0/include/node/v8.h:7270:29: error: 'const class v8::ScriptOrigin' has no member named 'SourceMapUrl'
  399. ~/.node-gyp/3.0.0/include/node/v8.h: At global scope:
  400. ~/.node-gyp/3.0.0/include/node/v8.h:7290:1: error: 'Handle' does not name a type
  401. ~/.node-gyp/3.0.0/include/node/v8.h:7295:60: error: 'v8::Handle' has not been declared
  402. ~/.node-gyp/3.0.0/include/node/v8.h:7295:66: error: expected ',' or '...' before '<' token
  403. ~/.node-gyp/3.0.0/include/node/v8.h: In member function 'void v8::Template::Set(v8::Isolate*, const char*, int)':
  404. ~/.node-gyp/3.0.0/include/node/v8.h:7296:47: error: 'value' was not declared in this scope
  405. ~/.node-gyp/3.0.0/include/node/v8.h: At global scope:
  406. ~/.node-gyp/3.0.0/include/node/v8.h:7772:1: error: 'Handle' does not name a type
  407. ~/.node-gyp/3.0.0/include/node/v8.h:7781:1: error: 'Handle' does not name a type
  408. ~/.node-gyp/3.0.0/include/node/v8.h:7790:1: error: 'Handle' does not name a type
  409. ~/.node-gyp/3.0.0/include/node/v8.h:7799:1: error: 'Handle' does not name a type
  410. ~/.node-gyp/3.0.0/include/node/v8.h:7912:29: error: 'bool v8::V8::AddMessageListener' is not a static member of 'class v8::V8'
  411. ~/.node-gyp/3.0.0/include/node/v8.h:7912:29: error: 'MessageCallback' was not declared in this scope
  412. ~/.node-gyp/3.0.0/include/node/v8.h:7912:51: error: 'Handle' was not declared in this scope
  413. ~/.node-gyp/3.0.0/include/node/v8.h:7912:63: error: expected primary-expression before '>' token
  414. ~/.node-gyp/3.0.0/include/node/v8.h:7912:65: error: 'data' was not declared in this scope
  415. ~/.node-gyp/3.0.0/include/node/v8.h:7912:69: error: expression list treated as compound expression in initializer [-fpermissive]
  416. ~/.node-gyp/3.0.0/include/node/v8.h:7912:71: error: expected ',' or ';' before '{' token
  417. ~/.node-gyp/3.0.0/include/node/v8.h:7918:33: error: variable or field 'RemoveMessageListeners' declared void
  418. ~/.node-gyp/3.0.0/include/node/v8.h:7918:33: error: 'MessageCallback' was not declared in this scope
  419. In file included from ../src/heapdump.cc:15:0:
  420. ~/.node-gyp/3.0.0/include/node/node.h:134:13: error: 'Handle' in namespace 'v8' does not name a type
  421. ~/.node-gyp/3.0.0/include/node/node.h:140:13: error: 'Handle' in namespace 'v8' does not name a type
  422. ~/.node-gyp/3.0.0/include/node/node.h:146:13: error: 'Handle' in namespace 'v8' does not name a type
  423. In file included from ../src/heapdump.cc:15:0:
  424. ~/.node-gyp/3.0.0/include/node/node.h:193:48: error: 'v8::Handle' has not been declared
  425. ~/.node-gyp/3.0.0/include/node/node.h:193:54: error: expected ',' or '...' before '<' token
  426. ~/.node-gyp/3.0.0/include/node/node.h:204:48: error: 'v8::Handle' has not been declared
  427. ~/.node-gyp/3.0.0/include/node/node.h:204:54: error: expected ',' or '...' before '<' token
  428. ~/.node-gyp/3.0.0/include/node/node.h: In function 'void node::NODE_SET_METHOD(const TypeName&, const char*, v8::FunctionCallback)':
  429. ~/.node-gyp/3.0.0/include/node/node.h:245:22: error: no matching function for call to 'v8::Function::SetName(v8::Local<v8::String>&)'
  430. ~/.node-gyp/3.0.0/include/node/node.h:245:22: note: candidate is:
  431. ~/.node-gyp/3.0.0/include/node/v8.h:3093:8: note: void v8::Function::SetName(int)
  432. ~/.node-gyp/3.0.0/include/node/v8.h:3093:8: note: no known conversion for argument 1 from 'v8::Local<v8::String>' to 'int'
  433. ~/.node-gyp/3.0.0/include/node/node.h: At global scope:
  434. ~/.node-gyp/3.0.0/include/node/node.h:252:43: error: variable or field 'NODE_SET_PROTOTYPE_METHOD' declared void
  435. ~/.node-gyp/3.0.0/include/node/node.h:252:39: error: 'Handle' is not a member of 'v8'
  436. ~/.node-gyp/3.0.0/include/node/node.h:252:70: error: expected primary-expression before '>' token
  437. ~/.node-gyp/3.0.0/include/node/node.h:252:72: error: 'recv' was not declared in this scope
  438. ~/.node-gyp/3.0.0/include/node/node.h:253:39: error: expected primary-expression before 'const'
  439. ~/.node-gyp/3.0.0/include/node/node.h:254:60: error: expected primary-expression before 'callback'
  440. ~/.node-gyp/3.0.0/include/node/node.h:270:9: error: 'v8::Handle' has not been declared
  441. ~/.node-gyp/3.0.0/include/node/node.h:270:15: error: expected ',' or '...' before '<' token
  442. ~/.node-gyp/3.0.0/include/node/node.h:272:1: error: 'node::ParseEncoding' declared as an 'inline' variable
  443. ~/.node-gyp/3.0.0/include/node/node.h:272:1: error: 'node::encoding node::ParseEncoding' redeclared as different kind of symbol
  444. ~/.node-gyp/3.0.0/include/node/node.h:268:27: error: previous declaration of 'node::encoding node::ParseEncoding(v8::Isolate*, int)'
  445. ~/.node-gyp/3.0.0/include/node/node.h:272:1: error: 'Handle' is not a member of 'v8'
  446. ~/.node-gyp/3.0.0/include/node/node.h:272:1: error: expected primary-expression before '>' token
  447. ~/.node-gyp/3.0.0/include/node/node.h:272:1: error: 'encoding_v' was not declared in this scope
  448. ~/.node-gyp/3.0.0/include/node/node.h:272:1: error: expected primary-expression before 'enum'
  449. ~/.node-gyp/3.0.0/include/node/node.h:315:37: error: 'v8::Handle' has not been declared
  450. ~/.node-gyp/3.0.0/include/node/node.h:315:43: error: expected ',' or '...' before '<' token
  451. ~/.node-gyp/3.0.0/include/node/node.h:317:1: error: 'node::DecodeBytes' declared as an 'inline' variable
  452. ~/.node-gyp/3.0.0/include/node/node.h:317:1: error: 'ssize_t node::DecodeBytes' redeclared as different kind of symbol
  453. ~/.node-gyp/3.0.0/include/node/node.h:314:21: error: previous declaration of 'ssize_t node::DecodeBytes(v8::Isolate*, int)'
  454. ~/.node-gyp/3.0.0/include/node/node.h:317:1: error: 'Handle' is not a member of 'v8'
  455. ~/.node-gyp/3.0.0/include/node/node.h:317:1: error: expected primary-expression before '>' token
  456. ~/.node-gyp/3.0.0/include/node/node.h:317:1: error: 'val' was not declared in this scope
  457. ~/.node-gyp/3.0.0/include/node/node.h:317:1: error: expected primary-expression before 'enum'
  458. ~/.node-gyp/3.0.0/include/node/node.h:328:37: error: 'v8::Handle' has not been declared
  459. ~/.node-gyp/3.0.0/include/node/node.h:328:43: error: expected ',' or '...' before '<' token
  460. ~/.node-gyp/3.0.0/include/node/node.h:330:1: error: 'v8::Handle' has not been declared
  461. ~/.node-gyp/3.0.0/include/node/node.h:330:1: error: expected ',' or '...' before '<' token
  462. ~/.node-gyp/3.0.0/include/node/node.h: In function 'ssize_t node::DecodeWrite(char*, size_t, int)':
  463. ~/.node-gyp/3.0.0/include/node/node.h:330:1: error: 'val' was not declared in this scope
  464. ~/.node-gyp/3.0.0/include/node/node.h:330:1: error: expected primary-expression before ')' token
  465. ~/.node-gyp/3.0.0/include/node/node.h: At global scope:
  466. ~/.node-gyp/3.0.0/include/node/node.h:362:9: error: typedef 'node::addon_register_func' is initialized (use decltype instead)
  467. ~/.node-gyp/3.0.0/include/node/node.h:362:5: error: 'Handle' is not a member of 'v8'
  468. ~/.node-gyp/3.0.0/include/node/node.h:362:26: error: expected primary-expression before '>' token
  469. ~/.node-gyp/3.0.0/include/node/node.h:362:28: error: 'exports' was not declared in this scope
  470. ~/.node-gyp/3.0.0/include/node/node.h:363:5: error: 'Handle' is not a member of 'v8'
  471. ~/.node-gyp/3.0.0/include/node/node.h:363:25: error: expected primary-expression before '>' token
  472. ~/.node-gyp/3.0.0/include/node/node.h:363:27: error: 'module' was not declared in this scope
  473. ~/.node-gyp/3.0.0/include/node/node.h:364:5: error: expected primary-expression before 'void'
  474. ~/.node-gyp/3.0.0/include/node/node.h:367:9: error: typedef 'node::addon_context_register_func' is initialized (use decltype instead)
  475. ~/.node-gyp/3.0.0/include/node/node.h:367:5: error: 'Handle' is not a member of 'v8'
  476. ~/.node-gyp/3.0.0/include/node/node.h:367:26: error: expected primary-expression before '>' token
  477. ~/.node-gyp/3.0.0/include/node/node.h:367:28: error: 'exports' was not declared in this scope
  478. ~/.node-gyp/3.0.0/include/node/node.h:368:5: error: 'Handle' is not a member of 'v8'
  479. ~/.node-gyp/3.0.0/include/node/node.h:368:25: error: expected primary-expression before '>' token
  480. ~/.node-gyp/3.0.0/include/node/node.h:368:27: error: 'module' was not declared in this scope
  481. ~/.node-gyp/3.0.0/include/node/node.h:369:5: error: 'Handle' is not a member of 'v8'
  482. ~/.node-gyp/3.0.0/include/node/node.h:369:27: error: expected primary-expression before '>' token
  483. ~/.node-gyp/3.0.0/include/node/node.h:369:29: error: 'context' was not declared in this scope
  484. ~/.node-gyp/3.0.0/include/node/node.h:370:5: error: expected primary-expression before 'void'
  485. ~/.node-gyp/3.0.0/include/node/node.h:380:3: error: 'addon_register_func' in namespace 'node' does not name a type
  486. ~/.node-gyp/3.0.0/include/node/node.h:381:3: error: 'addon_context_register_func' in namespace 'node' does not name a type
  487. In file included from ../src/compat.h:20:0,
  488. from ../src/compat-inl.h:18,
  489. from ../src/heapdump.cc:17:
  490. ~/.node-gyp/3.0.0/include/node/v8-profiler.h:63:3: error: 'Handle' does not name a type
  491. ~/.node-gyp/3.0.0/include/node/v8-profiler.h:69:3: error: 'Handle' does not name a type
  492. ~/.node-gyp/3.0.0/include/node/v8-profiler.h:132:3: error: 'Handle' does not name a type
  493. ~/.node-gyp/3.0.0/include/node/v8-profiler.h:201:23: error: 'Handle' has not been declared
  494. ~/.node-gyp/3.0.0/include/node/v8-profiler.h:201:29: error: expected ',' or '...' before '<' token
  495. ~/.node-gyp/3.0.0/include/node/v8-profiler.h:207:15: error: expected ';' at end of member declaration
  496. ~/.node-gyp/3.0.0/include/node/v8-profiler.h:207:35: error: expected ')' before '<' token
  497. ~/.node-gyp/3.0.0/include/node/v8-profiler.h:249:3: error: 'Handle' does not name a type
  498. ~/.node-gyp/3.0.0/include/node/v8-profiler.h:289:3: error: 'Handle' does not name a type
  499. ~/.node-gyp/3.0.0/include/node/v8-profiler.h:433:27: error: 'Handle' has not been declared
  500. ~/.node-gyp/3.0.0/include/node/v8-profiler.h:433:33: error: expected ',' or '...' before '<' token
  501. ~/.node-gyp/3.0.0/include/node/v8-profiler.h:445:32: error: 'Handle' has not been declared
  502. ~/.node-gyp/3.0.0/include/node/v8-profiler.h:445:38: error: expected ',' or '...' before '<' token
  503. ~/.node-gyp/3.0.0/include/node/v8-profiler.h:451:3: error: 'Handle' does not name a type
  504. ~/.node-gyp/3.0.0/include/node/v8-profiler.h:476:33: error: 'GetName' declared as a 'virtual' field
  505. ~/.node-gyp/3.0.0/include/node/v8-profiler.h:476:25: error: expected ';' at end of member declaration
  506. ~/.node-gyp/3.0.0/include/node/v8-profiler.h:476:39: error: expected ')' before '<' token
  507. In file included from ../src/heapdump.cc:17:0:
  508. ../src/compat-inl.h: In function 'v8::Local<v8::Boolean> compat::True(v8::Isolate*)':
  509. ../src/compat-inl.h:51:34: error: 'True' is not a member of 'v8'
  510. ../src/compat-inl.h:51:34: note: suggested alternative:
  511. ../src/compat-inl.h:49:24: note: 'compat::True'
  512. ../src/compat-inl.h: In function 'v8::Local<v8::Boolean> compat::False(v8::Isolate*)':
  513. ../src/compat-inl.h:56:34: error: 'False' is not a member of 'v8'
  514. ../src/compat-inl.h:56:34: note: suggested alternative:
  515. ../src/compat-inl.h:54:24: note: 'compat::False'
  516. ../src/compat-inl.h: In function 'v8::Local<v8::Primitive> compat::Null(v8::Isolate*)':
  517. ../src/compat-inl.h:61:36: error: 'Null' is not a member of 'v8'
  518. ../src/compat-inl.h:61:36: note: suggested alternative:
  519. ../src/compat-inl.h:59:26: note: 'compat::Null'
  520. ../src/compat-inl.h: In function 'v8::Local<v8::Primitive> compat::Undefined(v8::Isolate*)':
  521. ../src/compat-inl.h:66:36: error: 'Undefined' is not a member of 'v8'
  522. ../src/compat-inl.h:66:36: note: suggested alternative:
  523. ../src/compat-inl.h:64:26: note: 'compat::Undefined'
  524. ../src/compat-inl.h: In static member function 'static v8::Local<v8::Boolean> compat::Boolean::New(v8::Isolate*, bool)':
  525. ../src/compat-inl.h:76:34: error: 'New' is not a member of 'v8::Boolean'
  526. ../src/compat-inl.h: In member function 'compat::ReturnType compat::ReturnableHandleScope::ThrowError(v8::Local<v8::String>)':
  527. ../src/compat-inl.h:172:46: error: no matching function for call to 'v8::Exception::Error(v8::Local<v8::String>&)'
  528. ../src/compat-inl.h:172:46: note: candidate is:
  529. ~/.node-gyp/3.0.0/include/node/v8.h:4641:23: note: static v8::Local<v8::Value> v8::Exception::Error(int)
  530. ~/.node-gyp/3.0.0/include/node/v8.h:4641:23: note: no known conversion for argument 1 from 'v8::Local<v8::String>' to 'int'
  531. ../src/compat-inl.h:172:47: error: return-statement with a value, in function returning 'void' [-fpermissive]
  532. ../src/compat-inl.h: In member function 'compat::ReturnType compat::ReturnableHandleScope::ThrowRangeError(v8::Local<v8::String>)':
  533. ../src/compat-inl.h:181:51: error: no matching function for call to 'v8::Exception::RangeError(v8::Local<v8::String>&)'
  534. ../src/compat-inl.h:181:51: note: candidate is:
  535. ~/.node-gyp/3.0.0/include/node/v8.h:4637:23: note: static v8::Local<v8::Value> v8::Exception::RangeError(int)
  536. ~/.node-gyp/3.0.0/include/node/v8.h:4637:23: note: no known conversion for argument 1 from 'v8::Local<v8::String>' to 'int'
  537. ../src/compat-inl.h:181:52: error: return-statement with a value, in function returning 'void' [-fpermissive]
  538. ../src/compat-inl.h: In member function 'compat::ReturnType compat::ReturnableHandleScope::ThrowReferenceError(v8::Local<v8::String>)':
  539. ../src/compat-inl.h:190:55: error: no matching function for call to 'v8::Exception::ReferenceError(v8::Local<v8::String>&)'
  540. ../src/compat-inl.h:190:55: note: candidate is:
  541. ~/.node-gyp/3.0.0/include/node/v8.h:4638:23: note: static v8::Local<v8::Value> v8::Exception::ReferenceError(int)
  542. ~/.node-gyp/3.0.0/include/node/v8.h:4638:23: note: no known conversion for argument 1 from 'v8::Local<v8::String>' to 'int'
  543. ../src/compat-inl.h:190:56: error: return-statement with a value, in function returning 'void' [-fpermissive]
  544. ../src/compat-inl.h: In member function 'compat::ReturnType compat::ReturnableHandleScope::ThrowSyntaxError(v8::Local<v8::String>)':
  545. ../src/compat-inl.h:199:52: error: no matching function for call to 'v8::Exception::SyntaxError(v8::Local<v8::String>&)'
  546. ../src/compat-inl.h:199:52: note: candidate is:
  547. ~/.node-gyp/3.0.0/include/node/v8.h:4639:23: note: static v8::Local<v8::Value> v8::Exception::SyntaxError(int)
  548. ~/.node-gyp/3.0.0/include/node/v8.h:4639:23: note: no known conversion for argument 1 from 'v8::Local<v8::String>' to 'int'
  549. ../src/compat-inl.h:199:53: error: return-statement with a value, in function returning 'void' [-fpermissive]
  550. ../src/compat-inl.h: In member function 'compat::ReturnType compat::ReturnableHandleScope::ThrowTypeError(v8::Local<v8::String>)':
  551. ../src/compat-inl.h:208:50: error: no matching function for call to 'v8::Exception::TypeError(v8::Local<v8::String>&)'
  552. ../src/compat-inl.h:208:50: note: candidate is:
  553. ~/.node-gyp/3.0.0/include/node/v8.h:4640:23: note: static v8::Local<v8::Value> v8::Exception::TypeError(int)
  554. ~/.node-gyp/3.0.0/include/node/v8.h:4640:23: note: no known conversion for argument 1 from 'v8::Local<v8::String>' to 'int'
  555. ../src/compat-inl.h:208:51: error: return-statement with a value, in function returning 'void' [-fpermissive]
  556. ../src/compat-inl.h: In static member function 'static void compat::CpuProfiler::StartCpuProfiling(v8::Isolate*, v8::Local<v8::String>)':
  557. ../src/compat-inl.h:300:73: error: no matching function for call to 'v8::CpuProfiler::StartProfiling(v8::Local<v8::String>&, const bool&)'
  558. ../src/compat-inl.h:300:73: note: candidate is:
  559. ~/.node-gyp/3.0.0/include/node/v8-profiler.h:201:8: note: void v8::CpuProfiler::StartProfiling(int)
  560. ~/.node-gyp/3.0.0/include/node/v8-profiler.h:201:8: note: candidate expects 1 argument, 2 provided
  561. ../src/compat-inl.h:300:73: error: return-statement with a value, in function returning 'void' [-fpermissive]
  562. ../src/compat-inl.h: In static member function 'static const v8::CpuProfile* compat::CpuProfiler::StopCpuProfiling(v8::Isolate*, v8::Local<v8::String>)':
  563. ../src/compat-inl.h:310:56: error: 'isolate->v8::Isolate::GetCpuProfiler()->v8::CpuProfiler::StopProfiling' cannot be used as a function
  564. ../src/compat-inl.h: In member function 'compat::ReturnType compat::ReturnableHandleScope::Return(v8::Local<v8::Value>)':
  565. ../src/compat-inl.h:369:42: error: no matching function for call to 'v8::ReturnValue<v8::Value>::Set(v8::Local<v8::Value>&)'
  566. ../src/compat-inl.h:369:42: note: candidates are:
  567. ~/.node-gyp/3.0.0/include/node/v8.h:2952:40: note: template<class S> void v8::ReturnValue::Set(const v8::Persistent<S>&) [with S = S, T = v8::Value]
  568. ~/.node-gyp/3.0.0/include/node/v8.h:2953:40: note: template<class S> void v8::ReturnValue::Set(int) [with S = S, T = v8::Value]
  569. ~/.node-gyp/3.0.0/include/node/v8.h:7108:6: note: void v8::ReturnValue<T>::Set(bool) [with T = v8::Value]
  570. ~/.node-gyp/3.0.0/include/node/v8.h:7108:6: note: no known conversion for argument 1 from 'v8::Local<v8::Value>' to 'bool'
  571. ~/.node-gyp/3.0.0/include/node/v8.h:7079:6: note: void v8::ReturnValue<T>::Set(double) [with T = v8::Value]
  572. ~/.node-gyp/3.0.0/include/node/v8.h:7079:6: note: no known conversion for argument 1 from 'v8::Local<v8::Value>' to 'double'
  573. ~/.node-gyp/3.0.0/include/node/v8.h:7085:6: note: void v8::ReturnValue<T>::Set(int32_t) [with T = v8::Value, int32_t = int]
  574. ~/.node-gyp/3.0.0/include/node/v8.h:7085:6: note: no known conversion for argument 1 from 'v8::Local<v8::Value>' to 'int'
  575. ~/.node-gyp/3.0.0/include/node/v8.h:7096:6: note: void v8::ReturnValue<T>::Set(uint32_t) [with T = v8::Value, uint32_t = unsigned int]
  576. ~/.node-gyp/3.0.0/include/node/v8.h:7096:6: note: no known conversion for argument 1 from 'v8::Local<v8::Value>' to 'unsigned int'
  577. ~/.node-gyp/3.0.0/include/node/v8.h:2968:18: note: template<class S> void v8::ReturnValue::Set(S*) [with S = S, T = v8::Value]
  578. ../src/compat-inl.h:369:42: error: return-statement with a value, in function returning 'void' [-fpermissive]
  579. ../src/heapdump.cc: At global scope:
  580. ../src/heapdump.cc:52:11: error: 'v8::Handle' has not been declared
  581. ../src/heapdump.cc: In function 'compat::ReturnType {anonymous}::WriteSnapshot(const ArgumentType&)':
  582. ../src/heapdump.cc:106:46: error: no matching function for call to 'v8::String::Utf8Value::Utf8Value(v8::Local<v8::Value>)'
  583. ../src/heapdump.cc:106:46: note: candidate is:
  584. ~/.node-gyp/3.0.0/include/node/v8.h:2355:5: note: v8::String::Utf8Value::Utf8Value(const v8::String::Utf8Value&)
  585. ~/.node-gyp/3.0.0/include/node/v8.h:2355:5: note: no known conversion for argument 1 from 'v8::Local<v8::Value>' to 'const v8::String::Utf8Value&'
  586. ../src/heapdump.cc: In function 'void {anonymous}::InvokeCallback(const char*)':
  587. ../src/heapdump.cc:143:3: error: 'MakeCallback' is not a member of 'node'
  588. ../src/heapdump.cc: In function 'void {anonymous}::Initialize(v8::Local<v8::Object>)':
  589. ../src/heapdump.cc:164:51: error: no matching function for call to 'v8::Object::Set(v8::Local<v8::String>, v8::Local<v8::Integer>)'
  590. ../src/heapdump.cc:164:51: note: candidates are:
  591. ~/.node-gyp/3.0.0/include/node/v8.h:2564:3: note: bool v8::Object::Set(int)
  592. ~/.node-gyp/3.0.0/include/node/v8.h:2564:3: note: candidate expects 1 argument, 2 provided
  593. ~/.node-gyp/3.0.0/include/node/v8.h:2566:37: note: v8::Maybe<bool> v8::Object::Set(v8::Local<v8::Context>, v8::Local<v8::Value>, v8::Local<v8::Value>)
  594. ~/.node-gyp/3.0.0/include/node/v8.h:2566:37: note: candidate expects 3 arguments, 2 provided
  595. ~/.node-gyp/3.0.0/include/node/v8.h:2569:3: note: bool v8::Object::Set(uint32_t, int)
  596. ~/.node-gyp/3.0.0/include/node/v8.h:2569:3: note: no known conversion for argument 1 from 'v8::Local<v8::String>' to 'uint32_t {aka unsigned int}'
  597. ~/.node-gyp/3.0.0/include/node/v8.h:2571:37: note: v8::Maybe<bool> v8::Object::Set(v8::Local<v8::Context>, uint32_t, v8::Local<v8::Value>)
  598. ~/.node-gyp/3.0.0/include/node/v8.h:2571:37: note: candidate expects 3 arguments, 2 provided
  599. ../src/heapdump.cc:166:53: error: no matching function for call to 'v8::Object::Set(v8::Local<v8::String>, v8::Local<v8::Integer>)'
  600. ../src/heapdump.cc:166:53: note: candidates are:
  601. ~/.node-gyp/3.0.0/include/node/v8.h:2564:3: note: bool v8::Object::Set(int)
  602. ~/.node-gyp/3.0.0/include/node/v8.h:2564:3: note: candidate expects 1 argument, 2 provided
  603. ~/.node-gyp/3.0.0/include/node/v8.h:2566:37: note: v8::Maybe<bool> v8::Object::Set(v8::Local<v8::Context>, v8::Local<v8::Value>, v8::Local<v8::Value>)
  604. ~/.node-gyp/3.0.0/include/node/v8.h:2566:37: note: candidate expects 3 arguments, 2 provided
  605. ~/.node-gyp/3.0.0/include/node/v8.h:2569:3: note: bool v8::Object::Set(uint32_t, int)
  606. ~/.node-gyp/3.0.0/include/node/v8.h:2569:3: note: no known conversion for argument 1 from 'v8::Local<v8::String>' to 'uint32_t {aka unsigned int}'
  607. ~/.node-gyp/3.0.0/include/node/v8.h:2571:37: note: v8::Maybe<bool> v8::Object::Set(v8::Local<v8::Context>, uint32_t, v8::Local<v8::Value>)
  608. ~/.node-gyp/3.0.0/include/node/v8.h:2571:37: note: candidate expects 3 arguments, 2 provided
  609. ../src/heapdump.cc:168:75: error: no matching function for call to 'v8::Object::Set(v8::Local<v8::String>, v8::Local<v8::Function>)'
  610. ../src/heapdump.cc:168:75: note: candidates are:
  611. ~/.node-gyp/3.0.0/include/node/v8.h:2564:3: note: bool v8::Object::Set(int)
  612. ~/.node-gyp/3.0.0/include/node/v8.h:2564:3: note: candidate expects 1 argument, 2 provided
  613. ~/.node-gyp/3.0.0/include/node/v8.h:2566:37: note: v8::Maybe<bool> v8::Object::Set(v8::Local<v8::Context>, v8::Local<v8::Value>, v8::Local<v8::Value>)
  614. ~/.node-gyp/3.0.0/include/node/v8.h:2566:37: note: candidate expects 3 arguments, 2 provided
  615. ~/.node-gyp/3.0.0/include/node/v8.h:2569:3: note: bool v8::Object::Set(uint32_t, int)
  616. ~/.node-gyp/3.0.0/include/node/v8.h:2569:3: note: no known conversion for argument 1 from 'v8::Local<v8::String>' to 'uint32_t {aka unsigned int}'
  617. ~/.node-gyp/3.0.0/include/node/v8.h:2571:37: note: v8::Maybe<bool> v8::Object::Set(v8::Local<v8::Context>, uint32_t, v8::Local<v8::Value>)
  618. ~/.node-gyp/3.0.0/include/node/v8.h:2571:37: note: candidate expects 3 arguments, 2 provided
  619. ../src/heapdump.cc:170:79: error: no matching function for call to 'v8::Object::Set(v8::Local<v8::String>, v8::Local<v8::Function>)'
  620. ../src/heapdump.cc:170:79: note: candidates are:
  621. ~/.node-gyp/3.0.0/include/node/v8.h:2564:3: note: bool v8::Object::Set(int)
  622. ~/.node-gyp/3.0.0/include/node/v8.h:2564:3: note: candidate expects 1 argument, 2 provided
  623. ~/.node-gyp/3.0.0/include/node/v8.h:2566:37: note: v8::Maybe<bool> v8::Object::Set(v8::Local<v8::Context>, v8::Local<v8::Value>, v8::Local<v8::Value>)
  624. ~/.node-gyp/3.0.0/include/node/v8.h:2566:37: note: candidate expects 3 arguments, 2 provided
  625. ~/.node-gyp/3.0.0/include/node/v8.h:2569:3: note: bool v8::Object::Set(uint32_t, int)
  626. ~/.node-gyp/3.0.0/include/node/v8.h:2569:3: note: no known conversion for argument 1 from 'v8::Local<v8::String>' to 'uint32_t {aka unsigned int}'
  627. ~/.node-gyp/3.0.0/include/node/v8.h:2571:37: note: v8::Maybe<bool> v8::Object::Set(v8::Local<v8::Context>, uint32_t, v8::Local<v8::Value>)
  628. ~/.node-gyp/3.0.0/include/node/v8.h:2571:37: note: candidate expects 3 arguments, 2 provided
  629. ../src/heapdump.cc: At global scope:
  630. ../src/heapdump.cc:173:1: error: 'addon_register_func' is not a member of 'node'
  631. In file included from ~/.node-gyp/3.0.0/include/node/node.h:42:0,
  632. from ../src/heapdump.cc:15:
  633. ~/.node-gyp/3.0.0/include/node/v8.h: In member function 'v8::Local<v8::Value> v8::FunctionCallbackInfo<T>::operator[](int) const [with T = v8::Value]':
  634. ../src/heapdump.cc:94:39: instantiated from here
  635. ~/.node-gyp/3.0.0/include/node/v8.h:7174:74: error: 'Undefined' was not declared in this scope
  636. ~/.node-gyp/3.0.0/include/node/v8.h:7174:74: note: suggested alternative:
  637. ../src/compat-inl.h:64:26: note: 'compat::Undefined'
  638. In file included from ../src/heapdump.cc:17:0:
  639. ../src/compat-inl.h: In member function 'void compat::Persistent<T>::Reset(v8::Isolate*, v8::Local<T>) [with T = v8::Function]':
  640. ../src/heapdump.cc:101:49: instantiated from here
  641. ../src/compat-inl.h:358:3: error: no matching function for call to 'v8::Persistent<v8::Function, v8::NonCopyablePersistentTraits<v8::Function> >::Reset(v8::Isolate*&, v8::Local<v8::Function>&)'
  642. ../src/compat-inl.h:358:3: note: candidates are:
  643. ~/.node-gyp/3.0.0/include/node/v8.h:6933:6: note: void v8::PersistentBase<T>::Reset() [with T = v8::Function]
  644. ~/.node-gyp/3.0.0/include/node/v8.h:6933:6: note: candidate expects 0 arguments, 2 provided
  645. ~/.node-gyp/3.0.0/include/node/v8.h:499:18: note: template<class S> void v8::PersistentBase::Reset(v8::Isolate*, int) [with S = S, T = v8::Function]
  646. ~/.node-gyp/3.0.0/include/node/v8.h:506:18: note: template<class S> void v8::PersistentBase::Reset(v8::Isolate*, const v8::PersistentBase<S>&) [with S = S, T = v8::Function]
  647. make: *** [Release/obj.target/addon/src/heapdump.o] Error 1
  648. make: Leaving directory `~/dev.example.com/pm2/node_modules/heapdump/build'
  649. gyp ERR! build error
  650. gyp ERR! stack Error: `make` failed with exit code: 2
  651. gyp ERR! stack at ChildProcess.onExit (~/.nvm/versions/io.js/v3.0.0/lib/node_modules/npm/node_modules/node-gyp/lib/build.js:269:23)
  652. gyp ERR! stack at emitTwo (events.js:87:13)
  653. gyp ERR! stack at ChildProcess.emit (events.js:172:7)
  654. gyp ERR! stack at Process.ChildProcess._handle.onexit (internal/child_process.js:200:12)
  655. gyp ERR! System Linux 3.1.9-vs2.3.2.5vs2.3.2.5+
  656. gyp ERR! command "~/.nvm/versions/io.js/v3.0.0/bin/iojs" "~/.nvm/versions/io.js/v3.0.0/lib/node_modules/npm/node_modules/node-gyp/bin/node-gyp.js" "rebuild"
  657. gyp ERR! cwd ~/dev.example.com/pm2/node_modules/heapdump
  658. gyp ERR! node -v v3.0.0
  659. gyp ERR! node-gyp -v v2.0.2
  660. gyp ERR! not ok
  661. npm ERR! Linux 3.1.9-vs2.3.2.5vs2.3.2.5+
  662. npm ERR! argv "~/.nvm/versions/io.js/v3.0.0/bin/iojs" "~/.nvm/versions/io.js/v3.0.0/bin/npm" "install" "heapdump"
  663. npm ERR! node v3.0.0
  664. npm ERR! npm v2.13.3
  665. npm ERR! code ELIFECYCLE
  666.  
  667. npm ERR! [email protected] install: `node-gyp rebuild`
  668. npm ERR! Exit status 1
  669. npm ERR!
  670. npm ERR! Failed at the [email protected] install script 'node-gyp rebuild'.
  671. npm ERR! This is most likely a problem with the heapdump package,
  672. npm ERR! not with npm itself.
  673. npm ERR! Tell the author that this fails on your system:
  674. npm ERR! node-gyp rebuild
  675. npm ERR! You can get their info via:
  676. npm ERR! npm owner ls heapdump
  677. npm ERR! There is likely additional logging output above.
  678.  
  679. npm ERR! Please include the following file with any support request:
  680. npm ERR! ~/dev.example.com/pm2/npm-debug.log
Add Comment
Please, Sign In to add comment