This week only. Pastebin PRO Accounts Christmas Special! Don't miss out!Want more features on Pastebin? Sign Up, it's FREE!
Guest

Untitled

By: a guest on Jan 28th, 2012  |  syntax: None  |  size: 88.73 KB  |  views: 48  |  expires: Never
download  |  raw  |  embed  |  report abuse  |  print
Text below is selected. Please press Ctrl+C to copy to your clipboard. (⌘+C on Mac)
  1. cd /home/rcbandit/Desktop/NetBeans/Prototype_3/SH_27/SH_27-impl; JAVA_HOME=/opt/jdk1.7.0_02 /home/rcbandit/netbeans-7.0.1/java/maven/bin/mvn clean package -X
  2. Apache Maven 3.0.3 (r1075438; 2011-02-28 19:31:09+0200)
  3. Maven home: /home/rcbandit/netbeans-7.0.1/java/maven
  4. Java version: 1.7.0_02, vendor: Oracle Corporation
  5. Java home: /opt/jdk1.7.0_02/jre
  6. Default locale: en_US, platform encoding: UTF-8
  7. OS name: "linux", version: "3.2.2-1.fc16.x86_64", arch: "amd64", family: "unix"
  8. Error stacktraces are turned on.
  9. Reading global settings from /home/rcbandit/netbeans-7.0.1/java/maven/conf/settings.xml
  10. Reading user settings from /home/rcbandit/.m2/settings.xml
  11. Using local repository at /home/rcbandit/.m2/repository
  12. Using manager EnhancedLocalRepositoryManager with priority 10 for /home/rcbandit/.m2/repository
  13. Scanning for projects...
  14. Resolving plugin version for org.apache.felix:maven-bundle-plugin
  15. Could not find metadata org.apache.felix:maven-bundle-plugin/maven-metadata.xml in local (/home/rcbandit/.m2/repository)
  16. Skipped remote update check for org.apache.felix:maven-bundle-plugin/maven-metadata.xml, locally cached metadata up-to-date.
  17. Resolved plugin version for org.apache.felix:maven-bundle-plugin to 2.3.6 from repository central (http://repo1.maven.org/maven2, releases)
  18. org.apache.felix:maven-bundle-plugin:jar:2.3.6:
  19.    biz.aQute:bndlib:jar:1.50.0:compile
  20.    org.apache.felix:org.apache.felix.bundlerepository:jar:1.6.6:compile
  21.       org.osgi:org.osgi.core:jar:4.1.0:compile
  22.       org.easymock:easymock:jar:2.4:compile
  23.    org.apache.maven:maven-core:jar:2.0.7:compile
  24.       org.apache.maven:maven-settings:jar:2.0.7:compile
  25.       org.apache.maven:maven-plugin-parameter-documenter:jar:2.0.7:compile
  26.       org.apache.maven.reporting:maven-reporting-api:jar:2.0.7:compile
  27.          org.apache.maven.doxia:doxia-sink-api:jar:1.0-alpha-7:compile
  28.       org.apache.maven:maven-profile:jar:2.0.7:compile
  29.       org.apache.maven:maven-model:jar:2.0.7:compile
  30.       org.apache.maven:maven-artifact:jar:2.0.7:compile
  31.       org.codehaus.plexus:plexus-container-default:jar:1.0-alpha-9-stable-1:compile
  32.          junit:junit:jar:3.8.1:compile
  33.       org.apache.maven:maven-repository-metadata:jar:2.0.7:compile
  34.       org.apache.maven:maven-error-diagnostics:jar:2.0.7:compile
  35.       org.apache.maven:maven-project:jar:2.0.7:compile
  36.          org.apache.maven:maven-plugin-registry:jar:2.0.7:compile
  37.       commons-cli:commons-cli:jar:1.0:compile
  38.       org.apache.maven:maven-plugin-api:jar:2.0.7:compile
  39.       org.apache.maven:maven-plugin-descriptor:jar:2.0.7:compile
  40.       org.codehaus.plexus:plexus-interactivity-api:jar:1.0-alpha-4:compile
  41.       org.apache.maven:maven-artifact-manager:jar:2.0.7:compile
  42.       org.apache.maven:maven-monitor:jar:2.0.7:compile
  43.       classworlds:classworlds:jar:1.1:compile
  44.    org.apache.maven:maven-archiver:jar:2.4.1:compile
  45.       org.codehaus.plexus:plexus-archiver:jar:1.0:compile
  46.          org.codehaus.plexus:plexus-io:jar:1.0:compile
  47.       org.codehaus.plexus:plexus-interpolation:jar:1.13:compile
  48.    org.apache.maven.shared:maven-dependency-tree:jar:1.2:compile
  49.    org.codehaus.plexus:plexus-utils:jar:2.1:compile
  50. Created new class realm maven.api
  51. Importing foreign packages into class realm maven.api
  52.   Imported: org.apache.maven.wagon.events < plexus.core
  53.   Imported: org.sonatype.aether.transfer < plexus.core
  54.   Imported: org.apache.maven.exception < plexus.core
  55.   Imported: org.sonatype.aether.metadata < plexus.core
  56.   Imported: org.codehaus.plexus.util.xml.Xpp3Dom < plexus.core
  57.   Imported: org.sonatype.aether.collection < plexus.core
  58.   Imported: org.sonatype.aether.version < plexus.core
  59.   Imported: org.apache.maven.monitor < plexus.core
  60.   Imported: org.apache.maven.wagon.repository < plexus.core
  61.   Imported: org.apache.maven.repository < plexus.core
  62.   Imported: org.apache.maven.wagon.resource < plexus.core
  63.   Imported: org.codehaus.plexus.logging < plexus.core
  64.   Imported: org.apache.maven.profiles < plexus.core
  65.   Imported: org.sonatype.aether.repository < plexus.core
  66.   Imported: org.apache.maven.classrealm < plexus.core
  67.   Imported: org.apache.maven.execution < plexus.core
  68.   Imported: org.sonatype.aether.artifact < plexus.core
  69.   Imported: org.sonatype.aether.spi < plexus.core
  70.   Imported: org.apache.maven.reporting < plexus.core
  71.   Imported: org.apache.maven.usability < plexus.core
  72.   Imported: org.codehaus.plexus.container < plexus.core
  73.   Imported: org.codehaus.plexus.component < plexus.core
  74.   Imported: org.codehaus.plexus.util.xml.pull.XmlSerializer < plexus.core
  75.   Imported: org.apache.maven.wagon.authentication < plexus.core
  76.   Imported: org.apache.maven.lifecycle < plexus.core
  77.   Imported: org.codehaus.plexus.classworlds < plexus.core
  78.   Imported: org.sonatype.aether.graph < plexus.core
  79.   Imported: org.sonatype.aether.* < plexus.core
  80.   Imported: org.apache.maven.settings < plexus.core
  81.   Imported: org.codehaus.classworlds < plexus.core
  82.   Imported: org.sonatype.aether.impl < plexus.core
  83.   Imported: org.apache.maven.wagon.* < plexus.core
  84.   Imported: org.apache.maven.toolchain < plexus.core
  85.   Imported: org.sonatype.aether.deployment < plexus.core
  86.   Imported: org.apache.maven.wagon.observers < plexus.core
  87.   Imported: org.codehaus.plexus.util.xml.pull.XmlPullParserException < plexus.core
  88.   Imported: org.codehaus.plexus.util.xml.pull.XmlPullParser < plexus.core
  89.   Imported: org.apache.maven.configuration < plexus.core
  90.   Imported: org.apache.maven.cli < plexus.core
  91.   Imported: org.sonatype.aether.installation < plexus.core
  92.   Imported: org.codehaus.plexus.context < plexus.core
  93.   Imported: org.apache.maven.wagon.authorization < plexus.core
  94.   Imported: org.apache.maven.project < plexus.core
  95.   Imported: org.apache.maven.rtinfo < plexus.core
  96.   Imported: org.codehaus.plexus.lifecycle < plexus.core
  97.   Imported: org.codehaus.plexus.configuration < plexus.core
  98.   Imported: org.apache.maven.artifact < plexus.core
  99.   Imported: org.apache.maven.model < plexus.core
  100.   Imported: org.apache.maven.* < plexus.core
  101.   Imported: org.apache.maven.wagon.proxy < plexus.core
  102.   Imported: org.sonatype.aether.resolution < plexus.core
  103.   Imported: org.apache.maven.plugin < plexus.core
  104.   Imported: org.codehaus.plexus.* < plexus.core
  105.   Imported: org.codehaus.plexus.personality < plexus.core
  106. Populating class realm maven.api
  107. Created new class realm extension>org.apache.felix:maven-bundle-plugin:2.3.6
  108. Importing foreign packages into class realm extension>org.apache.felix:maven-bundle-plugin:2.3.6
  109.   Imported:  < maven.api
  110. Populating class realm extension>org.apache.felix:maven-bundle-plugin:2.3.6
  111.   Included: org.apache.felix:maven-bundle-plugin:jar:2.3.6
  112.   Included: biz.aQute:bndlib:jar:1.50.0
  113.   Included: org.apache.felix:org.apache.felix.bundlerepository:jar:1.6.6
  114.   Included: org.osgi:org.osgi.core:jar:4.1.0
  115.   Included: org.easymock:easymock:jar:2.4
  116.   Included: org.apache.maven.reporting:maven-reporting-api:jar:2.0.7
  117.   Included: org.apache.maven.doxia:doxia-sink-api:jar:1.0-alpha-7
  118.   Included: junit:junit:jar:3.8.1
  119.   Included: commons-cli:commons-cli:jar:1.0
  120.   Included: org.codehaus.plexus:plexus-interactivity-api:jar:1.0-alpha-4
  121.   Included: org.apache.maven:maven-archiver:jar:2.4.1
  122.   Included: org.codehaus.plexus:plexus-archiver:jar:1.0
  123.   Included: org.codehaus.plexus:plexus-io:jar:1.0
  124.   Included: org.codehaus.plexus:plexus-interpolation:jar:1.13
  125.   Included: org.apache.maven.shared:maven-dependency-tree:jar:1.2
  126.   Included: org.codehaus.plexus:plexus-utils:jar:2.1
  127. Extension realms for project org.DX_57.osgi.SH_27:SH_27-impl:bundle:1.0-SNAPSHOT: [ClassRealm[extension>org.apache.felix:maven-bundle-plugin:2.3.6, parent: sun.misc.Launcher$AppClassLoader@397577f9]]
  128. Created new class realm project>org.DX_57.osgi.SH_27:SH_27-impl:1.0-SNAPSHOT
  129. Populating class realm project>org.DX_57.osgi.SH_27:SH_27-impl:1.0-SNAPSHOT
  130. Looking up lifecyle mappings for packaging bundle from ClassRealm[project>org.DX_57.osgi.SH_27:SH_27-impl:1.0-SNAPSHOT, parent: ClassRealm[maven.api, parent: null]]
  131.  
  132. Some problems were encountered while building the effective model for org.DX_57.osgi.SH_27:SH_27-impl:bundle:1.0-SNAPSHOT
  133. 'build.plugins.plugin.version' for org.apache.felix:maven-bundle-plugin is missing. @ line 40, column 21
  134. The expression ${pom.groupId} is deprecated. Please use ${project.groupId} instead.
  135. The expression ${pom.groupId} is deprecated. Please use ${project.groupId} instead.
  136. The expression ${pom.artifactId} is deprecated. Please use ${project.artifactId} instead.
  137. The expression ${pom.groupId} is deprecated. Please use ${project.groupId} instead.
  138.  
  139. It is highly recommended to fix these problems because they threaten the stability of your build.
  140.  
  141. For this reason, future Maven versions might no longer support building such malformed projects.
  142.  
  143. === REACTOR BUILD PLAN ================================================
  144. Project: org.DX_57.osgi.SH_27:SH_27-impl:bundle:1.0-SNAPSHOT
  145. Tasks:   [clean, package]
  146. Style:   Regular
  147. =======================================================================
  148.                                                                        
  149. ------------------------------------------------------------------------
  150. Building SH_27-impl 1.0-SNAPSHOT
  151. ------------------------------------------------------------------------
  152. Resolving plugin version for org.apache.maven.plugins:maven-install-plugin
  153. Could not find metadata org.apache.maven.plugins:maven-install-plugin/maven-metadata.xml in local (/home/rcbandit/.m2/repository)
  154. Skipped remote update check for org.apache.maven.plugins:maven-install-plugin/maven-metadata.xml, locally cached metadata up-to-date.
  155. Resolved plugin version for org.apache.maven.plugins:maven-install-plugin to 2.3.1 from repository central (http://repo1.maven.org/maven2, releases)
  156. Resolving plugin version for org.apache.maven.plugins:maven-resources-plugin
  157. Could not find metadata org.apache.maven.plugins:maven-resources-plugin/maven-metadata.xml in local (/home/rcbandit/.m2/repository)
  158. Skipped remote update check for org.apache.maven.plugins:maven-resources-plugin/maven-metadata.xml, locally cached metadata up-to-date.
  159. Resolved plugin version for org.apache.maven.plugins:maven-resources-plugin to 2.5 from repository central (http://repo1.maven.org/maven2, releases)
  160. Resolving plugin version for org.apache.maven.plugins:maven-surefire-plugin
  161. Could not find metadata org.apache.maven.plugins:maven-surefire-plugin/maven-metadata.xml in local (/home/rcbandit/.m2/repository)
  162. Skipped remote update check for org.apache.maven.plugins:maven-surefire-plugin/maven-metadata.xml, locally cached metadata up-to-date.
  163. Resolved plugin version for org.apache.maven.plugins:maven-surefire-plugin to 2.11 from repository central (http://repo1.maven.org/maven2, releases)
  164. Resolving plugin version for org.apache.maven.plugins:maven-deploy-plugin
  165. Could not find metadata org.apache.maven.plugins:maven-deploy-plugin/maven-metadata.xml in local (/home/rcbandit/.m2/repository)
  166. Skipped remote update check for org.apache.maven.plugins:maven-deploy-plugin/maven-metadata.xml, locally cached metadata up-to-date.
  167. Resolved plugin version for org.apache.maven.plugins:maven-deploy-plugin to 2.7 from repository central (http://repo1.maven.org/maven2, releases)
  168. Lifecycle default -> [validate, initialize, generate-sources, process-sources, generate-resources, process-resources, compile, process-classes, generate-test-sources, process-test-sources, generate-test-resources, process-test-resources, test-compile, process-test-classes, test, prepare-package, package, pre-integration-test, integration-test, post-integration-test, verify, install, deploy]
  169. Lifecycle clean -> [pre-clean, clean, post-clean]
  170. Lifecycle site -> [pre-site, site, post-site, site-deploy]
  171. Lifecycle default -> [validate, initialize, generate-sources, process-sources, generate-resources, process-resources, compile, process-classes, generate-test-sources, process-test-sources, generate-test-resources, process-test-resources, test-compile, process-test-classes, test, prepare-package, package, pre-integration-test, integration-test, post-integration-test, verify, install, deploy]
  172. Lifecycle clean -> [pre-clean, clean, post-clean]
  173. Lifecycle site -> [pre-site, site, post-site, site-deploy]
  174. Lifecycle default -> [validate, initialize, generate-sources, process-sources, generate-resources, process-resources, compile, process-classes, generate-test-sources, process-test-sources, generate-test-resources, process-test-resources, test-compile, process-test-classes, test, prepare-package, package, pre-integration-test, integration-test, post-integration-test, verify, install, deploy]
  175. Lifecycle clean -> [pre-clean, clean, post-clean]
  176. Lifecycle site -> [pre-site, site, post-site, site-deploy]
  177. Lifecycle default -> [validate, initialize, generate-sources, process-sources, generate-resources, process-resources, compile, process-classes, generate-test-sources, process-test-sources, generate-test-resources, process-test-resources, test-compile, process-test-classes, test, prepare-package, package, pre-integration-test, integration-test, post-integration-test, verify, install, deploy]
  178. Lifecycle clean -> [pre-clean, clean, post-clean]
  179. Lifecycle site -> [pre-site, site, post-site, site-deploy]
  180. Lifecycle default -> [validate, initialize, generate-sources, process-sources, generate-resources, process-resources, compile, process-classes, generate-test-sources, process-test-sources, generate-test-resources, process-test-resources, test-compile, process-test-classes, test, prepare-package, package, pre-integration-test, integration-test, post-integration-test, verify, install, deploy]
  181. Lifecycle clean -> [pre-clean, clean, post-clean]
  182. Lifecycle site -> [pre-site, site, post-site, site-deploy]
  183. Lifecycle default -> [validate, initialize, generate-sources, process-sources, generate-resources, process-resources, compile, process-classes, generate-test-sources, process-test-sources, generate-test-resources, process-test-resources, test-compile, process-test-classes, test, prepare-package, package, pre-integration-test, integration-test, post-integration-test, verify, install, deploy]
  184. Lifecycle clean -> [pre-clean, clean, post-clean]
  185. Lifecycle site -> [pre-site, site, post-site, site-deploy]
  186. Lifecycle default -> [validate, initialize, generate-sources, process-sources, generate-resources, process-resources, compile, process-classes, generate-test-sources, process-test-sources, generate-test-resources, process-test-resources, test-compile, process-test-classes, test, prepare-package, package, pre-integration-test, integration-test, post-integration-test, verify, install, deploy]
  187. Lifecycle clean -> [pre-clean, clean, post-clean]
  188. Lifecycle site -> [pre-site, site, post-site, site-deploy]
  189. Lifecycle default -> [validate, initialize, generate-sources, process-sources, generate-resources, process-resources, compile, process-classes, generate-test-sources, process-test-sources, generate-test-resources, process-test-resources, test-compile, process-test-classes, test, prepare-package, package, pre-integration-test, integration-test, post-integration-test, verify, install, deploy]
  190. Lifecycle clean -> [pre-clean, clean, post-clean]
  191. Lifecycle site -> [pre-site, site, post-site, site-deploy]
  192. Lifecycle default -> [validate, initialize, generate-sources, process-sources, generate-resources, process-resources, compile, process-classes, generate-test-sources, process-test-sources, generate-test-resources, process-test-resources, test-compile, process-test-classes, test, prepare-package, package, pre-integration-test, integration-test, post-integration-test, verify, install, deploy]
  193. Lifecycle clean -> [pre-clean, clean, post-clean]
  194. Lifecycle site -> [pre-site, site, post-site, site-deploy]
  195. === PROJECT BUILD PLAN ================================================
  196. Project:       org.DX_57.osgi.SH_27:SH_27-impl:1.0-SNAPSHOT
  197. Dependencies (collect): []
  198. Dependencies (resolve): [compile, test]
  199. Repositories (dependencies): [central (http://repo1.maven.org/maven2, releases)]
  200. Repositories (plugins)     : [central (http://repo1.maven.org/maven2, releases)]
  201. -----------------------------------------------------------------------
  202. Goal:          org.apache.maven.plugins:maven-clean-plugin:2.4.1:clean (default-clean)
  203. Style:         Regular
  204. Configuration: <?xml version="1.0" encoding="UTF-8"?>
  205. <configuration>
  206.   <directory default-value="${project.build.directory}"/>
  207.   <excludeDefaultDirectories default-value="false">${clean.excludeDefaultDirectories}</excludeDefaultDirectories>
  208.   <failOnError default-value="true">${maven.clean.failOnError}</failOnError>
  209.   <followSymLinks default-value="false">${clean.followSymLinks}</followSymLinks>
  210.   <outputDirectory default-value="${project.build.outputDirectory}"/>
  211.   <reportDirectory default-value="${project.reporting.outputDirectory}"/>
  212.   <skip default-value="false">${clean.skip}</skip>
  213.   <testOutputDirectory default-value="${project.build.testOutputDirectory}"/>
  214.   <verbose>${clean.verbose}</verbose>
  215. </configuration>
  216. -----------------------------------------------------------------------
  217. Goal:          org.apache.maven.plugins:maven-resources-plugin:2.5:resources (default-resources)
  218. Style:         Regular
  219. Configuration: <?xml version="1.0" encoding="UTF-8"?>
  220. <configuration>
  221.   <buildFilters default-value="${project.build.filters}"/>
  222.   <encoding default-value="${project.build.sourceEncoding}">${encoding}</encoding>
  223.   <escapeString>${maven.resources.escapeString}</escapeString>
  224.   <escapeWindowsPaths default-value="true">${maven.resources.escapeWindowsPaths}</escapeWindowsPaths>
  225.   <includeEmptyDirs default-value="false">${maven.resources.includeEmptyDirs}</includeEmptyDirs>
  226.   <outputDirectory default-value="${project.build.outputDirectory}"/>
  227.   <overwrite default-value="false">${maven.resources.overwrite}</overwrite>
  228.   <project default-value="${project}"/>
  229.   <resources default-value="${project.resources}"/>
  230.   <session default-value="${session}"/>
  231.   <supportMultiLineFiltering default-value="false">${maven.resources.supportMultiLineFiltering}</supportMultiLineFiltering>
  232.   <useBuildFilters default-value="true"/>
  233.   <useDefaultDelimiters default-value="true"/>
  234. </configuration>
  235. -----------------------------------------------------------------------
  236. Goal:          org.apache.maven.plugins:maven-compiler-plugin:2.3.2:compile (default-compile)
  237. Style:         Regular
  238. Configuration: <?xml version="1.0" encoding="UTF-8"?>
  239. <configuration>
  240.   <basedir default-value="${basedir}"/>
  241.   <buildDirectory default-value="${project.build.directory}"/>
  242.   <classpathElements default-value="${project.compileClasspathElements}"/>
  243.   <compileSourceRoots default-value="${project.compileSourceRoots}"/>
  244.   <compilerId default-value="javac">${maven.compiler.compilerId}</compilerId>
  245.   <compilerVersion>${maven.compiler.compilerVersion}</compilerVersion>
  246.   <debug default-value="true">${maven.compiler.debug}</debug>
  247.   <debuglevel>${maven.compiler.debuglevel}</debuglevel>
  248.   <encoding default-value="${project.build.sourceEncoding}">${encoding}</encoding>
  249.   <executable>${maven.compiler.executable}</executable>
  250.   <failOnError default-value="true">${maven.compiler.failOnError}</failOnError>
  251.   <fork default-value="false">${maven.compiler.fork}</fork>
  252.   <generatedSourcesDirectory default-value="${project.build.directory}/generated-sources/annotations"/>
  253.   <maxmem>${maven.compiler.maxmem}</maxmem>
  254.   <meminitial>${maven.compiler.meminitial}</meminitial>
  255.   <optimize default-value="false">${maven.compiler.optimize}</optimize>
  256.   <outputDirectory default-value="${project.build.outputDirectory}"/>
  257.   <outputFileName>${project.build.finalName}</outputFileName>
  258.   <projectArtifact default-value="${project.artifact}"/>
  259.   <session default-value="${session}"/>
  260.   <showDeprecation default-value="false">${maven.compiler.showDeprecation}</showDeprecation>
  261.   <showWarnings default-value="false">${maven.compiler.showWarnings}</showWarnings>
  262.   <source default-value="1.5">1.7</source>
  263.   <staleMillis default-value="0">${lastModGranularityMs}</staleMillis>
  264.   <target default-value="1.5">1.7</target>
  265.   <verbose default-value="false">${maven.compiler.verbose}</verbose>
  266. </configuration>
  267. -----------------------------------------------------------------------
  268. Goal:          org.apache.maven.plugins:maven-resources-plugin:2.5:testResources (default-testResources)
  269. Style:         Regular
  270. Configuration: <?xml version="1.0" encoding="UTF-8"?>
  271. <configuration>
  272.   <buildFilters default-value="${project.build.filters}"/>
  273.   <encoding default-value="${project.build.sourceEncoding}">${encoding}</encoding>
  274.   <escapeString>${maven.resources.escapeString}</escapeString>
  275.   <escapeWindowsPaths default-value="true">${maven.resources.escapeWindowsPaths}</escapeWindowsPaths>
  276.   <includeEmptyDirs default-value="false">${maven.resources.includeEmptyDirs}</includeEmptyDirs>
  277.   <outputDirectory>${project.build.testOutputDirectory}</outputDirectory>
  278.   <overwrite default-value="false">${maven.resources.overwrite}</overwrite>
  279.   <project default-value="${project}"/>
  280.   <resources>${project.testResources}</resources>
  281.   <session default-value="${session}"/>
  282.   <supportMultiLineFiltering default-value="false">${maven.resources.supportMultiLineFiltering}</supportMultiLineFiltering>
  283.   <useBuildFilters default-value="true"/>
  284.   <useDefaultDelimiters default-value="true"/>
  285. </configuration>
  286. -----------------------------------------------------------------------
  287. Goal:          org.apache.maven.plugins:maven-compiler-plugin:2.3.2:testCompile (default-testCompile)
  288. Style:         Regular
  289. Configuration: <?xml version="1.0" encoding="UTF-8"?>
  290. <configuration>
  291.   <basedir default-value="${basedir}"/>
  292.   <buildDirectory default-value="${project.build.directory}"/>
  293.   <classpathElements default-value="${project.testClasspathElements}"/>
  294.   <compileSourceRoots default-value="${project.testCompileSourceRoots}"/>
  295.   <compilerId default-value="javac">${maven.compiler.compilerId}</compilerId>
  296.   <compilerVersion>${maven.compiler.compilerVersion}</compilerVersion>
  297.   <debug default-value="true">${maven.compiler.debug}</debug>
  298.   <debuglevel>${maven.compiler.debuglevel}</debuglevel>
  299.   <encoding default-value="${project.build.sourceEncoding}">${encoding}</encoding>
  300.   <executable>${maven.compiler.executable}</executable>
  301.   <failOnError default-value="true">${maven.compiler.failOnError}</failOnError>
  302.   <fork default-value="false">${maven.compiler.fork}</fork>
  303.   <generatedTestSourcesDirectory default-value="${project.build.directory}/generated-sources/test-annotations"/>
  304.   <maxmem>${maven.compiler.maxmem}</maxmem>
  305.   <meminitial>${maven.compiler.meminitial}</meminitial>
  306.   <optimize default-value="false">${maven.compiler.optimize}</optimize>
  307.   <outputDirectory default-value="${project.build.testOutputDirectory}"/>
  308.   <outputFileName>${project.build.finalName}</outputFileName>
  309.   <session default-value="${session}"/>
  310.   <showDeprecation default-value="false">${maven.compiler.showDeprecation}</showDeprecation>
  311.   <showWarnings default-value="false">${maven.compiler.showWarnings}</showWarnings>
  312.   <skip>${maven.test.skip}</skip>
  313.   <source default-value="1.5">1.7</source>
  314.   <staleMillis default-value="0">${lastModGranularityMs}</staleMillis>
  315.   <target default-value="1.5">1.7</target>
  316.   <testSource>${maven.compiler.testSource}</testSource>
  317.   <testTarget>${maven.compiler.testTarget}</testTarget>
  318.   <verbose default-value="false">${maven.compiler.verbose}</verbose>
  319. </configuration>
  320. -----------------------------------------------------------------------
  321. Goal:          org.apache.maven.plugins:maven-surefire-plugin:2.11:test (default-test)
  322. Style:         Regular
  323. Configuration: <?xml version="1.0" encoding="UTF-8"?>
  324. <configuration>
  325.   <argLine>${argLine}</argLine>
  326.   <basedir default-value="${basedir}"/>
  327.   <childDelegation default-value="false">${childDelegation}</childDelegation>
  328.   <classesDirectory default-value="${project.build.outputDirectory}"/>
  329.   <debugForkedProcess>${maven.surefire.debug}</debugForkedProcess>
  330.   <disableXmlReport default-value="false">${disableXmlReport}</disableXmlReport>
  331.   <enableAssertions default-value="true">${enableAssertions}</enableAssertions>
  332.   <excludedGroups>${excludedGroups}</excludedGroups>
  333.   <failIfNoTests>${failIfNoTests}</failIfNoTests>
  334.   <forkMode default-value="once">${forkMode}</forkMode>
  335.   <forkedProcessTimeoutInSeconds>${surefire.timeout}</forkedProcessTimeoutInSeconds>
  336.   <groups>${groups}</groups>
  337.   <junitArtifactName default-value="junit:junit">${junitArtifactName}</junitArtifactName>
  338.   <jvm>${jvm}</jvm>
  339.   <localRepository>${localRepository}</localRepository>
  340.   <objectFactory>${objectFactory}</objectFactory>
  341.   <parallel>${parallel}</parallel>
  342.   <parallelMavenExecution default-value="${session.parallel}"/>
  343.   <perCoreThreadCount default-value="true">${perCoreThreadCount}</perCoreThreadCount>
  344.   <pluginArtifactMap>${plugin.artifactMap}</pluginArtifactMap>
  345.   <printSummary default-value="true">${surefire.printSummary}</printSummary>
  346.   <project default-value="${project}"/>
  347.   <projectArtifactMap>${project.artifactMap}</projectArtifactMap>
  348.   <redirectTestOutputToFile default-value="false">${maven.test.redirectTestOutputToFile}</redirectTestOutputToFile>
  349.   <remoteRepositories>${project.pluginArtifactRepositories}</remoteRepositories>
  350.   <reportFormat default-value="brief">${surefire.reportFormat}</reportFormat>
  351.   <reportNameSuffix default-value="">${surefire.reportNameSuffix}</reportNameSuffix>
  352.   <reportsDirectory default-value="${project.build.directory}/surefire-reports"/>
  353.   <runOrder default-value="filesystem"/>
  354.   <session>${session}</session>
  355.   <skip default-value="false">${maven.test.skip}</skip>
  356.   <skipExec>${maven.test.skip.exec}</skipExec>
  357.   <skipTests default-value="false">${skipTests}</skipTests>
  358.   <test>${test}</test>
  359.   <testClassesDirectory default-value="${project.build.testOutputDirectory}"/>
  360.   <testFailureIgnore default-value="false">${maven.test.failure.ignore}</testFailureIgnore>
  361.   <testNGArtifactName default-value="org.testng:testng">${testNGArtifactName}</testNGArtifactName>
  362.   <testSourceDirectory default-value="${project.build.testSourceDirectory}"/>
  363.   <threadCount>${threadCount}</threadCount>
  364.   <trimStackTrace default-value="true">${trimStackTrace}</trimStackTrace>
  365.   <useFile default-value="true">${surefire.useFile}</useFile>
  366.   <useManifestOnlyJar default-value="true">${surefire.useManifestOnlyJar}</useManifestOnlyJar>
  367.   <useSystemClassLoader default-value="true">${surefire.useSystemClassLoader}</useSystemClassLoader>
  368.   <useUnlimitedThreads default-value="false">${useUnlimitedThreads}</useUnlimitedThreads>
  369.   <workingDirectory>${basedir}</workingDirectory>
  370. </configuration>
  371. -----------------------------------------------------------------------
  372. Goal:          org.apache.felix:maven-bundle-plugin:2.3.6:bundle (default-bundle)
  373. Style:         Regular
  374. Configuration: <?xml version="1.0" encoding="UTF-8"?>
  375. <configuration>
  376.   <buildDirectory>${project.build.directory}</buildDirectory>
  377.   <dumpClasspath>${dumpClasspath}</dumpClasspath>
  378.   <dumpInstructions>${dumpInstructions}</dumpInstructions>
  379.   <excludeDependencies>${excludeDependencies}</excludeDependencies>
  380.   <instructions>
  381.     <Import-Package>org.DX_57.osgi.SH_27.api, org.osgi.framework</Import-Package>
  382.     <Bundle-SymbolicName>SH_27-impl</Bundle-SymbolicName>
  383.     <Bundle-Activator>org.DX_57.osgi.SH_27.impl.SessionHandleApp</Bundle-Activator>
  384.     <Export-Package>org.DX_57.osgi.SH_27.impl,org.osgi.framework,org.osgi.service.condpermadmin,org.osgi.service.packageadmin,org.osgi.service.permissionadmin,org.osgi.service.startlevel,org.osgi.service.url,org.samples.osgi.service</Export-Package>
  385.     <Private-Package>org.DX_57.osgi.SH_27.impl.*,org.samples.osgi.service.*</Private-Package>
  386.   </instructions>
  387.   <m_mavenSession default-value="${session}"/>
  388.   <manifestLocation default-value="${project.build.outputDirectory}/META-INF">${manifestLocation}</manifestLocation>
  389.   <outputDirectory>${project.build.outputDirectory}</outputDirectory>
  390.   <project>${project}</project>
  391.   <unpackBundle>${unpackBundle}</unpackBundle>
  392. </configuration>
  393. =======================================================================
  394. org.DX_57.osgi.SH_27:SH_27-impl:bundle:1.0-SNAPSHOT
  395.    junit:junit:jar:3.8.1:test
  396.    org.apache.felix:org.osgi.core:jar:1.0.0:compile
  397.    org.DX_57.osgi.SH_27:SH_27-api:jar:1.0-SNAPSHOT:compile
  398.  
  399. [clean:clean]
  400. org.apache.maven.plugins:maven-clean-plugin:jar:2.4.1:
  401.    org.apache.maven:maven-plugin-api:jar:2.0.6:compile
  402.    org.codehaus.plexus:plexus-utils:jar:2.0.5:compile
  403. Created new class realm plugin>org.apache.maven.plugins:maven-clean-plugin:2.4.1
  404. Importing foreign packages into class realm plugin>org.apache.maven.plugins:maven-clean-plugin:2.4.1
  405.   Imported:  < project>org.DX_57.osgi.SH_27:SH_27-impl:1.0-SNAPSHOT
  406. Populating class realm plugin>org.apache.maven.plugins:maven-clean-plugin:2.4.1
  407.   Included: org.apache.maven.plugins:maven-clean-plugin:jar:2.4.1
  408.   Included: org.codehaus.plexus:plexus-utils:jar:2.0.5
  409.   Excluded: org.apache.maven:maven-plugin-api:jar:2.0.6
  410. Configuring mojo org.apache.maven.plugins:maven-clean-plugin:2.4.1:clean from plugin realm ClassRealm[plugin>org.apache.maven.plugins:maven-clean-plugin:2.4.1, parent: sun.misc.Launcher$AppClassLoader@397577f9]
  411. Configuring mojo 'org.apache.maven.plugins:maven-clean-plugin:2.4.1:clean' with basic configurator -->
  412.   (f) directory = /home/rcbandit/Desktop/NetBeans/Prototype_3/SH_27/SH_27-impl/target
  413.   (f) excludeDefaultDirectories = false
  414.   (f) failOnError = true
  415.   (f) followSymLinks = false
  416.   (f) outputDirectory = /home/rcbandit/Desktop/NetBeans/Prototype_3/SH_27/SH_27-impl/target/classes
  417.   (f) reportDirectory = /home/rcbandit/Desktop/NetBeans/Prototype_3/SH_27/SH_27-impl/target/site
  418.   (f) skip = false
  419.   (f) testOutputDirectory = /home/rcbandit/Desktop/NetBeans/Prototype_3/SH_27/SH_27-impl/target/test-classes
  420. -- end configuration --
  421. Deleting /home/rcbandit/Desktop/NetBeans/Prototype_3/SH_27/SH_27-impl/target
  422. Deleting file /home/rcbandit/Desktop/NetBeans/Prototype_3/SH_27/SH_27-impl/target/surefire-reports/org.samples.osgi.service.AppTest.txt
  423. Deleting file /home/rcbandit/Desktop/NetBeans/Prototype_3/SH_27/SH_27-impl/target/surefire-reports/TEST-org.samples.osgi.service.AppTest.xml
  424. Deleting directory /home/rcbandit/Desktop/NetBeans/Prototype_3/SH_27/SH_27-impl/target/surefire-reports
  425. Deleting file /home/rcbandit/Desktop/NetBeans/Prototype_3/SH_27/SH_27-impl/target/test-classes/org/samples/osgi/service/AppTest.class
  426. Deleting directory /home/rcbandit/Desktop/NetBeans/Prototype_3/SH_27/SH_27-impl/target/test-classes/org/samples/osgi/service
  427. Deleting directory /home/rcbandit/Desktop/NetBeans/Prototype_3/SH_27/SH_27-impl/target/test-classes/org/samples/osgi
  428. Deleting directory /home/rcbandit/Desktop/NetBeans/Prototype_3/SH_27/SH_27-impl/target/test-classes/org/samples
  429. Deleting directory /home/rcbandit/Desktop/NetBeans/Prototype_3/SH_27/SH_27-impl/target/test-classes/org
  430. Deleting file /home/rcbandit/Desktop/NetBeans/Prototype_3/SH_27/SH_27-impl/target/test-classes/.netbeans_automatic_build
  431. Deleting directory /home/rcbandit/Desktop/NetBeans/Prototype_3/SH_27/SH_27-impl/target/test-classes
  432. Deleting directory /home/rcbandit/Desktop/NetBeans/Prototype_3/SH_27/SH_27-impl/target/generated-sources/annotations
  433. Deleting directory /home/rcbandit/Desktop/NetBeans/Prototype_3/SH_27/SH_27-impl/target/generated-sources/test-annotations
  434. Deleting directory /home/rcbandit/Desktop/NetBeans/Prototype_3/SH_27/SH_27-impl/target/generated-sources
  435. Deleting file /home/rcbandit/Desktop/NetBeans/Prototype_3/SH_27/SH_27-impl/target/classes/org/DX_57/osgi/SH_27/impl/SessionHandleImpl.class
  436. Deleting file /home/rcbandit/Desktop/NetBeans/Prototype_3/SH_27/SH_27-impl/target/classes/org/DX_57/osgi/SH_27/impl/SessionHandleApp.class
  437. Deleting directory /home/rcbandit/Desktop/NetBeans/Prototype_3/SH_27/SH_27-impl/target/classes/org/DX_57/osgi/SH_27/impl
  438. Deleting directory /home/rcbandit/Desktop/NetBeans/Prototype_3/SH_27/SH_27-impl/target/classes/org/DX_57/osgi/SH_27
  439. Deleting directory /home/rcbandit/Desktop/NetBeans/Prototype_3/SH_27/SH_27-impl/target/classes/org/DX_57/osgi
  440. Deleting directory /home/rcbandit/Desktop/NetBeans/Prototype_3/SH_27/SH_27-impl/target/classes/org/DX_57
  441. Deleting directory /home/rcbandit/Desktop/NetBeans/Prototype_3/SH_27/SH_27-impl/target/classes/org
  442. Deleting directory /home/rcbandit/Desktop/NetBeans/Prototype_3/SH_27/SH_27-impl/target/classes
  443. Deleting file /home/rcbandit/Desktop/NetBeans/Prototype_3/SH_27/SH_27-impl/target/surefire/surefire4541253064352913931tmp
  444. Deleting file /home/rcbandit/Desktop/NetBeans/Prototype_3/SH_27/SH_27-impl/target/surefire/surefirebooter3240293247812307355.jar
  445. Deleting file /home/rcbandit/Desktop/NetBeans/Prototype_3/SH_27/SH_27-impl/target/surefire/surefire5544777671181422604tmp
  446. Deleting directory /home/rcbandit/Desktop/NetBeans/Prototype_3/SH_27/SH_27-impl/target/surefire
  447. Deleting directory /home/rcbandit/Desktop/NetBeans/Prototype_3/SH_27/SH_27-impl/target
  448. Skipping non-existing directory /home/rcbandit/Desktop/NetBeans/Prototype_3/SH_27/SH_27-impl/target/classes
  449. Skipping non-existing directory /home/rcbandit/Desktop/NetBeans/Prototype_3/SH_27/SH_27-impl/target/test-classes
  450. Skipping non-existing directory /home/rcbandit/Desktop/NetBeans/Prototype_3/SH_27/SH_27-impl/target/site
  451.  
  452. [resources:resources]
  453. org.apache.maven.plugins:maven-resources-plugin:jar:2.5:
  454.    org.apache.maven:maven-plugin-api:jar:2.0.6:compile
  455.    org.apache.maven:maven-project:jar:2.0.6:compile
  456.       org.apache.maven:maven-profile:jar:2.0.6:compile
  457.       org.apache.maven:maven-artifact-manager:jar:2.0.6:compile
  458.       org.apache.maven:maven-plugin-registry:jar:2.0.6:compile
  459.    org.apache.maven:maven-core:jar:2.0.6:compile
  460.       org.apache.maven:maven-plugin-parameter-documenter:jar:2.0.6:compile
  461.       org.apache.maven.reporting:maven-reporting-api:jar:2.0.6:compile
  462.          org.apache.maven.doxia:doxia-sink-api:jar:1.0-alpha-7:compile
  463.       org.apache.maven:maven-repository-metadata:jar:2.0.6:compile
  464.       org.apache.maven:maven-error-diagnostics:jar:2.0.6:compile
  465.       commons-cli:commons-cli:jar:1.0:compile
  466.       org.apache.maven:maven-plugin-descriptor:jar:2.0.6:compile
  467.       org.codehaus.plexus:plexus-interactivity-api:jar:1.0-alpha-4:compile
  468.       classworlds:classworlds:jar:1.1:compile
  469.    org.apache.maven:maven-artifact:jar:2.0.6:compile
  470.    org.apache.maven:maven-settings:jar:2.0.6:compile
  471.    org.apache.maven:maven-model:jar:2.0.6:compile
  472.    org.apache.maven:maven-monitor:jar:2.0.6:compile
  473.    org.codehaus.plexus:plexus-container-default:jar:1.0-alpha-9-stable-1:compile
  474.       junit:junit:jar:3.8.1:compile
  475.    org.codehaus.plexus:plexus-utils:jar:2.0.5:compile
  476.    org.apache.maven.shared:maven-filtering:jar:1.0:compile
  477.       org.sonatype.plexus:plexus-build-api:jar:0.0.4:compile
  478.    org.codehaus.plexus:plexus-interpolation:jar:1.13:compile
  479. Created new class realm plugin>org.apache.maven.plugins:maven-resources-plugin:2.5
  480. Importing foreign packages into class realm plugin>org.apache.maven.plugins:maven-resources-plugin:2.5
  481.   Imported:  < project>org.DX_57.osgi.SH_27:SH_27-impl:1.0-SNAPSHOT
  482. Populating class realm plugin>org.apache.maven.plugins:maven-resources-plugin:2.5
  483.   Included: org.apache.maven.plugins:maven-resources-plugin:jar:2.5
  484.   Included: org.apache.maven.reporting:maven-reporting-api:jar:2.0.6
  485.   Included: org.apache.maven.doxia:doxia-sink-api:jar:1.0-alpha-7
  486.   Included: commons-cli:commons-cli:jar:1.0
  487.   Included: org.codehaus.plexus:plexus-interactivity-api:jar:1.0-alpha-4
  488.   Included: junit:junit:jar:3.8.1
  489.   Included: org.codehaus.plexus:plexus-utils:jar:2.0.5
  490.   Included: org.apache.maven.shared:maven-filtering:jar:1.0
  491.   Included: org.sonatype.plexus:plexus-build-api:jar:0.0.4
  492.   Included: org.codehaus.plexus:plexus-interpolation:jar:1.13
  493.   Excluded: org.apache.maven:maven-plugin-api:jar:2.0.6
  494.   Excluded: org.apache.maven:maven-project:jar:2.0.6
  495.   Excluded: org.apache.maven:maven-profile:jar:2.0.6
  496.   Excluded: org.apache.maven:maven-artifact-manager:jar:2.0.6
  497.   Excluded: org.apache.maven:maven-plugin-registry:jar:2.0.6
  498.   Excluded: org.apache.maven:maven-core:jar:2.0.6
  499.   Excluded: org.apache.maven:maven-plugin-parameter-documenter:jar:2.0.6
  500.   Excluded: org.apache.maven:maven-repository-metadata:jar:2.0.6
  501.   Excluded: org.apache.maven:maven-error-diagnostics:jar:2.0.6
  502.   Excluded: org.apache.maven:maven-plugin-descriptor:jar:2.0.6
  503.   Excluded: classworlds:classworlds:jar:1.1
  504.   Excluded: org.apache.maven:maven-artifact:jar:2.0.6
  505.   Excluded: org.apache.maven:maven-settings:jar:2.0.6
  506.   Excluded: org.apache.maven:maven-model:jar:2.0.6
  507.   Excluded: org.apache.maven:maven-monitor:jar:2.0.6
  508.   Excluded: org.codehaus.plexus:plexus-container-default:jar:1.0-alpha-9-stable-1
  509. Configuring mojo org.apache.maven.plugins:maven-resources-plugin:2.5:resources from plugin realm ClassRealm[plugin>org.apache.maven.plugins:maven-resources-plugin:2.5, parent: sun.misc.Launcher$AppClassLoader@397577f9]
  510. [debug] execute contextualize
  511. Configuring mojo 'org.apache.maven.plugins:maven-resources-plugin:2.5:resources' with basic configurator -->
  512.   (f) buildFilters = []
  513.   (f) escapeWindowsPaths = true
  514.   (s) includeEmptyDirs = false
  515.   (s) outputDirectory = /home/rcbandit/Desktop/NetBeans/Prototype_3/SH_27/SH_27-impl/target/classes
  516.   (s) overwrite = false
  517.   (f) project = MavenProject: org.DX_57.osgi.SH_27:SH_27-impl:1.0-SNAPSHOT @ /home/rcbandit/Desktop/NetBeans/Prototype_3/SH_27/SH_27-impl/pom.xml
  518.   (s) resources = [Resource {targetPath: null, filtering: false, FileSet {directory: /home/rcbandit/Desktop/NetBeans/Prototype_3/SH_27/SH_27-impl/src/main/resources, PatternSet [includes: {}, excludes: {}]}}]
  519.   (f) session = org.apache.maven.execution.MavenSession@595c9dcd
  520.   (f) supportMultiLineFiltering = false
  521.   (f) useBuildFilters = true
  522.   (s) useDefaultDelimiters = true
  523. -- end configuration --
  524. properties used {java.vendor=Oracle Corporation, env.SESSION_MANAGER=local/unix:@/tmp/.ICE-unix/1287,unix/unix:/tmp/.ICE-unix/1287, env.LESSOPEN=||/usr/bin/lesspipe.sh %s, sun.java.launcher=SUN_STANDARD, env.QT_IM_MODULE=xim, sun.management.compiler=HotSpot 64-Bit Tiered Compilers, os.name=Linux, sun.boot.class.path=/opt/jdk1.7.0_02/jre/lib/resources.jar:/opt/jdk1.7.0_02/jre/lib/rt.jar:/opt/jdk1.7.0_02/jre/lib/sunrsasign.jar:/opt/jdk1.7.0_02/jre/lib/jsse.jar:/opt/jdk1.7.0_02/jre/lib/jce.jar:/opt/jdk1.7.0_02/jre/lib/charsets.jar:/opt/jdk1.7.0_02/jre/classes, env.PWD=/home/rcbandit/Desktop/NetBeans/Prototype_3/SH_27/SH_27-impl, env.XDG_SESSION_COOKIE=353e720329bb1813f71d8e5c0000000a-1327750063.357802-1322348130, sun.desktop=gnome, env.LANG=en_US.UTF-8, java.vm.specification.vendor=Oracle Corporation, java.runtime.version=1.7.0_02-b13, env.HISTSIZE=1000, env.XDG_VTNR=1, env.DISPLAY=:0.0, user.name=rcbandit, env.USER=rcbandit, env.HISTCONTROL=ignoredups, env.SHELL=/bin/bash, env.DESKTOP_SESSION=gnome, env.NLSPATH=/usr/dt/lib/nls/msg/%L/%N.cat, env.PATH=/usr/lib64/ccache:/usr/local/bin:/usr/bin:/bin:/usr/local/sbin:/usr/sbin:/sbin:/home/rcbandit/.local/bin:/home/rcbandit/bin, user.language=en, env.IMSETTINGS_MODULE=none, sun.boot.library.path=/opt/jdk1.7.0_02/jre/lib/amd64, classworlds.conf=/home/rcbandit/netbeans-7.0.1/java/maven/bin/m2.conf, java.version=1.7.0_02, user.timezone=Europe/Sofia, env.DBUS_SESSION_BUS_ADDRESS=unix:abstract=/tmp/dbus-nv6UzfyACd,guid=9c3ae8d1bc01fd57f1ca390e0000001e, sun.arch.data.model=64, java.endorsed.dirs=/opt/jdk1.7.0_02/jre/lib/endorsed, sun.cpu.isalist=, sun.jnu.encoding=UTF-8, file.encoding.pkg=sun.io, env.SHLVL=2, file.separator=/, env.HOSTNAME=Laptop, java.specification.name=Java Platform API Specification, env.IMSETTINGS_INTEGRATE_DESKTOP=yes, env.GNOME_DESKTOP_SESSION_ID=this-is-deprecated, java.class.version=51.0, env.GDMSESSION=gnome, user.country=US, env.GNOME_KEYRING_PID=1283, java.home=/opt/jdk1.7.0_02/jre, java.vm.info=mixed mode, env.LOGNAME=rcbandit, os.version=3.2.2-1.fc16.x86_64, path.separator=:, java.vm.version=22.0-b10, env.JAVA_HOME=/opt/jdk1.7.0_02, java.awt.printerjob=sun.print.PSPrinterJob, env.TERM=dumb, env.WINDOWPATH=1, sun.io.unicode.encoding=UnicodeLittle, awt.toolkit=sun.awt.X11.XToolkit, env.DESKTOP_AUTOSTART_ID=104c84c152bce57a8a132775006386829200000012870025, env.XMODIFIERS=@im=none, user.home=/home/rcbandit, env.NB_EXEC_MAVEN_PROCESS_UUID=3ed15714-1665-49fe-a9c5-d6f88dbc7ab1, env.OLDPWD=/home/rcbandit/Desktop/NetBeans/Prototype_3/SH_27/SH_27-impl, java.specification.vendor=Oracle Corporation, java.library.path=/usr/java/packages/lib/amd64:/usr/lib64:/lib64:/lib:/usr/lib, java.vendor.url=http://java.oracle.com/, env.GIO_LAUNCHED_DESKTOP_FILE=/home/rcbandit/Desktop/netbeans-7.0.1.desktop, env.XDG_SEAT=seat0, java.vm.vendor=Oracle Corporation, maven.home=/home/rcbandit/netbeans-7.0.1/java/maven, java.runtime.name=Java(TM) SE Runtime Environment, sun.java.command=org.codehaus.plexus.classworlds.launcher.Launcher clean package -X, java.class.path=/home/rcbandit/netbeans-7.0.1/java/maven/boot/plexus-classworlds-2.4.jar, env.XDG_SESSION_ID=2, env.CVS_RSH=ssh, env.XFILESEARCHPATH=/usr/dt/app-defaults/%L/Dt, java.vm.specification.name=Java Virtual Machine Specification, java.vm.specification.version=1.7, sun.cpu.endian=little, sun.os.patch.level=unknown, env.HOME=/home/rcbandit, java.io.tmpdir=/tmp, java.vendor.url.bug=http://bugreport.sun.com/bugreport/, env.SSH_AUTH_SOCK=/tmp/keyring-w4QgXu/ssh, os.arch=amd64, java.awt.graphicsenv=sun.awt.X11GraphicsEnvironment, java.ext.dirs=/opt/jdk1.7.0_02/jre/lib/ext:/usr/java/packages/lib/ext, env.XDG_RUNTIME_DIR=/run/user/rcbandit, env.XAUTHORITY=/var/run/gdm/auth-for-rcbandit-B5Ix2Z/database, user.dir=/home/rcbandit/Desktop/NetBeans/Prototype_3/SH_27/SH_27-impl, env.J2D_PIXMAPS=shared, line.separator=
  525. , java.vm.name=Java HotSpot(TM) 64-Bit Server VM, env.CCACHE_HASHDIR=, env.USERNAME=rcbandit, file.encoding=UTF-8, env.MAIL=/var/spool/mail/rcbandit, env.GPG_AGENT_INFO=/tmp/keyring-w4QgXu/gpg:0:1, env.GIO_LAUNCHED_DESKTOP_FILE_PID=8431, java.specification.version=1.7, env.GNOME_KEYRING_CONTROL=/tmp/keyring-w4QgXu}
  526. Using platform encoding (UTF-8 actually) to copy filtered resources, i.e. build is platform dependent!
  527. resource with targetPath null
  528. directory /home/rcbandit/Desktop/NetBeans/Prototype_3/SH_27/SH_27-impl/src/main/resources
  529. excludes []
  530. includes []
  531. ignoreDelta true
  532. Copying 0 resource
  533. no use filter components
  534.  
  535. [compiler:compile]
  536. org.apache.maven.plugins:maven-compiler-plugin:jar:2.3.2:
  537.    org.apache.maven:maven-plugin-api:jar:2.0.6:compile
  538.    org.apache.maven:maven-artifact:jar:2.0.6:compile
  539.    org.apache.maven:maven-core:jar:2.0.6:compile
  540.       org.apache.maven:maven-settings:jar:2.0.6:compile
  541.       org.apache.maven:maven-plugin-parameter-documenter:jar:2.0.6:compile
  542.       org.apache.maven:maven-profile:jar:2.0.6:compile
  543.       org.apache.maven:maven-model:jar:2.0.6:compile
  544.       org.apache.maven:maven-repository-metadata:jar:2.0.6:compile
  545.       org.apache.maven:maven-error-diagnostics:jar:2.0.6:compile
  546.       org.apache.maven:maven-project:jar:2.0.6:compile
  547.          org.apache.maven:maven-plugin-registry:jar:2.0.6:compile
  548.       org.apache.maven:maven-plugin-descriptor:jar:2.0.6:compile
  549.       org.apache.maven:maven-artifact-manager:jar:2.0.6:compile
  550.       org.apache.maven:maven-monitor:jar:2.0.6:compile
  551.    org.apache.maven:maven-toolchain:jar:1.0:compile
  552.    org.codehaus.plexus:plexus-utils:jar:2.0.5:compile
  553.    org.codehaus.plexus:plexus-compiler-api:jar:1.8.1:compile
  554.    org.codehaus.plexus:plexus-compiler-manager:jar:1.8.1:compile
  555.    org.codehaus.plexus:plexus-compiler-javac:jar:1.8.1:runtime
  556. Created new class realm plugin>org.apache.maven.plugins:maven-compiler-plugin:2.3.2
  557. Importing foreign packages into class realm plugin>org.apache.maven.plugins:maven-compiler-plugin:2.3.2
  558.   Imported:  < project>org.DX_57.osgi.SH_27:SH_27-impl:1.0-SNAPSHOT
  559. Populating class realm plugin>org.apache.maven.plugins:maven-compiler-plugin:2.3.2
  560.   Included: org.apache.maven.plugins:maven-compiler-plugin:jar:2.3.2
  561.   Included: org.codehaus.plexus:plexus-utils:jar:2.0.5
  562.   Included: org.codehaus.plexus:plexus-compiler-api:jar:1.8.1
  563.   Included: org.codehaus.plexus:plexus-compiler-manager:jar:1.8.1
  564.   Included: org.codehaus.plexus:plexus-compiler-javac:jar:1.8.1
  565.   Excluded: org.apache.maven:maven-plugin-api:jar:2.0.6
  566.   Excluded: org.apache.maven:maven-artifact:jar:2.0.6
  567.   Excluded: org.apache.maven:maven-core:jar:2.0.6
  568.   Excluded: org.apache.maven:maven-settings:jar:2.0.6
  569.   Excluded: org.apache.maven:maven-plugin-parameter-documenter:jar:2.0.6
  570.   Excluded: org.apache.maven:maven-profile:jar:2.0.6
  571.   Excluded: org.apache.maven:maven-model:jar:2.0.6
  572.   Excluded: org.apache.maven:maven-repository-metadata:jar:2.0.6
  573.   Excluded: org.apache.maven:maven-error-diagnostics:jar:2.0.6
  574.   Excluded: org.apache.maven:maven-project:jar:2.0.6
  575.   Excluded: org.apache.maven:maven-plugin-registry:jar:2.0.6
  576.   Excluded: org.apache.maven:maven-plugin-descriptor:jar:2.0.6
  577.   Excluded: org.apache.maven:maven-artifact-manager:jar:2.0.6
  578.   Excluded: org.apache.maven:maven-monitor:jar:2.0.6
  579.   Excluded: org.apache.maven:maven-toolchain:jar:1.0
  580. Configuring mojo org.apache.maven.plugins:maven-compiler-plugin:2.3.2:compile from plugin realm ClassRealm[plugin>org.apache.maven.plugins:maven-compiler-plugin:2.3.2, parent: sun.misc.Launcher$AppClassLoader@397577f9]
  581. Configuring mojo 'org.apache.maven.plugins:maven-compiler-plugin:2.3.2:compile' with basic configurator -->
  582.   (f) basedir = /home/rcbandit/Desktop/NetBeans/Prototype_3/SH_27/SH_27-impl
  583.   (f) buildDirectory = /home/rcbandit/Desktop/NetBeans/Prototype_3/SH_27/SH_27-impl/target
  584.   (f) classpathElements = [/home/rcbandit/Desktop/NetBeans/Prototype_3/SH_27/SH_27-impl/target/classes, /home/rcbandit/.m2/repository/org/apache/felix/org.osgi.core/1.0.0/org.osgi.core-1.0.0.jar, /home/rcbandit/.m2/repository/org/DX_57/osgi/SH_27/SH_27-api/1.0-SNAPSHOT/SH_27-api-1.0-SNAPSHOT.jar]
  585.   (f) compileSourceRoots = [/home/rcbandit/Desktop/NetBeans/Prototype_3/SH_27/SH_27-impl/src/main/java]
  586.   (f) compilerId = javac
  587.   (f) debug = true
  588.   (f) failOnError = true
  589.   (f) fork = false
  590.   (f) generatedSourcesDirectory = /home/rcbandit/Desktop/NetBeans/Prototype_3/SH_27/SH_27-impl/target/generated-sources/annotations
  591.   (f) optimize = false
  592.   (f) outputDirectory = /home/rcbandit/Desktop/NetBeans/Prototype_3/SH_27/SH_27-impl/target/classes
  593.   (f) outputFileName = SH_27-impl-1.0-SNAPSHOT
  594.   (f) projectArtifact = org.DX_57.osgi.SH_27:SH_27-impl:bundle:1.0-SNAPSHOT
  595.   (f) session = org.apache.maven.execution.MavenSession@595c9dcd
  596.   (f) showDeprecation = false
  597.   (f) showWarnings = false
  598.   (f) source = 1.7
  599.   (f) staleMillis = 0
  600.   (f) target = 1.7
  601.   (f) verbose = false
  602. -- end configuration --
  603. Using compiler 'javac'.
  604. Source directories: [/home/rcbandit/Desktop/NetBeans/Prototype_3/SH_27/SH_27-impl/src/main/java]
  605. Classpath: [/home/rcbandit/Desktop/NetBeans/Prototype_3/SH_27/SH_27-impl/target/classes
  606.  /home/rcbandit/.m2/repository/org/apache/felix/org.osgi.core/1.0.0/org.osgi.core-1.0.0.jar
  607.  /home/rcbandit/.m2/repository/org/DX_57/osgi/SH_27/SH_27-api/1.0-SNAPSHOT/SH_27-api-1.0-SNAPSHOT.jar]
  608. Output directory: /home/rcbandit/Desktop/NetBeans/Prototype_3/SH_27/SH_27-impl/target/classes
  609. Classpath:
  610.  /home/rcbandit/Desktop/NetBeans/Prototype_3/SH_27/SH_27-impl/target/classes
  611.  /home/rcbandit/.m2/repository/org/apache/felix/org.osgi.core/1.0.0/org.osgi.core-1.0.0.jar
  612.  /home/rcbandit/.m2/repository/org/DX_57/osgi/SH_27/SH_27-api/1.0-SNAPSHOT/SH_27-api-1.0-SNAPSHOT.jar
  613. Source roots:
  614.  /home/rcbandit/Desktop/NetBeans/Prototype_3/SH_27/SH_27-impl/src/main/java
  615. Command line options:
  616. -d /home/rcbandit/Desktop/NetBeans/Prototype_3/SH_27/SH_27-impl/target/classes -classpath /home/rcbandit/Desktop/NetBeans/Prototype_3/SH_27/SH_27-impl/target/classes:/home/rcbandit/.m2/repository/org/apache/felix/org.osgi.core/1.0.0/org.osgi.core-1.0.0.jar:/home/rcbandit/.m2/repository/org/DX_57/osgi/SH_27/SH_27-api/1.0-SNAPSHOT/SH_27-api-1.0-SNAPSHOT.jar: -sourcepath /home/rcbandit/Desktop/NetBeans/Prototype_3/SH_27/SH_27-impl/src/main/java: /home/rcbandit/Desktop/NetBeans/Prototype_3/SH_27/SH_27-impl/src/main/java/org/DX_57/osgi/SH_27/impl/SessionHandleImpl.java /home/rcbandit/Desktop/NetBeans/Prototype_3/SH_27/SH_27-impl/src/main/java/org/DX_57/osgi/SH_27/impl/SessionHandleApp.java -s /home/rcbandit/Desktop/NetBeans/Prototype_3/SH_27/SH_27-impl/target/generated-sources/annotations -g -nowarn -target 1.7 -source 1.7
  617. File encoding has not been set, using platform encoding UTF-8, i.e. build is platform dependent!
  618. Compiling 2 source files to /home/rcbandit/Desktop/NetBeans/Prototype_3/SH_27/SH_27-impl/target/classes
  619.  
  620. [resources:testResources]
  621. Configuring mojo org.apache.maven.plugins:maven-resources-plugin:2.5:testResources from plugin realm ClassRealm[plugin>org.apache.maven.plugins:maven-resources-plugin:2.5, parent: sun.misc.Launcher$AppClassLoader@397577f9]
  622. [debug] execute contextualize
  623. Configuring mojo 'org.apache.maven.plugins:maven-resources-plugin:2.5:testResources' with basic configurator -->
  624.   (f) buildFilters = []
  625.   (f) escapeWindowsPaths = true
  626.   (s) includeEmptyDirs = false
  627.   (s) outputDirectory = /home/rcbandit/Desktop/NetBeans/Prototype_3/SH_27/SH_27-impl/target/test-classes
  628.   (s) overwrite = false
  629.   (f) project = MavenProject: org.DX_57.osgi.SH_27:SH_27-impl:1.0-SNAPSHOT @ /home/rcbandit/Desktop/NetBeans/Prototype_3/SH_27/SH_27-impl/pom.xml
  630.   (s) resources = [Resource {targetPath: null, filtering: false, FileSet {directory: /home/rcbandit/Desktop/NetBeans/Prototype_3/SH_27/SH_27-impl/src/test/resources, PatternSet [includes: {}, excludes: {}]}}]
  631.   (f) session = org.apache.maven.execution.MavenSession@595c9dcd
  632.   (f) supportMultiLineFiltering = false
  633.   (f) useBuildFilters = true
  634.   (s) useDefaultDelimiters = true
  635. -- end configuration --
  636. properties used {java.vendor=Oracle Corporation, env.SESSION_MANAGER=local/unix:@/tmp/.ICE-unix/1287,unix/unix:/tmp/.ICE-unix/1287, env.LESSOPEN=||/usr/bin/lesspipe.sh %s, sun.java.launcher=SUN_STANDARD, env.QT_IM_MODULE=xim, sun.management.compiler=HotSpot 64-Bit Tiered Compilers, os.name=Linux, sun.boot.class.path=/opt/jdk1.7.0_02/jre/lib/resources.jar:/opt/jdk1.7.0_02/jre/lib/rt.jar:/opt/jdk1.7.0_02/jre/lib/sunrsasign.jar:/opt/jdk1.7.0_02/jre/lib/jsse.jar:/opt/jdk1.7.0_02/jre/lib/jce.jar:/opt/jdk1.7.0_02/jre/lib/charsets.jar:/opt/jdk1.7.0_02/jre/classes, env.PWD=/home/rcbandit/Desktop/NetBeans/Prototype_3/SH_27/SH_27-impl, env.XDG_SESSION_COOKIE=353e720329bb1813f71d8e5c0000000a-1327750063.357802-1322348130, sun.desktop=gnome, env.LANG=en_US.UTF-8, java.vm.specification.vendor=Oracle Corporation, java.runtime.version=1.7.0_02-b13, env.HISTSIZE=1000, env.XDG_VTNR=1, env.DISPLAY=:0.0, user.name=rcbandit, env.USER=rcbandit, env.HISTCONTROL=ignoredups, env.SHELL=/bin/bash, env.DESKTOP_SESSION=gnome, env.NLSPATH=/usr/dt/lib/nls/msg/%L/%N.cat, env.PATH=/usr/lib64/ccache:/usr/local/bin:/usr/bin:/bin:/usr/local/sbin:/usr/sbin:/sbin:/home/rcbandit/.local/bin:/home/rcbandit/bin, user.language=en, env.IMSETTINGS_MODULE=none, sun.boot.library.path=/opt/jdk1.7.0_02/jre/lib/amd64, classworlds.conf=/home/rcbandit/netbeans-7.0.1/java/maven/bin/m2.conf, java.version=1.7.0_02, user.timezone=Europe/Sofia, env.DBUS_SESSION_BUS_ADDRESS=unix:abstract=/tmp/dbus-nv6UzfyACd,guid=9c3ae8d1bc01fd57f1ca390e0000001e, sun.arch.data.model=64, java.endorsed.dirs=/opt/jdk1.7.0_02/jre/lib/endorsed, sun.cpu.isalist=, sun.jnu.encoding=UTF-8, file.encoding.pkg=sun.io, env.SHLVL=2, file.separator=/, env.HOSTNAME=Laptop, java.specification.name=Java Platform API Specification, env.IMSETTINGS_INTEGRATE_DESKTOP=yes, env.GNOME_DESKTOP_SESSION_ID=this-is-deprecated, java.class.version=51.0, env.GDMSESSION=gnome, user.country=US, env.GNOME_KEYRING_PID=1283, java.home=/opt/jdk1.7.0_02/jre, java.vm.info=mixed mode, env.LOGNAME=rcbandit, os.version=3.2.2-1.fc16.x86_64, path.separator=:, java.vm.version=22.0-b10, env.JAVA_HOME=/opt/jdk1.7.0_02, java.awt.printerjob=sun.print.PSPrinterJob, env.TERM=dumb, env.WINDOWPATH=1, sun.io.unicode.encoding=UnicodeLittle, awt.toolkit=sun.awt.X11.XToolkit, env.DESKTOP_AUTOSTART_ID=104c84c152bce57a8a132775006386829200000012870025, env.XMODIFIERS=@im=none, user.home=/home/rcbandit, env.NB_EXEC_MAVEN_PROCESS_UUID=3ed15714-1665-49fe-a9c5-d6f88dbc7ab1, env.OLDPWD=/home/rcbandit/Desktop/NetBeans/Prototype_3/SH_27/SH_27-impl, java.specification.vendor=Oracle Corporation, java.library.path=/usr/java/packages/lib/amd64:/usr/lib64:/lib64:/lib:/usr/lib, java.vendor.url=http://java.oracle.com/, env.GIO_LAUNCHED_DESKTOP_FILE=/home/rcbandit/Desktop/netbeans-7.0.1.desktop, env.XDG_SEAT=seat0, java.vm.vendor=Oracle Corporation, maven.home=/home/rcbandit/netbeans-7.0.1/java/maven, java.runtime.name=Java(TM) SE Runtime Environment, sun.java.command=org.codehaus.plexus.classworlds.launcher.Launcher clean package -X, java.class.path=/home/rcbandit/netbeans-7.0.1/java/maven/boot/plexus-classworlds-2.4.jar, env.XDG_SESSION_ID=2, env.CVS_RSH=ssh, env.XFILESEARCHPATH=/usr/dt/app-defaults/%L/Dt, java.vm.specification.name=Java Virtual Machine Specification, java.vm.specification.version=1.7, sun.cpu.endian=little, sun.os.patch.level=unknown, env.HOME=/home/rcbandit, java.io.tmpdir=/tmp, java.vendor.url.bug=http://bugreport.sun.com/bugreport/, env.SSH_AUTH_SOCK=/tmp/keyring-w4QgXu/ssh, os.arch=amd64, java.awt.graphicsenv=sun.awt.X11GraphicsEnvironment, java.ext.dirs=/opt/jdk1.7.0_02/jre/lib/ext:/usr/java/packages/lib/ext, env.XDG_RUNTIME_DIR=/run/user/rcbandit, env.XAUTHORITY=/var/run/gdm/auth-for-rcbandit-B5Ix2Z/database, user.dir=/home/rcbandit/Desktop/NetBeans/Prototype_3/SH_27/SH_27-impl, env.J2D_PIXMAPS=shared, line.separator=
  637. , java.vm.name=Java HotSpot(TM) 64-Bit Server VM, env.CCACHE_HASHDIR=, env.USERNAME=rcbandit, file.encoding=UTF-8, env.MAIL=/var/spool/mail/rcbandit, env.GPG_AGENT_INFO=/tmp/keyring-w4QgXu/gpg:0:1, env.GIO_LAUNCHED_DESKTOP_FILE_PID=8431, java.specification.version=1.7, env.GNOME_KEYRING_CONTROL=/tmp/keyring-w4QgXu}
  638. Using platform encoding (UTF-8 actually) to copy filtered resources, i.e. build is platform dependent!
  639. resource with targetPath null
  640. directory /home/rcbandit/Desktop/NetBeans/Prototype_3/SH_27/SH_27-impl/src/test/resources
  641. excludes []
  642. includes []
  643. skip non existing resourceDirectory /home/rcbandit/Desktop/NetBeans/Prototype_3/SH_27/SH_27-impl/src/test/resources
  644. no use filter components
  645.  
  646. [compiler:testCompile]
  647. Configuring mojo org.apache.maven.plugins:maven-compiler-plugin:2.3.2:testCompile from plugin realm ClassRealm[plugin>org.apache.maven.plugins:maven-compiler-plugin:2.3.2, parent: sun.misc.Launcher$AppClassLoader@397577f9]
  648. Configuring mojo 'org.apache.maven.plugins:maven-compiler-plugin:2.3.2:testCompile' with basic configurator -->
  649.   (f) basedir = /home/rcbandit/Desktop/NetBeans/Prototype_3/SH_27/SH_27-impl
  650.   (f) buildDirectory = /home/rcbandit/Desktop/NetBeans/Prototype_3/SH_27/SH_27-impl/target
  651.   (f) classpathElements = [/home/rcbandit/Desktop/NetBeans/Prototype_3/SH_27/SH_27-impl/target/test-classes, /home/rcbandit/Desktop/NetBeans/Prototype_3/SH_27/SH_27-impl/target/classes, /home/rcbandit/.m2/repository/junit/junit/3.8.1/junit-3.8.1.jar, /home/rcbandit/.m2/repository/org/apache/felix/org.osgi.core/1.0.0/org.osgi.core-1.0.0.jar, /home/rcbandit/.m2/repository/org/DX_57/osgi/SH_27/SH_27-api/1.0-SNAPSHOT/SH_27-api-1.0-SNAPSHOT.jar]
  652.   (f) compileSourceRoots = [/home/rcbandit/Desktop/NetBeans/Prototype_3/SH_27/SH_27-impl/src/test/java]
  653.   (f) compilerId = javac
  654.   (f) debug = true
  655.   (f) failOnError = true
  656.   (f) fork = false
  657.   (f) generatedTestSourcesDirectory = /home/rcbandit/Desktop/NetBeans/Prototype_3/SH_27/SH_27-impl/target/generated-sources/test-annotations
  658.   (f) optimize = false
  659.   (f) outputDirectory = /home/rcbandit/Desktop/NetBeans/Prototype_3/SH_27/SH_27-impl/target/test-classes
  660.   (f) outputFileName = SH_27-impl-1.0-SNAPSHOT
  661.   (f) session = org.apache.maven.execution.MavenSession@595c9dcd
  662.   (f) showDeprecation = false
  663.   (f) showWarnings = false
  664.   (f) source = 1.7
  665.   (f) staleMillis = 0
  666.   (f) target = 1.7
  667.   (f) verbose = false
  668. -- end configuration --
  669. Using compiler 'javac'.
  670. Source directories: [/home/rcbandit/Desktop/NetBeans/Prototype_3/SH_27/SH_27-impl/src/test/java]
  671. Classpath: [/home/rcbandit/Desktop/NetBeans/Prototype_3/SH_27/SH_27-impl/target/test-classes
  672.  /home/rcbandit/Desktop/NetBeans/Prototype_3/SH_27/SH_27-impl/target/classes
  673.  /home/rcbandit/.m2/repository/junit/junit/3.8.1/junit-3.8.1.jar
  674.  /home/rcbandit/.m2/repository/org/apache/felix/org.osgi.core/1.0.0/org.osgi.core-1.0.0.jar
  675.  /home/rcbandit/.m2/repository/org/DX_57/osgi/SH_27/SH_27-api/1.0-SNAPSHOT/SH_27-api-1.0-SNAPSHOT.jar]
  676. Output directory: /home/rcbandit/Desktop/NetBeans/Prototype_3/SH_27/SH_27-impl/target/test-classes
  677. Classpath:
  678.  /home/rcbandit/Desktop/NetBeans/Prototype_3/SH_27/SH_27-impl/target/test-classes
  679.  /home/rcbandit/Desktop/NetBeans/Prototype_3/SH_27/SH_27-impl/target/classes
  680.  /home/rcbandit/.m2/repository/junit/junit/3.8.1/junit-3.8.1.jar
  681.  /home/rcbandit/.m2/repository/org/apache/felix/org.osgi.core/1.0.0/org.osgi.core-1.0.0.jar
  682.  /home/rcbandit/.m2/repository/org/DX_57/osgi/SH_27/SH_27-api/1.0-SNAPSHOT/SH_27-api-1.0-SNAPSHOT.jar
  683. Source roots:
  684.  /home/rcbandit/Desktop/NetBeans/Prototype_3/SH_27/SH_27-impl/src/test/java
  685. Command line options:
  686. -d /home/rcbandit/Desktop/NetBeans/Prototype_3/SH_27/SH_27-impl/target/test-classes -classpath /home/rcbandit/Desktop/NetBeans/Prototype_3/SH_27/SH_27-impl/target/test-classes:/home/rcbandit/Desktop/NetBeans/Prototype_3/SH_27/SH_27-impl/target/classes:/home/rcbandit/.m2/repository/junit/junit/3.8.1/junit-3.8.1.jar:/home/rcbandit/.m2/repository/org/apache/felix/org.osgi.core/1.0.0/org.osgi.core-1.0.0.jar:/home/rcbandit/.m2/repository/org/DX_57/osgi/SH_27/SH_27-api/1.0-SNAPSHOT/SH_27-api-1.0-SNAPSHOT.jar: -sourcepath /home/rcbandit/Desktop/NetBeans/Prototype_3/SH_27/SH_27-impl/src/test/java: /home/rcbandit/Desktop/NetBeans/Prototype_3/SH_27/SH_27-impl/src/test/java/org/samples/osgi/service/AppTest.java -s /home/rcbandit/Desktop/NetBeans/Prototype_3/SH_27/SH_27-impl/target/generated-sources/test-annotations -g -nowarn -target 1.7 -source 1.7
  687. File encoding has not been set, using platform encoding UTF-8, i.e. build is platform dependent!
  688. Compiling 1 source file to /home/rcbandit/Desktop/NetBeans/Prototype_3/SH_27/SH_27-impl/target/test-classes
  689.  
  690. [surefire:test]
  691. org.apache.maven.plugins:maven-surefire-plugin:jar:2.11:
  692.    org.apache.maven:maven-plugin-api:jar:2.0.9:compile
  693.    org.apache.maven.surefire:surefire-booter:jar:2.11:compile
  694.       org.apache.maven.surefire:surefire-api:jar:2.11:compile
  695.    org.apache.maven.surefire:maven-surefire-common:jar:2.11:compile
  696.       org.apache.maven.shared:maven-common-artifact-filters:jar:1.3:compile
  697.    org.codehaus.plexus:plexus-utils:jar:2.1:compile
  698.    org.apache.maven:maven-artifact:jar:2.0.9:compile
  699.    org.apache.maven:maven-project:jar:2.0.9:compile
  700.       org.apache.maven:maven-settings:jar:2.0.9:compile
  701.       org.apache.maven:maven-profile:jar:2.0.9:compile
  702.       org.apache.maven:maven-model:jar:2.0.9:compile
  703.       org.apache.maven:maven-artifact-manager:jar:2.0.9:compile
  704.       org.apache.maven:maven-plugin-registry:jar:2.0.9:compile
  705.       org.codehaus.plexus:plexus-container-default:jar:1.0-alpha-9-stable-1:compile
  706.          junit:junit:jar:3.8.1:test (scope managed from compile)
  707.    org.apache.maven:maven-core:jar:2.0.9:compile
  708.       org.apache.maven:maven-plugin-parameter-documenter:jar:2.0.9:compile
  709.       org.apache.maven.reporting:maven-reporting-api:jar:2.0.9:compile
  710.       org.apache.maven:maven-repository-metadata:jar:2.0.9:compile
  711.       org.apache.maven:maven-error-diagnostics:jar:2.0.9:compile
  712.       org.apache.maven:maven-plugin-descriptor:jar:2.0.9:compile
  713.       org.apache.maven:maven-monitor:jar:2.0.9:compile
  714.       classworlds:classworlds:jar:1.1:compile
  715.    org.apache.maven:maven-toolchain:jar:2.0.9:compile
  716. Created new class realm plugin>org.apache.maven.plugins:maven-surefire-plugin:2.11
  717. Importing foreign packages into class realm plugin>org.apache.maven.plugins:maven-surefire-plugin:2.11
  718.   Imported:  < project>org.DX_57.osgi.SH_27:SH_27-impl:1.0-SNAPSHOT
  719. Populating class realm plugin>org.apache.maven.plugins:maven-surefire-plugin:2.11
  720.   Included: org.apache.maven.plugins:maven-surefire-plugin:jar:2.11
  721.   Included: org.apache.maven.surefire:surefire-booter:jar:2.11
  722.   Included: org.apache.maven.surefire:surefire-api:jar:2.11
  723.   Included: org.apache.maven.surefire:maven-surefire-common:jar:2.11
  724.   Included: org.apache.maven.shared:maven-common-artifact-filters:jar:1.3
  725.   Included: org.codehaus.plexus:plexus-utils:jar:2.1
  726.   Included: org.apache.maven.reporting:maven-reporting-api:jar:2.0.9
  727.   Excluded: org.apache.maven:maven-plugin-api:jar:2.0.9
  728.   Excluded: org.apache.maven:maven-artifact:jar:2.0.9
  729.   Excluded: org.apache.maven:maven-project:jar:2.0.9
  730.   Excluded: org.apache.maven:maven-settings:jar:2.0.9
  731.   Excluded: org.apache.maven:maven-profile:jar:2.0.9
  732.   Excluded: org.apache.maven:maven-model:jar:2.0.9
  733.   Excluded: org.apache.maven:maven-artifact-manager:jar:2.0.9
  734.   Excluded: org.apache.maven:maven-plugin-registry:jar:2.0.9
  735.   Excluded: org.codehaus.plexus:plexus-container-default:jar:1.0-alpha-9-stable-1
  736.   Excluded: junit:junit:jar:3.8.1
  737.   Excluded: org.apache.maven:maven-core:jar:2.0.9
  738.   Excluded: org.apache.maven:maven-plugin-parameter-documenter:jar:2.0.9
  739.   Excluded: org.apache.maven:maven-repository-metadata:jar:2.0.9
  740.   Excluded: org.apache.maven:maven-error-diagnostics:jar:2.0.9
  741.   Excluded: org.apache.maven:maven-plugin-descriptor:jar:2.0.9
  742.   Excluded: org.apache.maven:maven-monitor:jar:2.0.9
  743.   Excluded: classworlds:classworlds:jar:1.1
  744.   Excluded: org.apache.maven:maven-toolchain:jar:2.0.9
  745. Configuring mojo org.apache.maven.plugins:maven-surefire-plugin:2.11:test from plugin realm ClassRealm[plugin>org.apache.maven.plugins:maven-surefire-plugin:2.11, parent: sun.misc.Launcher$AppClassLoader@397577f9]
  746. Configuring mojo 'org.apache.maven.plugins:maven-surefire-plugin:2.11:test' with basic configurator -->
  747.   (s) basedir = /home/rcbandit/Desktop/NetBeans/Prototype_3/SH_27/SH_27-impl
  748.   (s) childDelegation = false
  749.   (s) classesDirectory = /home/rcbandit/Desktop/NetBeans/Prototype_3/SH_27/SH_27-impl/target/classes
  750.   (s) disableXmlReport = false
  751.   (s) enableAssertions = true
  752.   (s) forkMode = once
  753.   (s) junitArtifactName = junit:junit
  754.   (s) localRepository =        id: local
  755.       url: file:///home/rcbandit/.m2/repository/
  756.    layout: none
  757.  
  758.   (f) parallelMavenExecution = false
  759.   (s) perCoreThreadCount = true
  760.   (s) pluginArtifactMap = {org.apache.maven.plugins:maven-surefire-plugin=org.apache.maven.plugins:maven-surefire-plugin:maven-plugin:2.11:, org.apache.maven.surefire:surefire-booter=org.apache.maven.surefire:surefire-booter:jar:2.11:compile, org.apache.maven.surefire:surefire-api=org.apache.maven.surefire:surefire-api:jar:2.11:compile, org.apache.maven.surefire:maven-surefire-common=org.apache.maven.surefire:maven-surefire-common:jar:2.11:compile, org.apache.maven.shared:maven-common-artifact-filters=org.apache.maven.shared:maven-common-artifact-filters:jar:1.3:compile, org.codehaus.plexus:plexus-utils=org.codehaus.plexus:plexus-utils:jar:2.1:compile, org.apache.maven.reporting:maven-reporting-api=org.apache.maven.reporting:maven-reporting-api:jar:2.0.9:compile}
  761.   (s) printSummary = true
  762.   (s) project = MavenProject: org.DX_57.osgi.SH_27:SH_27-impl:1.0-SNAPSHOT @ /home/rcbandit/Desktop/NetBeans/Prototype_3/SH_27/SH_27-impl/pom.xml
  763.   (s) projectArtifactMap = {junit:junit=junit:junit:jar:3.8.1:test, org.apache.felix:org.osgi.core=org.apache.felix:org.osgi.core:jar:1.0.0:compile, org.DX_57.osgi.SH_27:SH_27-api=org.DX_57.osgi.SH_27:SH_27-api:jar:1.0-SNAPSHOT:compile}
  764.   (s) redirectTestOutputToFile = false
  765.   (s) remoteRepositories = [       id: central
  766.       url: http://repo1.maven.org/maven2
  767.    layout: default
  768. snapshots: [enabled => false, update => daily]
  769.  releases: [enabled => true, update => never]
  770. ]
  771.   (s) reportFormat = brief
  772.   (s) reportsDirectory = /home/rcbandit/Desktop/NetBeans/Prototype_3/SH_27/SH_27-impl/target/surefire-reports
  773.   (s) runOrder = filesystem
  774.   (s) session = org.apache.maven.execution.MavenSession@595c9dcd
  775.   (s) skip = false
  776.   (s) skipTests = false
  777.   (s) testClassesDirectory = /home/rcbandit/Desktop/NetBeans/Prototype_3/SH_27/SH_27-impl/target/test-classes
  778.   (s) testFailureIgnore = false
  779.   (s) testNGArtifactName = org.testng:testng
  780.   (s) testSourceDirectory = /home/rcbandit/Desktop/NetBeans/Prototype_3/SH_27/SH_27-impl/src/test/java
  781.   (s) trimStackTrace = true
  782.   (s) useFile = true
  783.   (s) useManifestOnlyJar = true
  784.   (s) useSystemClassLoader = true
  785.   (s) useUnlimitedThreads = false
  786.   (s) workingDirectory = /home/rcbandit/Desktop/NetBeans/Prototype_3/SH_27/SH_27-impl
  787. -- end configuration --
  788. Surefire report directory: /home/rcbandit/Desktop/NetBeans/Prototype_3/SH_27/SH_27-impl/target/surefire-reports
  789. dummy:dummy:jar:1.0 (selected for null)
  790.   org.apache.maven.surefire:surefire-booter:jar:2.11:compile (selected for compile)
  791.     org.apache.maven.surefire:surefire-api:jar:2.11:compile (selected for compile)
  792. Adding to surefire booter test classpath: /home/rcbandit/.m2/repository/org/apache/maven/surefire/surefire-booter/2.11/surefire-booter-2.11.jar Scope: compile
  793. Adding to surefire booter test classpath: /home/rcbandit/.m2/repository/org/apache/maven/surefire/surefire-api/2.11/surefire-api-2.11.jar Scope: compile
  794. Setting system property [user.dir]=[/home/rcbandit/Desktop/NetBeans/Prototype_3/SH_27/SH_27-impl]
  795. Setting system property [localRepository]=[/home/rcbandit/.m2/repository]
  796. Setting system property [basedir]=[/home/rcbandit/Desktop/NetBeans/Prototype_3/SH_27/SH_27-impl]
  797. Using JVM: /opt/jdk1.7.0_02/jre/bin/java
  798. dummy:dummy:jar:1.0 (selected for null)
  799.   org.apache.maven.surefire:surefire-junit3:jar:2.11:test (selected for test)
  800.     org.apache.maven.surefire:surefire-api:jar:2.11:test (selected for test)
  801. Adding to surefire test classpath: /home/rcbandit/.m2/repository/org/apache/maven/surefire/surefire-junit3/2.11/surefire-junit3-2.11.jar Scope: test
  802. Adding to surefire test classpath: /home/rcbandit/.m2/repository/org/apache/maven/surefire/surefire-api/2.11/surefire-api-2.11.jar Scope: test
  803. test classpath classpath:
  804.   /home/rcbandit/Desktop/NetBeans/Prototype_3/SH_27/SH_27-impl/target/test-classes
  805.   /home/rcbandit/Desktop/NetBeans/Prototype_3/SH_27/SH_27-impl/target/classes
  806.   /home/rcbandit/.m2/repository/junit/junit/3.8.1/junit-3.8.1.jar
  807.   /home/rcbandit/.m2/repository/org/apache/felix/org.osgi.core/1.0.0/org.osgi.core-1.0.0.jar
  808.   /home/rcbandit/.m2/repository/org/DX_57/osgi/SH_27/SH_27-api/1.0-SNAPSHOT/SH_27-api-1.0-SNAPSHOT.jar
  809. provider classpath classpath:
  810.   /home/rcbandit/.m2/repository/org/apache/maven/surefire/surefire-junit3/2.11/surefire-junit3-2.11.jar
  811.   /home/rcbandit/.m2/repository/org/apache/maven/surefire/surefire-api/2.11/surefire-api-2.11.jar
  812.  
  813. -------------------------------------------------------
  814.  T E S T S
  815. -------------------------------------------------------
  816. Forking command line: /bin/sh -c cd /home/rcbandit/Desktop/NetBeans/Prototype_3/SH_27/SH_27-impl && /opt/jdk1.7.0_02/jre/bin/java -jar /home/rcbandit/Desktop/NetBeans/Prototype_3/SH_27/SH_27-impl/target/surefire/surefirebooter4583206889985818294.jar /home/rcbandit/Desktop/NetBeans/Prototype_3/SH_27/SH_27-impl/target/surefire/surefire1399250459519597010tmp /home/rcbandit/Desktop/NetBeans/Prototype_3/SH_27/SH_27-impl/target/surefire/surefire2686269958311897520tmp
  817. Running org.samples.osgi.service.AppTest
  818. Tests run: 1, Failures: 0, Errors: 0, Skipped: 0, Time elapsed: 0.042 sec
  819.  
  820. Results :
  821.  
  822. Tests run: 1, Failures: 0, Errors: 0, Skipped: 0
  823.  
  824.  
  825. [bundle:bundle]
  826. org.apache.felix:maven-bundle-plugin:jar:2.3.6:
  827.    biz.aQute:bndlib:jar:1.50.0:compile
  828.    org.apache.felix:org.apache.felix.bundlerepository:jar:1.6.6:compile
  829.       org.osgi:org.osgi.core:jar:4.1.0:compile
  830.       org.easymock:easymock:jar:2.4:compile
  831.    org.apache.maven:maven-core:jar:2.0.7:compile
  832.       org.apache.maven:maven-settings:jar:2.0.7:compile
  833.       org.apache.maven:maven-plugin-parameter-documenter:jar:2.0.7:compile
  834.       org.apache.maven.reporting:maven-reporting-api:jar:2.0.7:compile
  835.          org.apache.maven.doxia:doxia-sink-api:jar:1.0-alpha-7:compile
  836.       org.apache.maven:maven-profile:jar:2.0.7:compile
  837.       org.apache.maven:maven-model:jar:2.0.7:compile
  838.       org.apache.maven:maven-artifact:jar:2.0.7:compile
  839.       org.codehaus.plexus:plexus-container-default:jar:1.0-alpha-9-stable-1:compile
  840.          junit:junit:jar:3.8.1:compile
  841.       org.apache.maven:maven-repository-metadata:jar:2.0.7:compile
  842.       org.apache.maven:maven-error-diagnostics:jar:2.0.7:compile
  843.       org.apache.maven:maven-project:jar:2.0.7:compile
  844.          org.apache.maven:maven-plugin-registry:jar:2.0.7:compile
  845.       commons-cli:commons-cli:jar:1.0:compile
  846.       org.apache.maven:maven-plugin-api:jar:2.0.7:compile
  847.       org.apache.maven:maven-plugin-descriptor:jar:2.0.7:compile
  848.       org.codehaus.plexus:plexus-interactivity-api:jar:1.0-alpha-4:compile
  849.       org.apache.maven:maven-artifact-manager:jar:2.0.7:compile
  850.       org.apache.maven:maven-monitor:jar:2.0.7:compile
  851.       classworlds:classworlds:jar:1.1:compile
  852.    org.apache.maven:maven-archiver:jar:2.4.1:compile
  853.       org.codehaus.plexus:plexus-archiver:jar:1.0:compile
  854.          org.codehaus.plexus:plexus-io:jar:1.0:compile
  855.       org.codehaus.plexus:plexus-interpolation:jar:1.13:compile
  856.    org.apache.maven.shared:maven-dependency-tree:jar:1.2:compile
  857.    org.codehaus.plexus:plexus-utils:jar:2.1:compile
  858. Created new class realm plugin>org.apache.felix:maven-bundle-plugin:2.3.6
  859. Importing foreign packages into class realm plugin>org.apache.felix:maven-bundle-plugin:2.3.6
  860.   Imported:  < project>org.DX_57.osgi.SH_27:SH_27-impl:1.0-SNAPSHOT
  861. Populating class realm plugin>org.apache.felix:maven-bundle-plugin:2.3.6
  862.   Included: org.apache.felix:maven-bundle-plugin:jar:2.3.6
  863.   Included: biz.aQute:bndlib:jar:1.50.0
  864.   Included: org.apache.felix:org.apache.felix.bundlerepository:jar:1.6.6
  865.   Included: org.osgi:org.osgi.core:jar:4.1.0
  866.   Included: org.easymock:easymock:jar:2.4
  867.   Included: org.apache.maven.reporting:maven-reporting-api:jar:2.0.7
  868.   Included: org.apache.maven.doxia:doxia-sink-api:jar:1.0-alpha-7
  869.   Included: junit:junit:jar:3.8.1
  870.   Included: commons-cli:commons-cli:jar:1.0
  871.   Included: org.codehaus.plexus:plexus-interactivity-api:jar:1.0-alpha-4
  872.   Included: org.apache.maven:maven-archiver:jar:2.4.1
  873.   Included: org.codehaus.plexus:plexus-archiver:jar:1.0
  874.   Included: org.codehaus.plexus:plexus-io:jar:1.0
  875.   Included: org.codehaus.plexus:plexus-interpolation:jar:1.13
  876.   Included: org.apache.maven.shared:maven-dependency-tree:jar:1.2
  877.   Included: org.codehaus.plexus:plexus-utils:jar:2.1
  878.   Excluded: org.apache.maven:maven-core:jar:2.0.7
  879.   Excluded: org.apache.maven:maven-settings:jar:2.0.7
  880.   Excluded: org.apache.maven:maven-plugin-parameter-documenter:jar:2.0.7
  881.   Excluded: org.apache.maven:maven-profile:jar:2.0.7
  882.   Excluded: org.apache.maven:maven-model:jar:2.0.7
  883.   Excluded: org.apache.maven:maven-artifact:jar:2.0.7
  884.   Excluded: org.codehaus.plexus:plexus-container-default:jar:1.0-alpha-9-stable-1
  885.   Excluded: org.apache.maven:maven-repository-metadata:jar:2.0.7
  886.   Excluded: org.apache.maven:maven-error-diagnostics:jar:2.0.7
  887.   Excluded: org.apache.maven:maven-project:jar:2.0.7
  888.   Excluded: org.apache.maven:maven-plugin-registry:jar:2.0.7
  889.   Excluded: org.apache.maven:maven-plugin-api:jar:2.0.7
  890.   Excluded: org.apache.maven:maven-plugin-descriptor:jar:2.0.7
  891.   Excluded: org.apache.maven:maven-artifact-manager:jar:2.0.7
  892.   Excluded: org.apache.maven:maven-monitor:jar:2.0.7
  893.   Excluded: classworlds:classworlds:jar:1.1
  894. Configuring mojo org.apache.felix:maven-bundle-plugin:2.3.6:bundle from plugin realm ClassRealm[plugin>org.apache.felix:maven-bundle-plugin:2.3.6, parent: sun.misc.Launcher$AppClassLoader@397577f9]
  895. Configuring mojo 'org.apache.felix:maven-bundle-plugin:2.3.6:bundle' with basic configurator -->
  896.   (f) buildDirectory = /home/rcbandit/Desktop/NetBeans/Prototype_3/SH_27/SH_27-impl/target
  897.   (f) instructions = {Bundle-Activator=org.DX_57.osgi.SH_27.impl.SessionHandleApp, Bundle-SymbolicName=SH_27-impl, Export-Package=org.DX_57.osgi.SH_27.impl,org.osgi.framework,org.osgi.service.condpermadmin,org.osgi.service.packageadmin,org.osgi.service.permissionadmin,org.osgi.service.startlevel,org.osgi.service.url,org.samples.osgi.service, Import-Package=org.DX_57.osgi.SH_27.api, org.osgi.framework, Private-Package=org.DX_57.osgi.SH_27.impl.*,org.samples.osgi.service.*}
  898.   (f) m_mavenSession = org.apache.maven.execution.MavenSession@595c9dcd
  899.   (f) manifestLocation = /home/rcbandit/Desktop/NetBeans/Prototype_3/SH_27/SH_27-impl/target/classes/META-INF
  900.   (f) outputDirectory = /home/rcbandit/Desktop/NetBeans/Prototype_3/SH_27/SH_27-impl/target/classes
  901.   (f) project = MavenProject: org.DX_57.osgi.SH_27:SH_27-impl:1.0-SNAPSHOT @ /home/rcbandit/Desktop/NetBeans/Prototype_3/SH_27/SH_27-impl/pom.xml
  902. -- end configuration --
  903. BND Instructions:
  904. #-----------------------------------------------------------------------
  905. #Sat Jan 28 18:55:41 EET 2012
  906. pom.id=org.DX_57.osgi.SH_27\:SH_27-impl\:bundle\:1.0-SNAPSHOT
  907. env.DESKTOP_SESSION=gnome
  908. env.OLDPWD=/home/rcbandit/Desktop/NetBeans/Prototype_3/SH_27/SH_27-impl
  909. file.encoding.pkg=sun.io
  910. java.home=/opt/jdk1.7.0_02/jre
  911. env.DISPLAY=\:0.0
  912. env.XDG_VTNR=1
  913. pom.contributors=
  914. project.build.developers=
  915. classworlds.conf=/home/rcbandit/netbeans-7.0.1/java/maven/bin/m2.conf
  916. env.XDG_SESSION_COOKIE=353e720329bb1813f71d8e5c0000000a-1327750063.357802-1322348130
  917. pom.pomFile=/home/rcbandit/Desktop/NetBeans/Prototype_3/SH_27/SH_27-impl/pom.xml
  918. java.endorsed.dirs=/opt/jdk1.7.0_02/jre/lib/endorsed
  919. project.build.groupId=org.DX_57.osgi.SH_27
  920. env.LOGNAME=rcbandit
  921. env.USERNAME=rcbandit
  922. env.XDG_SEAT=seat0
  923. env.SESSION_MANAGER=local/unix\:@/tmp/.ICE-unix/1287,unix/unix\:/tmp/.ICE-unix/1287
  924. sun.os.patch.level=unknown
  925. java.vendor.url=http\://java.oracle.com/
  926. pom.profiles=
  927. maven-symbolicname=org.DX_57.osgi.SH_27.impl
  928. java.version=1.7.0_02
  929. project.build.contributors=
  930. java.vendor.url.bug=http\://bugreport.sun.com/bugreport/
  931. env.GNOME_KEYRING_CONTROL=/tmp/keyring-w4QgXu
  932. user.name=rcbandit
  933. env.LANG=en_US.UTF-8
  934. env.CVS_RSH=ssh
  935. project.build.pomFile=/home/rcbandit/Desktop/NetBeans/Prototype_3/SH_27/SH_27-impl/pom.xml
  936. sun.io.unicode.encoding=UnicodeLittle
  937. sun.jnu.encoding=UTF-8
  938. env.DBUS_SESSION_BUS_ADDRESS=unix\:abstract\=/tmp/dbus-nv6UzfyACd,guid\=9c3ae8d1bc01fd57f1ca390e0000001e
  939. java.runtime.name=Java(TM) SE Runtime Environment
  940. project.build.outputdirectory=/home/rcbandit/Desktop/NetBeans/Prototype_3/SH_27/SH_27-impl/target/classes
  941. project.version=1.0-SNAPSHOT
  942. java.specification.name=Java Platform API Specification
  943. user.timezone=Europe/Sofia
  944. env.LESSOPEN=||/usr/bin/lesspipe.sh %s
  945. env.GIO_LAUNCHED_DESKTOP_FILE=/home/rcbandit/Desktop/netbeans-7.0.1.desktop
  946. pom.mailingLists=
  947. path.separator=\:
  948. project.contributors=
  949. pom.artifactId=SH_27-impl
  950. project.name=SH_27-impl
  951. env.XMODIFIERS=@im\=none
  952. file.encoding=UTF-8
  953. pom.url=http\://maven.apache.org
  954. env.HOME=/home/rcbandit
  955. sun.java.command=org.codehaus.plexus.classworlds.launcher.Launcher clean package -X
  956. project.id=org.DX_57.osgi.SH_27\:SH_27-impl\:bundle\:1.0-SNAPSHOT
  957. env.HOSTNAME=Laptop
  958. Bundle-Activator=org.DX_57.osgi.SH_27.impl.SessionHandleApp
  959. Export-Package=org.DX_57.osgi.SH_27.impl,org.osgi.framework,org.osgi.service.condpermadmin,org.osgi.service.packageadmin,org.osgi.service.permissionadmin,org.osgi.service.startlevel,org.osgi.service.url,org.samples.osgi.service
  960. java.io.tmpdir=/tmp
  961. project.build.mailingLists=
  962. env.GNOME_KEYRING_PID=1283
  963. user.language=en
  964. env.HISTCONTROL=ignoredups
  965. line.separator=\n
  966. project.build.directory=/home/rcbandit/Desktop/NetBeans/Prototype_3/SH_27/SH_27-impl/target
  967. env.HISTSIZE=1000
  968. java.vm.info=mixed mode
  969. sun.desktop=gnome
  970. java.vm.specification.name=Java Virtual Machine Specification
  971. project.build.id=org.DX_57.osgi.SH_27\:SH_27-impl\:bundle\:1.0-SNAPSHOT
  972. project.build.licenses=
  973. pom.modelVersion=4.0.0
  974. project.licenses=
  975. env.GDMSESSION=gnome
  976. project.developers=
  977. java.awt.printerjob=sun.print.PSPrinterJob
  978. project.url=http\://maven.apache.org
  979. -removeheaders=Include-Resource,Private-Package
  980. pom.version=1.0-SNAPSHOT
  981. -plugin=org.apache.felix.bundleplugin.BlueprintPlugin,aQute.lib.spring.SpringXMLType
  982. project.mailingLists=
  983. pom.packaging=bundle
  984. project.build.parent=org.DX_57.osgi.SH_27\:SH_27\:pom\:1.0-SNAPSHOT
  985. project.projectDirectory=/home/rcbandit/Desktop/NetBeans/Prototype_3/SH_27/SH_27-impl
  986. os.name=Linux
  987. project.build.modelVersion=4.0.0
  988. java.specification.vendor=Oracle Corporation
  989. env.TERM=dumb
  990. java.vm.name=Java HotSpot(TM) 64-Bit Server VM
  991. env.QT_IM_MODULE=xim
  992. java.library.path=/usr/java/packages/lib/amd64\:/usr/lib64\:/lib64\:/lib\:/usr/lib
  993. project.build.build=org.apache.maven.model.Build@22cbc660
  994. env.PATH=/usr/lib64/ccache\:/usr/local/bin\:/usr/bin\:/bin\:/usr/local/sbin\:/usr/sbin\:/sbin\:/home/rcbandit/.local/bin\:/home/rcbandit/bin
  995. pom.build=org.apache.maven.model.Build@22cbc660
  996. java.class.version=51.0
  997. env.SHLVL=2
  998. project.build.version=1.0-SNAPSHOT
  999. pom.parent=org.DX_57.osgi.SH_27\:SH_27\:pom\:1.0-SNAPSHOT
  1000. pom.projectDirectory=/home/rcbandit/Desktop/NetBeans/Prototype_3/SH_27/SH_27-impl
  1001. project.modelVersion=4.0.0
  1002. Bundle-SymbolicName=SH_27-impl
  1003. sun.boot.library.path=/opt/jdk1.7.0_02/jre/lib/amd64
  1004. Private-Package=org.DX_57.osgi.SH_27.impl.*,org.samples.osgi.service.*
  1005. project.build.artifactId=SH_27-impl
  1006. sun.management.compiler=HotSpot 64-Bit Tiered Compilers
  1007. java.awt.graphicsenv=sun.awt.X11GraphicsEnvironment
  1008. pom.name=SH_27-impl
  1009. env.USER=rcbandit
  1010. pom.developers=
  1011. project.build=org.apache.maven.model.Build@22cbc660
  1012. project.baseDir=/home/rcbandit/Desktop/NetBeans/Prototype_3/SH_27/SH_27-impl
  1013. project.build.name=SH_27-impl
  1014. java.vm.specification.version=1.7
  1015. project.groupId=org.DX_57.osgi.SH_27
  1016. Bundle-Version=1.0.0.SNAPSHOT
  1017. env.NLSPATH=/usr/dt/lib/nls/msg/%L/%N.cat
  1018. awt.toolkit=sun.awt.X11.XToolkit
  1019. project.build.profiles=
  1020. sun.cpu.isalist=
  1021. project.profiles=
  1022. java.ext.dirs=/opt/jdk1.7.0_02/jre/lib/ext\:/usr/java/packages/lib/ext
  1023. Import-Package=org.DX_57.osgi.SH_27.api, org.osgi.framework
  1024. os.version=3.2.2-1.fc16.x86_64
  1025. user.home=/home/rcbandit
  1026. java.vm.vendor=Oracle Corporation
  1027. env.JAVA_HOME=/opt/jdk1.7.0_02
  1028. env.XDG_SESSION_ID=2
  1029. env.XAUTHORITY=/var/run/gdm/auth-for-rcbandit-B5Ix2Z/database
  1030. user.dir=/home/rcbandit/Desktop/NetBeans/Prototype_3/SH_27/SH_27-impl
  1031. env.XFILESEARCHPATH=/usr/dt/app-defaults/%L/Dt
  1032. env.WINDOWPATH=1
  1033. env.MAIL=/var/spool/mail/rcbandit
  1034. env.PWD=/home/rcbandit/Desktop/NetBeans/Prototype_3/SH_27/SH_27-impl
  1035. project.parent=org.DX_57.osgi.SH_27\:SH_27\:pom\:1.0-SNAPSHOT
  1036. sun.cpu.endian=little
  1037. env.NB_EXEC_MAVEN_PROCESS_UUID=3ed15714-1665-49fe-a9c5-d6f88dbc7ab1
  1038. project.dir=/home/rcbandit/Desktop/NetBeans/Prototype_3/SH_27/SH_27-impl
  1039. pom.licenses=
  1040. classifier=
  1041. java.vm.version=22.0-b10
  1042. java.class.path=/home/rcbandit/netbeans-7.0.1/java/maven/boot/plexus-classworlds-2.4.jar
  1043. os.arch=amd64
  1044. project.build.url=http\://maven.apache.org
  1045. project.build.projectDirectory=/home/rcbandit/Desktop/NetBeans/Prototype_3/SH_27/SH_27-impl
  1046. env.GIO_LAUNCHED_DESKTOP_FILE_PID=8431
  1047. sun.java.launcher=SUN_STANDARD
  1048. env.IMSETTINGS_INTEGRATE_DESKTOP=yes
  1049. project.packaging=bundle
  1050. java.vm.specification.vendor=Oracle Corporation
  1051. env.DESKTOP_AUTOSTART_ID=104c84c152bce57a8a132775006386829200000012870025
  1052. env.CCACHE_HASHDIR=
  1053. file.separator=/
  1054. java.runtime.version=1.7.0_02-b13
  1055. project.pomFile=/home/rcbandit/Desktop/NetBeans/Prototype_3/SH_27/SH_27-impl/pom.xml
  1056. env.SSH_AUTH_SOCK=/tmp/keyring-w4QgXu/ssh
  1057. sun.boot.class.path=/opt/jdk1.7.0_02/jre/lib/resources.jar\:/opt/jdk1.7.0_02/jre/lib/rt.jar\:/opt/jdk1.7.0_02/jre/lib/sunrsasign.jar\:/opt/jdk1.7.0_02/jre/lib/jsse.jar\:/opt/jdk1.7.0_02/jre/lib/jce.jar\:/opt/jdk1.7.0_02/jre/lib/charsets.jar\:/opt/jdk1.7.0_02/jre/classes
  1058. project.build.packaging=bundle
  1059. env.XDG_RUNTIME_DIR=/run/user/rcbandit
  1060. project.artifactId=SH_27-impl
  1061. user.country=US
  1062. env.J2D_PIXMAPS=shared
  1063. maven.home=/home/rcbandit/netbeans-7.0.1/java/maven
  1064. env.SHELL=/bin/bash
  1065. -sourcepath=/home/rcbandit/Desktop/NetBeans/Prototype_3/SH_27/SH_27-impl/src/main/java
  1066. pom.groupId=org.DX_57.osgi.SH_27
  1067. java.vendor=Oracle Corporation
  1068. env.GPG_AGENT_INFO=/tmp/keyring-w4QgXu/gpg\:0\:1
  1069. env.IMSETTINGS_MODULE=none
  1070. Bundle-Name=SH_27-impl
  1071. java.specification.version=1.7
  1072. env.GNOME_DESKTOP_SESSION_ID=this-is-deprecated
  1073. sun.arch.data.model=64
  1074. #-----------------------------------------------------------------------
  1075.  
  1076. BND Classpath:
  1077. #-----------------------------------------------------------------------
  1078. -classpath:\
  1079.  /home/rcbandit/Desktop/NetBeans/Prototype_3/SH_27/SH_27-impl/target/classes,\
  1080.  /home/rcbandit/.m2/repository/org/apache/felix/org.osgi.core/1.0.0/org.osgi.core-1.0.0.jar,\
  1081.  /home/rcbandit/.m2/repository/org/DX_57/osgi/SH_27/SH_27-api/1.0-SNAPSHOT/SH_27-api-1.0-SNAPSHOT.jar
  1082. #-----------------------------------------------------------------------
  1083.  
  1084. BND Manifest:
  1085. #-----------------------------------------------------------------------
  1086. Manifest-Version: 1.0
  1087. Bnd-LastModified: 1327769742384
  1088. Bundle-Activator: org.DX_57.osgi.SH_27.impl.SessionHandleApp
  1089. Bundle-ManifestVersion: 2
  1090. Bundle-Name: SH_27-impl
  1091. Bundle-SymbolicName: SH_27-impl
  1092. Bundle-Version: 1.0.0.SNAPSHOT
  1093. Created-By: 1.7.0_02 (Oracle Corporation)
  1094. Export-Package: org.DX_57.osgi.SH_27.impl;uses:="org.DX_57.osgi.SH_27.ap
  1095.  i,org.osgi.framework";version="1.0.0.SNAPSHOT",org.osgi.framework;versi
  1096.  on="1.3",org.osgi.service.condpermadmin;uses:="org.osgi.framework,org.o
  1097.  sgi.service.permissionadmin";version="1.0",org.osgi.service.packageadmi
  1098.  n;uses:="org.osgi.framework";version="1.2",org.osgi.service.permissiona
  1099.  dmin;version="1.2",org.osgi.service.startlevel;uses:="org.osgi.framewor
  1100.  k";version="1.0",org.osgi.service.url;version="1.0"
  1101. Import-Package: org.DX_57.osgi.SH_27.api;version="[1.0,2)",org.osgi.fram
  1102.  ework;version="[1.3,2)"
  1103. Tool: Bnd-1.50.0
  1104. #-----------------------------------------------------------------------
  1105.  
  1106. Final Manifest:
  1107. #-----------------------------------------------------------------------
  1108. Manifest-Version: 1.0
  1109. Bnd-LastModified: 1327769742384
  1110. Build-Jdk: 1.7.0_02
  1111. Built-By: rcbandit
  1112. Bundle-Activator: org.DX_57.osgi.SH_27.impl.SessionHandleApp
  1113. Bundle-ManifestVersion: 2
  1114. Bundle-Name: SH_27-impl
  1115. Bundle-SymbolicName: SH_27-impl
  1116. Bundle-Version: 1.0.0.SNAPSHOT
  1117. Created-By: Apache Maven Bundle Plugin
  1118. Export-Package: org.DX_57.osgi.SH_27.impl;uses:="org.DX_57.osgi.SH_27.ap
  1119.  i,org.osgi.framework";version="1.0.0.SNAPSHOT",org.osgi.framework;versi
  1120.  on="1.3",org.osgi.service.condpermadmin;uses:="org.osgi.framework,org.o
  1121.  sgi.service.permissionadmin";version="1.0",org.osgi.service.packageadmi
  1122.  n;uses:="org.osgi.framework";version="1.2",org.osgi.service.permissiona
  1123.  dmin;version="1.2",org.osgi.service.startlevel;uses:="org.osgi.framewor
  1124.  k";version="1.0",org.osgi.service.url;version="1.0"
  1125. Import-Package: org.DX_57.osgi.SH_27.api;version="[1.0,2)",org.osgi.fram
  1126.  ework;version="[1.3,2)"
  1127. Tool: Bnd-1.50.0
  1128. #-----------------------------------------------------------------------
  1129.  
  1130. Bundle org.DX_57.osgi.SH_27:SH_27-impl:bundle:1.0-SNAPSHOT : Instructions in Private-Package, or -testpackages that are never used: org\.samples\.osgi\.service\..*|org\.samples\.osgi\.service
  1131. Classpath: Jar:.,Jar:org.osgi.core,Jar:SH_27-api
  1132.  
  1133. Bundle org.DX_57.osgi.SH_27:SH_27-impl:bundle:1.0-SNAPSHOT : Split package org/osgi/framework
  1134. Use directive -split-package:=(merge-first|merge-last|error|first) on Export/Private Package instruction to get rid of this warning
  1135. Package found in   [Jar:org.osgi.core, Jar:SH_27-api]
  1136. Reference from     /home/rcbandit/.m2/repository/org/DX_57/osgi/SH_27/SH_27-api/1.0-SNAPSHOT/SH_27-api-1.0-SNAPSHOT.jar
  1137. Classpath          [Jar:., Jar:org.osgi.core, Jar:SH_27-api]
  1138. Bundle org.DX_57.osgi.SH_27:SH_27-impl:bundle:1.0-SNAPSHOT : Split package org/osgi/service/condpermadmin
  1139. Use directive -split-package:=(merge-first|merge-last|error|first) on Export/Private Package instruction to get rid of this warning
  1140. Package found in   [Jar:org.osgi.core, Jar:SH_27-api]
  1141. Reference from     /home/rcbandit/.m2/repository/org/DX_57/osgi/SH_27/SH_27-api/1.0-SNAPSHOT/SH_27-api-1.0-SNAPSHOT.jar
  1142. Classpath          [Jar:., Jar:org.osgi.core, Jar:SH_27-api]
  1143. Bundle org.DX_57.osgi.SH_27:SH_27-impl:bundle:1.0-SNAPSHOT : Split package org/osgi/service/packageadmin
  1144. Use directive -split-package:=(merge-first|merge-last|error|first) on Export/Private Package instruction to get rid of this warning
  1145. Package found in   [Jar:org.osgi.core, Jar:SH_27-api]
  1146. Reference from     /home/rcbandit/.m2/repository/org/DX_57/osgi/SH_27/SH_27-api/1.0-SNAPSHOT/SH_27-api-1.0-SNAPSHOT.jar
  1147. Classpath          [Jar:., Jar:org.osgi.core, Jar:SH_27-api]
  1148. Bundle org.DX_57.osgi.SH_27:SH_27-impl:bundle:1.0-SNAPSHOT : Split package org/osgi/service/permissionadmin
  1149. Use directive -split-package:=(merge-first|merge-last|error|first) on Export/Private Package instruction to get rid of this warning
  1150. Package found in   [Jar:org.osgi.core, Jar:SH_27-api]
  1151. Reference from     /home/rcbandit/.m2/repository/org/DX_57/osgi/SH_27/SH_27-api/1.0-SNAPSHOT/SH_27-api-1.0-SNAPSHOT.jar
  1152. Classpath          [Jar:., Jar:org.osgi.core, Jar:SH_27-api]
  1153. Bundle org.DX_57.osgi.SH_27:SH_27-impl:bundle:1.0-SNAPSHOT : Split package org/osgi/service/startlevel
  1154. Use directive -split-package:=(merge-first|merge-last|error|first) on Export/Private Package instruction to get rid of this warning
  1155. Package found in   [Jar:org.osgi.core, Jar:SH_27-api]
  1156. Reference from     /home/rcbandit/.m2/repository/org/DX_57/osgi/SH_27/SH_27-api/1.0-SNAPSHOT/SH_27-api-1.0-SNAPSHOT.jar
  1157. Classpath          [Jar:., Jar:org.osgi.core, Jar:SH_27-api]
  1158. Bundle org.DX_57.osgi.SH_27:SH_27-impl:bundle:1.0-SNAPSHOT : Split package org/osgi/service/url
  1159. Use directive -split-package:=(merge-first|merge-last|error|first) on Export/Private Package instruction to get rid of this warning
  1160. Package found in   [Jar:org.osgi.core, Jar:SH_27-api]
  1161. Reference from     /home/rcbandit/.m2/repository/org/DX_57/osgi/SH_27/SH_27-api/1.0-SNAPSHOT/SH_27-api-1.0-SNAPSHOT.jar
  1162. Classpath          [Jar:., Jar:org.osgi.core, Jar:SH_27-api]
  1163. Bundle org.DX_57.osgi.SH_27:SH_27-impl:bundle:1.0-SNAPSHOT : Instructions in Export-Package that are never used: org\.samples\.osgi\.service
  1164. Classpath: Jar:.,Jar:org.osgi.core,Jar:SH_27-api
  1165.  
  1166. Bundle org.DX_57.osgi.SH_27:SH_27-impl:bundle:1.0-SNAPSHOT : Superfluous export-package instructions: [org.samples.osgi.service]
  1167. Bundle org.DX_57.osgi.SH_27:SH_27-impl:bundle:1.0-SNAPSHOT : Unresolved references to [javax.activation, javax.annotation] by class(es) on the Bundle-Classpath[Jar:dot]: [org/DX_57/osgi/SH_27/impl/SessionHandleImpl.class]
  1168. Error(s) found in bundle configuration
  1169. ------------------------------------------------------------------------
  1170. BUILD FAILURE
  1171. ------------------------------------------------------------------------
  1172. Total time: 12.032s
  1173. Finished at: Sat Jan 28 18:55:42 EET 2012
  1174. Final Memory: 20M/171M
  1175. ------------------------------------------------------------------------
  1176. Failed to execute goal org.apache.felix:maven-bundle-plugin:2.3.6:bundle (default-bundle) on project SH_27-impl: Error(s) found in bundle configuration -> [Help 1]
  1177. org.apache.maven.lifecycle.LifecycleExecutionException: Failed to execute goal org.apache.felix:maven-bundle-plugin:2.3.6:bundle (default-bundle) on project SH_27-impl: Error(s) found in bundle configuration
  1178.         at org.apache.maven.lifecycle.internal.MojoExecutor.execute(MojoExecutor.java:217)
  1179.         at org.apache.maven.lifecycle.internal.MojoExecutor.execute(MojoExecutor.java:153)
  1180.         at org.apache.maven.lifecycle.internal.MojoExecutor.execute(MojoExecutor.java:145)
  1181.         at org.apache.maven.lifecycle.internal.LifecycleModuleBuilder.buildProject(LifecycleModuleBuilder.java:84)
  1182.         at org.apache.maven.lifecycle.internal.LifecycleModuleBuilder.buildProject(LifecycleModuleBuilder.java:59)
  1183.         at org.apache.maven.lifecycle.internal.LifecycleStarter.singleThreadedBuild(LifecycleStarter.java:183)
  1184.         at org.apache.maven.lifecycle.internal.LifecycleStarter.execute(LifecycleStarter.java:161)
  1185.         at org.apache.maven.DefaultMaven.doExecute(DefaultMaven.java:319)
  1186.         at org.apache.maven.DefaultMaven.execute(DefaultMaven.java:156)
  1187.         at org.apache.maven.cli.MavenCli.execute(MavenCli.java:537)
  1188.         at org.apache.maven.cli.MavenCli.doMain(MavenCli.java:196)
  1189.         at org.apache.maven.cli.MavenCli.main(MavenCli.java:141)
  1190.         at sun.reflect.NativeMethodAccessorImpl.invoke0(Native Method)
  1191.         at sun.reflect.NativeMethodAccessorImpl.invoke(NativeMethodAccessorImpl.java:57)
  1192.         at sun.reflect.DelegatingMethodAccessorImpl.invoke(DelegatingMethodAccessorImpl.java:43)
  1193.         at java.lang.reflect.Method.invoke(Method.java:601)
  1194.         at org.codehaus.plexus.classworlds.launcher.Launcher.launchEnhanced(Launcher.java:290)
  1195.         at org.codehaus.plexus.classworlds.launcher.Launcher.launch(Launcher.java:230)
  1196.         at org.codehaus.plexus.classworlds.launcher.Launcher.mainWithExitCode(Launcher.java:409)
  1197.         at org.codehaus.plexus.classworlds.launcher.Launcher.main(Launcher.java:352)
  1198. Caused by: org.apache.maven.plugin.MojoExecutionException: Error(s) found in bundle configuration
  1199.         at org.apache.felix.bundleplugin.BundlePlugin.execute(BundlePlugin.java:406)
  1200.         at org.apache.felix.bundleplugin.BundlePlugin.execute(BundlePlugin.java:263)
  1201.         at org.apache.felix.bundleplugin.BundlePlugin.execute(BundlePlugin.java:254)
  1202.         at org.apache.maven.plugin.DefaultBuildPluginManager.executeMojo(DefaultBuildPluginManager.java:101)
  1203.         at org.apache.maven.lifecycle.internal.MojoExecutor.execute(MojoExecutor.java:209)
  1204.         ... 19 more
  1205. Caused by: org.apache.maven.plugin.MojoFailureException: Error(s) found in bundle configuration
  1206.         at org.apache.felix.bundleplugin.BundlePlugin.execute(BundlePlugin.java:355)
  1207.         ... 23 more
  1208.  
  1209.  
  1210. For more information about the errors and possible solutions, please read the following articles:
  1211. [Help 1] http://cwiki.apache.org/confluence/display/MAVEN/MojoExecutionException
clone this paste RAW Paste Data