SHARE
TWEET

Untitled

a guest Apr 30th, 2013 98 Never
  1. make -C /lib/modules/3.8.9-200.fc18.x86_64/build M=/home/l33tname/rtl_92ce_92se_92de_8723ae_linux_mac80211_0006.0514.2012 modules
  2. make[1]: Entering directory `/usr/src/kernels/3.8.9-200.fc18.x86_64'
  3.   CC [M]  /home/l33tname/rtl_92ce_92se_92de_8723ae_linux_mac80211_0006.0514.2012/base.o
  4. In file included from /home/l33tname/rtl_92ce_92se_92de_8723ae_linux_mac80211_0006.0514.2012/base.c:39:0:
  5. /home/l33tname/rtl_92ce_92se_92de_8723ae_linux_mac80211_0006.0514.2012/pci.h:245:1: error: implicit declaration of function ‘rtl_pci_probe’ [-Werror=implicit-function-declaration]
  6. /home/l33tname/rtl_92ce_92se_92de_8723ae_linux_mac80211_0006.0514.2012/pci.h:245:30: error: expected expression before ‘struct’
  7. /home/l33tname/rtl_92ce_92se_92de_8723ae_linux_mac80211_0006.0514.2012/base.c: In function ‘rtl_action_proc’:
  8. /home/l33tname/rtl_92ce_92se_92de_8723ae_linux_mac80211_0006.0514.2012/base.c:870:25: error: ‘RX_FLAG_MACTIME_MPDU’ undeclared (first use in this function)
  9. /home/l33tname/rtl_92ce_92se_92de_8723ae_linux_mac80211_0006.0514.2012/base.c:870:25: note: each undeclared identifier is reported only once for each function it appears in
  10. /home/l33tname/rtl_92ce_92se_92de_8723ae_linux_mac80211_0006.0514.2012/base.c: In function ‘rtl_send_smps_action’:
  11. /home/l33tname/rtl_92ce_92se_92de_8723ae_linux_mac80211_0006.0514.2012/base.c:1432:16: error: ‘struct <anonymous>’ has no member named ‘sta’
  12. cc1: some warnings being treated as errors
  13. make[2]: *** [/home/l33tname/rtl_92ce_92se_92de_8723ae_linux_mac80211_0006.0514.2012/base.o] Error 1
  14. make[1]: *** [_module_/home/l33tname/rtl_92ce_92se_92de_8723ae_linux_mac80211_0006.0514.2012] Error 2
  15. make[1]: Leaving directory `/usr/src/kernels/3.8.9-200.fc18.x86_64'
  16. make: *** [all] Error 2
RAW Paste Data
Top