Want more features on Pastebin? Sign Up, it's FREE!
Guest

boot log 0.0.9

By: a guest on Apr 13th, 2013  |  syntax: None  |  size: 225.33 KB  |  views: 62  |  expires: Never
download  |  raw  |  embed  |  report abuse  |  print
Text below is selected. Please press Ctrl+C to copy to your clipboard. (⌘+C on Mac)
  1. --------- beginning of /dev/log/main
  2. I/installd(  502): installd firing up
  3. E/uim-sysfs(  493): uim: Inside main
  4. E/uim-sysfs(  493): uim:ST built into the kernel ?
  5. E/uim-sysfs(  493): uim: Inside insmod
  6. I/cat     (  488): <6>[    0.000000] Initializing cgroup subsys cpu
  7. I/cat     (  488): <5>[    0.000000] Linux version 3.0.21+ (mueller@OfficePC) (gcc version 4.7.3 20130226 (prerelease) (Linaro GCC 4.7-2013.03) ) #1 SMP PREEMPT Thu Apr 11 22:35:34 CEST 2013
  8. I/cat     (  488): <7>[    0.000000] CPU: ARMv7 Processor [412fc09a] revision 10 (ARMv7), cr=10c5387d
  9. I/cat     (  488): <7>[    0.000000] CPU: VIPT nonaliasing data cache, VIPT aliasing instruction cache
  10. I/cat     (  488): <7>[    0.000000] Machine: ARCHOS A80S board
  11. I/cat     (  488): <6>[    0.000000] fixup_archos: 512M@0x80000000 from bootloader.
  12. I/cat     (  488): <7>[    0.000000] fixup_archos: [mem=512M init=/linuxrc debug omapdss.debug=0 omapfb.debug=0 omaplfb.debug=0]
  13. I/cat     (  488): <6>[    0.000000] Product Name: A80S
  14. I/cat     (  488): <6>[    0.000000] DDR type hynix
  15. I/cat     (  488): <6>[    0.000000] android_display: setting default resolution 1024*768, bpp=4
  16. I/cat     (  488): <6>[    0.000000] android_display: tiler1d 56623104
  17. I/cat     (  488): <6>[    0.000000] android_display: setting fb0.vram to 9437184
  18. I/cat     (  488): <6>[    0.000000] android_display: setting vram to 9437184
  19. I/cat     (  488): <6>[    0.000000] android_display: ion carveouts: 77594624 tiler2d, 0 nonsecure
  20. I/cat     (  488): <6>[    0.000000] omap4_total_ram_size = 0x20000000
  21. I/cat     (  488): <6>[    0.000000] omap4_smc_size = 0x300000
  22. I/cat     (  488): <6>[    0.000000] omap4_ion_heap_secure_input_size = 0x0
  23. I/cat     (  488): <6>[    0.000000] omap4_ion_heap_secure_output_wfdhdcp_size = 0x0
  24. I/cat     (  488): <6>[    0.000000] omap4_ducati_heap_size = 0x1900000
  25. I/cat     (  488): <6>[    0.000000] omap4_ion_heap_tiler_mem_size = 0x80000
  26. I/cat     (  488): <6>[    0.000000] omap4_ion_heap_nonsec_tiler_mem_size  = 0x80000
  27. I/cat     (  488): <6>[    0.000000]  omap4_smc_addr = 0x9fd00000
  28. I/cat     (  488): <6>[    0.000000] omap4_ion_heap_secure_input_addr = 0x9fd00000
  29. I/cat     (  488): <6>[    0.000000] omap4_ion_heap_secure_output_wfdhdcp_addr = 0x9fd00000
  30. I/cat     (  488): <6>[    0.000000] omap4_ducati_heap_addr = 0x9e700000
  31. I/cat     (  488): <6>[    0.000000] omap4_ion_heap_tiler_mem_addr = 0x9e680000
  32. I/cat     (  488): <6>[    0.000000] omap4_ion_heap_nonsec_tiler_mem_addr  = 0x9e600000
  33. I/cat     (  488): <6>[    0.000000] omap_ion_init: secure_input id=2 [9fd00000-9fd00000] size=0
  34. I/cat     (  488): <6>[    0.000000] omap_ion_init: secure_output_wfdhdcp id=5 [9fd00000-9fd00000] size=0
  35. I/cat     (  488): <6>[    0.000000] omap_ion_init: tiler id=1 [9e680000-9e700000] size=80000
  36. I/cat     (  488): <6>[    0.000000] omap_ion_init: nonsecure_tiler id=3 [9e600000-9e680000] size=80000
  37. I/cat     (  488): <6>[    0.000000] omap_ion_init: system id=0 [0-0] size=0
  38. I/cat     (  488): <6>[    0.000000] omap_ion_init: tiler_reservation id=4 [0-0] size=0
  39. I/cat     (  488): <6>[    0.000000] Reserving 10485760 bytes SDRAM for VRAM
  40. I/cat     (  488): <7>[    0.000000] Memory policy: ECC disabled, Data cache writealloc
  41. I/cat     (  488): <6>[    0.000000] OMAP4460 ES1.1
  42. I/cat     (  488): <6>[    0.000000] SRAM: Mapped pa 0x40300000 to va 0xfe400000 size: 0xd000
  43. I/cat     (  488): <7>[    0.000000] On node 0 totalpages: 121856
  44. I/cat     (  488): <7>[    0.000000] free_area_init_node: node 0, pgdat c07e7e40, node_mem_map c0949000
  45. I/cat     (  488): <7>[    0.000000]   Normal zone: 1024 pages used for memmap
  46. I/cat     (  488): <7>[    0.000000]   Normal zone: 0 pages reserved
  47. I/cat     (  488): <7>[    0.000000]   Normal zone: 120832 pages, LIFO batch:31
  48. I/cat     (  488): <6>[    0.000000] PERCPU: Embedded 7 pages/cpu @c0d4f000 s6816 r8192 d13664 u32768
  49. I/cat     (  488): <7>[    0.000000] pcpu-alloc: s6816 r8192 d13664 u32768 alloc=8*4096
  50. I/cat     (  488): <7>[    0.000000] pcpu-alloc: [0] 0 [0] 1
  51. I/cat     (  488): <7>[    0.000000] Built 1 zonelists in Zone order, mobility grouping on.  Total pages: 120832
  52. I/cat     (  488): <5>[    0.000000] Kernel command line: mem=512M init=/linuxrc debug omapdss.debug=0 omapfb.debug=0 omaplfb.debug=0
  53. I/cat     (  488): <6>[    0.000000] PID hash table entries: 2048 (order: 1, 8192 bytes)
  54. I/cat     (  488): <6>[    0.000000] Dentry cache hash table entries: 65536 (order: 6, 262144 bytes)
  55. I/cat     (  488): <6>[    0.000000] Inode-cache hash table entries: 32768 (order: 5, 131072 bytes)
  56. I/cat     (  488): <6>[    0.000000] Memory: 476MB = 476MB total
  57. I/cat     (  488): <5>[    0.000000] Memory: 472200k/472200k available, 52088k reserved, 0K highmem
  58. I/cat     (  488): <5>[    0.000000] Virtual kernel memory layout:
  59. I/cat     (  488): <5>[    0.000000]     vector  : 0xffff0000 - 0xffff1000   (   4 kB)
  60. I/cat     (  488): <5>[    0.000000]     fixmap  : 0xfff00000 - 0xfffe0000   ( 896 kB)
  61. I/cat     (  488): <5>[    0.000000]     DMA     : 0xffc00000 - 0xffe00000   (   2 MB)
  62. I/cat     (  488): <5>[    0.000000]     vmalloc : 0xe0800000 - 0xf8000000   ( 376 MB)
  63. I/cat     (  488): <5>[    0.000000]     lowmem  : 0xc0000000 - 0xe0000000   ( 512 MB)
  64. I/cat     (  488): <5>[    0.000000]     pkmap   : 0xbfe00000 - 0xc0000000   (   2 MB)
  65. I/cat     (  488): <5>[    0.000000]     modules : 0xbf000000 - 0xbfe00000   (  14 MB)
  66. I/cat     (  488): <5>[    0.000000]       .init : 0xc0008000 - 0xc0058000   ( 320 kB)
  67. I/cat     (  488): <5>[    0.000000]       .text : 0xc0058000 - 0xc0773000   (7276 kB)
  68. I/cat     (  488): <5>[    0.000000]       .data : 0xc0774000 - 0xc07f6bb0   ( 523 kB)
  69. I/cat     (  488): <5>[    0.000000]        .bss : 0xc07f6bf0 - 0xc0948608   (1351 kB)
  70. I/cat     (  488): <6>[    0.000000] SLUB: Genslabs=13, HWalign=32, Order=0-3, MinObjects=0, CPUs=2, Nodes=1
  71. I/cat     (  488): <6>[    0.000000] Preemptible hierarchical RCU implementation.
  72. I/cat     (  488): <6>[    0.000000] NR_IRQS:410
  73. I/cat     (  488): <4>[    0.000000] omap_hwmod: dpll_mpu_m2_ck: missing clockdomain for dpll_mpu_m2_ck.
  74. I/cat     (  488): <6>[    0.000000] OMAP clockevent source: GPTIMER1 at 32768 Hz
  75. I/cat     (  488): <6>[    0.000000] sched_clock: 32 bits at 32kHz, resolution 30517ns, wraps every 131071999ms
  76. I/cat     (  488): <6>[    0.000061] Calibrating delay loop... 1990.38 BogoMIPS (lpj=7774208)
  77. I/cat     (  488): <6>[    0.070404] pid_max: default: 32768 minimum: 301
  78. I/cat     (  488): <6>[    0.070678] Mount-cache hash table entries: 512
  79. I/cat     (  488): <6>[    0.070678] Initializing cgroup subsys debug
  80. I/cat     (  488): <6>[    0.071411] Initializing cgroup subsys cpuacct
  81. I/cat     (  488): <6>[    0.071411] Initializing cgroup subsys freezer
  82. I/cat     (  488): <6>[    0.071472] CPU: Testing write buffer coherency: ok
  83. I/cat     (  488): <6>[    0.071777] L310 cache controller enabled
  84. I/cat     (  488): <6>[    0.071777] l2x0: 16 ways, CACHE_ID 0x410000c7, AUX_CTRL 0x5e470000, Cache size: 1048576 B
  85. I/cat     (  488): <7>[    0.149932] CPU1: Booted secondary processor
  86. I/cat     (  488): <6>[    0.220245] Brought up 2 CPUs
  87. I/cat     (  488): <6>[    0.220275] SMP: Total of 2 processors activated (3989.17 BogoMIPS).
  88. I/cat     (  488): <6>[    0.220458] devtmpfs: initialized
  89. I/cat     (  488): <4>[    0.222930] omap_hwmod: _populate_mpu_rt_base found no _mpu_rt_va for emif_fw
  90. I/cat     (  488): <4>[    0.222930] omap_hwmod: _populate_mpu_rt_base found no _mpu_rt_va for l3_instr
  91. I/cat     (  488): <4>[    0.222991] omap_hwmod: _populate_mpu_rt_base found no _mpu_rt_va for l3_main_1
  92. I/cat     (  488): <4>[    0.222991] omap_hwmod: _populate_mpu_rt_base found no _mpu_rt_va for l3_main_2
  93. I/cat     (  488): <4>[    0.223022] omap_hwmod: _populate_mpu_rt_base found no _mpu_rt_va for l4_abe
  94. I/cat     (  488): <4>[    0.223022] omap_hwmod: _populate_mpu_rt_base found no _mpu_rt_va for l4_cfg
  95. I/cat     (  488): <4>[    0.223022] omap_hwmod: _populate_mpu_rt_base found no _mpu_rt_va for l4_per
  96. I/cat     (  488): <4>[    0.223052] omap_hwmod: _populate_mpu_rt_base found no _mpu_rt_va for l4_wkup
  97. I/cat     (  488): <4>[    0.223052] omap_hwmod: _populate_mpu_rt_base found no _mpu_rt_va for mpu_private
  98. I/cat     (  488): <4>[    0.223114] omap_hwmod: _populate_mpu_rt_base found no _mpu_rt_va for sl2if
  99. I/cat     (  488): <4>[    0.223144] omap_hwmod: _populate_mpu_rt_base found no _mpu_rt_va for thermal_sensor
  100. I/cat     (  488): <4>[    0.223175] omap_hwmod: _populate_mpu_rt_base found no _mpu_rt_va for usbhs_ohci
  101. I/cat     (  488): <4>[    0.223175] omap_hwmod: _populate_mpu_rt_base found no _mpu_rt_va for usbhs_ehci
  102. I/cat     (  488): <4>[    0.223358] omap_hwmod: l3_div_ck: missing clockdomain for l3_div_ck.
  103. I/cat     (  488): <4>[    0.223358] omap_hwmod: l4_div_ck: missing clockdomain for l4_div_ck.
  104. I/cat     (  488): <3>[    0.228332] _omap4_module_wait_ready: Timeout waiting for module enable (mcpdm_fck: clkctrl = 0x30002)
  105. I/cat     (  488): <4>[    0.231323] omap_hwmod: mcpdm: cannot be enabled (3)
  106. I/cat     (  488): <6>[    0.233978] print_constraints: dummy:
  107. I/cat     (  488): <6>[    0.233978] NET: Registered protocol family 16
  108. I/cat     (  488): <6>[    0.234191] GPMC revision 6.0
  109. I/cat     (  488): <7>[    0.234191] gpmc_mem_init: cannot add 16777216@00000000
  110. I/cat     (  488): <6>[    0.235290] EMIF0 is enabled with IRQ142
  111. I/cat     (  488): <6>[    0.235290] EMIF1 is enabled with IRQ143
  112. I/cat     (  488): <6>[    0.235382] Last reset was warm software reset (PRM_RSTST=0x2)
  113. I/cat     (  488): <6>[    0.235382]
  114. I/cat     (  488): <6>[    0.235748] OMAP GPIO hardware version 0.1
  115. I/cat     (  488): <6>[    0.236572] omap_mux_init: Add partition: #1: core, flags: 2
  116. I/cat     (  488): <6>[    0.238037] omap_mux_init: Add partition: #2: wkup, flags: 2
  117. I/cat     (  488): <7>[    0.239135] archos_accel_init: irq1 205, irq2 334
  118. I/cat     (  488): <7>[    0.239166] archos_compass_init: irq 211
  119. I/cat     (  488): <7>[    0.239807] archos_touchscreen_tm340_init: irq_gpio 272 - irq 112, pwr_gpio 110
  120. I/cat     (  488): <6>[    0.241394] init_ehci_clock_init: auxclk4_ck now at 12000000
  121. I/cat     (  488): <3>[    0.241424] Enabling aux_clk
  122. I/cat     (  488): <3>[    0.242340] omap_dmm_init
  123. I/cat     (  488): <7>[    0.242340] panel_cpt_xga_8_init
  124. I/cat     (  488): <6>[    0.248077] OMAP DMA hardware revision 0.0
  125. I/cat     (  488): <3>[    0.248077] omap_rproc_get_pool: dsp - no carveout memory is available at all
  126. I/cat     (  488): <4>[    0.249481] omap_rproc_get_pool: ipu - carveout memory is unavailable: 0x0, 0x0
  127. I/cat     (  488): <6>[    0.257415] bio: create slab <bio-0> at 0
  128. I/cat     (  488): <6>[    0.257751] print_constraints: 5V: 5000 mV
  129. I/cat     (  488): <6>[    0.257751] print_constraints: 1V8: 1800 mV
  130. I/cat     (  488): <6>[    0.257751] print_constraints: VCC: 3300 mV
  131. I/cat     (  488): <6>[    0.258483] print_constraints: vbus_musb: 5000 mV
  132. I/cat     (  488): <6>[    0.258483] print_constraints: vmmc2: 1800 mV
  133. I/cat     (  488): <6>[    0.259002] print_constraints: vmmc2_aux: 3300 mV
  134. I/cat     (  488): <6>[    0.259002] print_constraints: TSP_VCC: 3300 mV
  135. I/cat     (  488): <6>[    0.259307] print_constraints: vwl1271: 1800 mV
  136. I/cat     (  488): <6>[    0.259307] print_constraints: hdmi_5v: 5000 mV normal
  137. I/cat     (  488): <6>[    0.259521] print_constraints: hsusb_ext: 5000 mV normal
  138. I/cat     (  488): <4>[    0.259521] i2c-core: driver [twl] using legacy suspend method
  139. I/cat     (  488): <4>[    0.259948] i2c-core: driver [twl] using legacy resume method
  140. I/cat     (  488): <5>[    0.260223] SCSI subsystem initialized
  141. I/cat     (  488): <6>[    0.260986] usbcore: registered new interface driver usbfs
  142. I/cat     (  488): <6>[    0.261260] usbcore: registered new interface driver hub
  143. I/cat     (  488): <6>[    0.261352] usbcore: registered new device driver usb
  144. I/cat     (  488): <6>[    0.262084] omap_i2c omap_i2c.1: bus 1 rev4.0 at 400 kHz
  145. I/cat     (  488): <4>[    0.262603] Skipping twl internal clock init and using bootloader value (unknown osc rate)
  146. I/cat     (  488): <6>[    0.262939] twl 1-0048: start condition : 00
  147. I/cat     (  488): <6>[    0.265747] twl6030: PIH (irq 39) chaining IRQs 368..387
  148. I/cat     (  488): <6>[    0.268585] print_constraints: VUSB: 3300 mV normal standby
  149. I/cat     (  488): <3>[    0.271087] archos_twl6030_usb_xceiv archos_twl6030_usb_xceiv: Initialized Archos TWL6030 USB module
  150. I/cat     (  488): <7>[    0.271392] STATE_UNKNOWN -> STATE_NONE
  151. I/cat     (  488): <6>[    0.272186] print_constraints: VMMC: 1200 <--> 3000 mV at 1800 mV normal standby
  152. I/cat     (  488): <6>[    0.273284] print_constraints: VPP: 1800 <--> 2500 mV at 1900 mV normal standby
  153. I/cat     (  488): <6>[    0.274322] print_constraints: VCXIO: 1800 mV normal standby
  154. I/cat     (  488): <6>[    0.275451] print_constraints: VDAC: 1800 mV normal standby
  155. I/cat     (  488): <6>[    0.276153] print_constraints: VAUX2_6030: 2800 mV normal standby
  156. I/cat     (  488): <6>[    0.276916] print_constraints: VAUX3_6030: 1000 <--> 3300 mV at 1200 mV normal standby
  157. I/cat     (  488): <6>[    0.278045] print_constraints: VANA: 2100 mV normal standby
  158. I/cat     (  488): <6>[    0.278656] print_constraints: CLK32KG:
  159. I/cat     (  488): <6>[    0.279602] print_constraints: CLK32KAUDIO:
  160. I/cat     (  488): <6>[    0.279876] omap_i2c omap_i2c.2: bus 2 rev4.0 at 100 kHz
  161. I/cat     (  488): <6>[    0.280120] omap_i2c omap_i2c.3: bus 3 rev4.0 at 100 kHz
  162. I/cat     (  488): <6>[    0.280487] omap_i2c omap_i2c.4: bus 4 rev4.0 at 400 kHz
  163. I/cat     (  488): <6>[    0.280731] omap-rproc omap-rproc.0: dsp is available
  164. I/cat     (  488): <6>[    0.280731] omap-rproc omap-rproc.1: ipu is available
  165. I/cat     (  488): <6>[    0.280731] Advanced Linux Sound Architecture Driver Version 1.0.24.
  166. I/cat     (  488): <6>[    0.281341] Switching to clocksource 32k_counter
  167. I/cat     (  488): <6>[    0.282745] Switched to NOHz mode on CPU #0
  168. I/cat     (  488): <6>[    0.282745] Switched to NOHz mode on CPU #1
  169. I/cat     (  488): <6>[    0.283935] musb-hdrc: version 6.0, musb-dma, otg (peripheral+host)
  170. I/cat     (  488): <7>[    0.284271] musb-hdrc: ConfigData=0xde (UTMI-8, dyn FIFOs, bulk combine, bulk split, HB-ISO Rx, HB-ISO Tx, SoftConn)
  171. I/cat     (  488): <7>[    0.284301] musb-hdrc: MHDRC RTL version 2.0
  172. I/cat     (  488): <7>[    0.284301] musb-hdrc: setup fifo_mode 4
  173. I/cat     (  488): <7>[    0.284332] musb-hdrc: 28/31 max ep, 16384/16384 memory
  174. I/cat     (  488): <6>[    0.284332] musb-hdrc musb-hdrc: USB OTG mode controller at fc0ab000 using DMA, IRQ 124
  175. I/cat     (  488): <6>[    0.284790] NET: Registered protocol family 2
  176. I/cat     (  488): <6>[    0.285186] IP route cache hash table entries: 4096 (order: 2, 16384 bytes)
  177. I/cat     (  488): <6>[    0.285186] TCP established hash table entries: 16384 (order: 5, 131072 bytes)
  178. I/cat     (  488): <6>[    0.286132] TCP bind hash table entries: 16384 (order: 6, 393216 bytes)
  179. I/cat     (  488): <6>[    0.286712] TCP: Hash tables configured (established 16384 bind 16384)
  180. I/cat     (  488): <6>[    0.286712] TCP reno registered
  181. I/cat     (  488): <6>[    0.286743] UDP hash table entries: 256 (order: 2, 16384 bytes)
  182. I/cat     (  488): <6>[    0.286743] UDP-Lite hash table entries: 256 (order: 2, 16384 bytes)
  183. I/cat     (  488): <6>[    0.286804] NET: Registered protocol family 1
  184. I/cat     (  488): <6>[    0.287536] RPC: Registered named UNIX socket transport module.
  185. I/cat     (  488): <6>[    0.287658] RPC: Registered udp transport module.
  186. I/cat     (  488): <6>[    0.287658] RPC: Registered tcp transport module.
  187. I/cat     (  488): <6>[    0.287689] RPC: Registered tcp NFSv4.1 backchannel transport module.
  188. I/cat     (  488): <6>[    0.287689] Trying to unpack rootfs image as initramfs...
  189. I/cat     (  488): <6>[    0.321197] Freeing initrd memory: 1132K
  190. I/cat     (  488): <4>[    0.844818] omap_init_opp_table: no hwmod or odev for hsi, [22] cannot add OPPs.
  191. I/cat     (  488): <4>[    0.844818] omap_init_opp_table: no hwmod or odev for hsi, [23] cannot add OPPs.
  192. I/cat     (  488): <6>[    1.008697] PC detected
  193. I/cat     (  488): <7>[    1.008728] STATE_NONE -> STATE_VBUS
  194. I/cat     (  488): <3>[    1.219665] PHY ON
  195. I/cat     (  488): <7>[    1.243774] panel_init:93
  196. I/cat     (  488): <6>[    1.245361] archos_camera_glue archos_camera_glue: no cam_1v8 rail, skip.
  197. I/cat     (  488): <3>[    1.297882] archos_usb_3g archos_usb_3g: Unable to get "3g_hub" regulator
  198. I/cat     (  488): <6>[    1.299163] ram_console: got buffer at a0000000, size 200000
  199. I/cat     (  488): <6>[    1.299163] ram_console: no valid data in buffer (sig = 0x00000000)
  200. I/cat     (  488): <6>[    1.299163] console [ram0] enabled
  201. I/cat     (  488): <6>[    1.302764] omap-iommu omap-iommu.0: ducati registered
  202. I/cat     (  488): <6>[    1.302764] omap-iommu omap-iommu.1: tesla registered
  203. I/cat     (  488): <6>[    1.307861] ashmem: initialized
  204. I/cat     (  488): <6>[    1.313415] squashfs: version 4.0 (2009/01/31) Phillip Lougher
  205. I/batteryd(  481): Measuring battery level on A80S...
  206. I/cat     (  488): <6>[    1.316131] NTFS driver 2.1.30 [Flags: R/O].
  207. I/cat     (  488): <6>[    1.316131] fuse init (API version 7.16)
  208. I/cat     (  488): <6>[    1.316131] msgmni has been set to 924
  209. I/cat     (  488): <6>[    1.318572] io scheduler noop registered
  210. I/cat     (  488): <6>[    1.318603] io scheduler deadline registered
  211. I/cat     (  488): <6>[    1.318725] io scheduler cfq registered (default)
  212. I/cat     (  488): <6>[    1.318725] start plist test
  213. I/cat     (  488): <6>[    1.323669] end plist test
  214. I/cat     (  488): <6>[    1.326263] OMAP DSS rev 4.0
  215. I/cat     (  488): <3>[    1.328582] Keyboard driver not present
  216. I/cat     (  488): <6>[    1.329010] dsscomp: initializing.
  217. I/cat     (  488): <7>[    1.329284] misc dsscomp: display0=generic_dpi_panel
  218. I/cat     (  488): <7>[    1.329284] misc dsscomp: display1=hdmi_panel
  219. I/cat     (  488): <6>[    1.329284] misc dsscomp: found 2 displays and 4 overlays, WB overlay 1
  220. I/cat     (  488): <3>[    1.329284] tiler1d_slot_size: Returning pdata->tiler1d_slotsz: 28311552
  221. I/cat     (  488): <3>[    1.329406] dsscomp_queue_init:
  222. I/cat     (  488): <3>[    1.329772] tiler1d_slot_size: Returning pdata->tiler1d_slotsz: 28311552
  223. I/cat     (  488): <3>[    1.329803] tiler_alloc_block_area: Tiler FMT: 3, Width: 28311552, Height: 1
  224. I/cat     (  488): <3>[    1.329803] tiler_alloc_block_area: tiler_alloc_block_area: Tilerdev class is not yet initialized...
  225. I/cat     (  488): <3>[    1.329895] could not allocate slot
  226. I/cat     (  488): <6>[    1.330047] omap-rproc omap-rproc.1: powering up ipu
  227. I/cat     (  488): <6>[    1.330627] virtio_rpmsg_bus virtio0: rpmsg backend virtproc probed successfully
  228. I/cat     (  488): <6>[    1.330627] virtio_rpmsg_bus virtio1: rpmsg backend virtproc probed successfully
  229. I/cat     (  488): <6>[    1.331756] omap_uart.0: ttyO0 at MMIO 0x4806a000 (irq = 104) is a OMAP UART0
  230. I/cat     (  488): <6>[    1.332122] omap_uart.1: ttyO1 at MMIO 0x4806c000 (irq = 105) is a OMAP UART1
  231. I/cat     (  488): <6>[    1.332397] omap_uart.2: ttyO2 at MMIO 0x48020000 (irq = 106) is a OMAP UART2
  232. I/cat     (  488): <6>[    1.332977] omap_ion_probe: adding heap secure_input of type 2 with 9fd00000@0
  233. I/cat     (  488): <6>[    1.332977] omap_ion_probe: adding heap secure_output_wfdhdcp of type 2 with 9fd00000@0
  234. I/cat     (  488): <6>[    1.332977] omap_ion_probe: adding heap tiler of type 4 with 9e680000@80000
  235. I/cat     (  488): <6>[    1.333068] omap_ion_probe: adding heap nonsecure_tiler of type 4 with 9e600000@80000
  236. I/cat     (  488): <6>[    1.333160] omap_ion_probe: adding heap system of type 0 with 0@0
  237. I/cat     (  488): <6>[    1.333160] omap_ion_probe: adding heap tiler_reservation of type 5 with 0@0
  238. I/cat     (  488): <6>[    1.339477] brd: module loaded
  239. I/cat     (  488): <6>[    1.339477] loop: module loaded
  240. I/cat     (  488): <3>[    1.339477] (stk) :kim Driver for TI WiLink
  241. I/cat     (  488): <3>[    1.342803] (stk) :>>kim_probe
  242. I/cat     (  488): <3>[    1.342834] (stk) :...platform's sure about existence of 1 device
  243. I/cat     (  488): <6>[    1.342834] (stk) :sysfs entries created
  244. I/cat     (  488): <3>[    1.342987] (stk) : debugfs entries created
  245. I/cat     (  488): <6>[    1.351013] PPP generic driver version 2.4.2
  246. I/cat     (  488): <6>[    1.351013] PPP Deflate Compression module registered
  247. I/cat     (  488): <6>[    1.351898] PPP BSD Compression module registered
  248. I/cat     (  488): <6>[    1.352600] PPP MPPE Compression module registered
  249. I/cat     (  488): <6>[    1.352630] NET: Registered protocol family 24
  250. I/cat     (  488): <6>[    1.352630] tun: Universal TUN/TAP device driver, 1.6
  251. I/cat     (  488): <6>[    1.354187] tun: (C) 1999-2004 Max Krasnyansky <maxk@qualcomm.com>
  252. I/cat     (  488): <6>[    1.354370] rtl8150: v0.6.2 (2004/08/27):rtl8150 based usb-ethernet driver
  253. I/cat     (  488): <6>[    1.354370] usbcore: registered new interface driver rtl8150
  254. I/cat     (  488): <6>[    1.354370] usbcore: registered new interface driver asix
  255. I/cat     (  488): <6>[    1.354553] usbcore: registered new interface driver cdc_ether
  256. I/cat     (  488): <6>[    1.354553] usbcore: registered new interface driver dm9601
  257. I/cat     (  488): <6>[    1.354766] usbcore: registered new interface driver smsc75xx
  258. I/cat     (  488): <6>[    1.354766] usbcore: registered new interface driver smsc95xx
  259. I/cat     (  488): <6>[    1.354766] usbcore: registered new interface driver net1080
  260. I/cat     (  488): <6>[    1.354919] usbcore: registered new interface driver cdc_subset
  261. I/cat     (  488): <6>[    1.354919] usbcore: registered new interface driver zaurus
  262. I/cat     (  488): <6>[    1.354919] usbcore: registered new interface driver MOSCHIP usb-ethernet driver
  263. I/cat     (  488): <6>[    1.355194] usbcore: registered new interface driver int51x1
  264. I/cat     (  488): <6>[    1.355194] usbcore: registered new interface driver zd1201
  265. I/cat     (  488): <6>[    1.355194] ehci_hcd: USB 2.0 'Enhanced' Host Controller (EHCI) Driver
  266. I/cat     (  488): <3>[    1.355499] Failed: change interconnect bandwidth to 166000000
  267. I/cat     (  488): <6>[    1.355499] ehci-omap ehci-omap.0: OMAP-EHCI Host Controller
  268. I/cat     (  488): <6>[    1.355651] ehci-omap ehci-omap.0: new USB bus registered, assigned bus number 1
  269. I/cat     (  488): <6>[    1.355804] ehci-omap ehci-omap.0: irq 109, io mem 0x4a064c00
  270. I/cat     (  488): <6>[    1.368072] ehci-omap ehci-omap.0: USB 2.0 started, EHCI 1.00
  271. I/cat     (  488): <6>[    1.368164] usb usb1: New USB device found, idVendor=1d6b, idProduct=0002
  272. I/cat     (  488): <6>[    1.368164] usb usb1: New USB device strings: Mfr=3, Product=2, SerialNumber=1
  273. I/cat     (  488): <6>[    1.368164] usb usb1: Product: OMAP-EHCI Host Controller
  274. I/cat     (  488): <6>[    1.368255] usb usb1: Manufacturer: Linux 3.0.21+ ehci_hcd
  275. I/cat     (  488): <6>[    1.368286] usb usb1: SerialNumber: ehci-omap.0
  276. I/cat     (  488): <6>[    1.368865] hub 1-0:1.0: USB hub found
  277. I/cat     (  488): <6>[    1.368865] hub 1-0:1.0: 3 ports detected
  278. I/cat     (  488): <6>[    1.407135] usbcore: registered new interface driver cdc_acm
  279. I/cat     (  488): <6>[    1.407135] cdc_acm: USB Abstract Control Model driver for USB modems and ISDN adapters
  280. I/cat     (  488): <6>[    1.407135] Initializing USB Mass Storage driver...
  281. I/cat     (  488): <6>[    1.407135] usbcore: registered new interface driver usb-storage
  282. I/cat     (  488): <6>[    1.407440] USB Mass Storage support registered.
  283. I/cat     (  488): <6>[    1.407440] usbcore: registered new interface driver libusual
  284. I/cat     (  488): <3>[    1.407684] jm20329_platform_init: no device configuration for system_rev 5
  285. I/cat     (  488): <6>[    1.407684] usbcore: registered new interface driver usbserial
  286. I/cat     (  488): <6>[    1.407897] usbserial: USB Serial Driver core
  287. I/cat     (  488): <6>[    1.409393] android_usb gadget: Mass Storage Function, version: 2009/09/11
  288. I/cat     (  488): <6>[    1.409393] android_usb gadget: Number of LUNs=1
  289. I/cat     (  488): <6>[    1.409393]  lun0: LUN: removable file: (no medium)
  290. I/cat     (  488): <6>[    1.409515] android_usb gadget: android_usb ready
  291. I/cat     (  488): <6>[    1.409759] musb-hdrc musb-hdrc: MUSB HDRC host driver
  292. I/cat     (  488): <6>[    1.409820] musb-hdrc musb-hdrc: new USB bus registered, assigned bus number 2
  293. I/cat     (  488): <6>[    1.409912] usb usb2: New USB device found, idVendor=1d6b, idProduct=0002
  294. I/cat     (  488): <6>[    1.409942] usb usb2: New USB device strings: Mfr=3, Product=2, SerialNumber=1
  295. I/cat     (  488): <6>[    1.409942] usb usb2: Product: MUSB HDRC host driver
  296. I/cat     (  488): <6>[    1.410003] usb usb2: Manufacturer: Linux 3.0.21+ musb-hcd
  297. I/cat     (  488): <6>[    1.410034] usb usb2: SerialNumber: musb-hdrc
  298. I/cat     (  488): <6>[    1.410034] hub 2-0:1.0: USB hub found
  299. I/cat     (  488): <6>[    1.410034] hub 2-0:1.0: 1 port detected
  300. I/cat     (  488): <6>[    1.411193] mousedev: PS/2 mouse device common for all mice
  301. I/cat     (  488): <6>[    1.411529] input: gpio-keys as /devices/platform/gpio-keys/input/input0
  302. I/cat     (  488): <6>[    1.411529] usbcore: registered new interface driver xpad
  303. I/cat     (  488): <6>[    1.412597] twl6030_pwrbutton_probe: Enter
  304. I/cat     (  488): <6>[    1.413299] input: twl6030_pwrbutton as /devices/platform/omap/omap_i2c.1/i2c-1/1-0049/twl6030_pwrbutton/input/input1
  305. I/cat     (  488): <6>[    1.415435] Found MMA8453Q accelerometer with ID 0x3A
  306. I/cat     (  488): <6>[    1.420928] input: MMA8453Q Accelerometer as /devices/virtual/input/input2
  307. I/cat     (  488): <4>[    1.420928] i2c-core: driver [mma8453q] using legacy suspend method
  308. I/cat     (  488): <4>[    1.420928] i2c-core: driver [mma8453q] using legacy resume method
  309. I/cat     (  488): <7>[    1.421142] MMA8453Q driver version 0.1 (1 April 2011)
  310. I/cat     (  488): <6>[    1.421142] AKM8975 compass driver: initialize
  311. I/cat     (  488): <6>[    1.421813] input: compass as /devices/virtual/input/input3
  312. I/cat     (  488): <4>[    1.422058] i2c-core: driver [akm8975] using legacy suspend method
  313. I/cat     (  488): <4>[    1.422058] i2c-core: driver [akm8975] using legacy resume method
  314. I/cat     (  488): <6>[    1.425781] using rtc device, twl_rtc, for alarms
  315. I/cat     (  488): <6>[    1.426147] twl_rtc twl_rtc: rtc core: registered twl_rtc as rtc0
  316. I/cat     (  488): <6>[    1.426330] i2c /dev entries driver
  317. I/cat     (  488): <6>[    1.426330] lirc_dev: IR Remote Control driver registered, major 250
  318. I/cat     (  488): <6>[    1.426330] IR NEC protocol handler initialized
  319. I/cat     (  488): <6>[    1.427093] IR RC5(x) protocol handler initialized
  320. I/cat     (  488): <6>[    1.427124] IR RC6 protocol handler initialized
  321. I/cat     (  488): <6>[    1.427124] IR JVC protocol handler initialized
  322. I/cat     (  488): <6>[    1.427124] IR Sony protocol handler initialized
  323. I/cat     (  488): <6>[    1.427185] IR RC5 (streamzap) protocol handler initialized
  324. I/cat     (  488): <6>[    1.427185] IR LIRC bridge handler initialized
  325. I/cat     (  488): <6>[    1.427246] Linux video capture interface: v2.00
  326. I/cat     (  488): <6>[    1.427246] dmm: probe base: fd300000, irq 145
  327. I/cat     (  488): <3>[    1.427429] tiler_init
  328. I/cat     (  488): <7>[    1.427429] Backtrace:
  329. I/cat     (  488): <7>[    1.427429] [<c0062574>] (dump_backtrace+0x0/0x10c) from [<c0560400>] (dump_stack+0x18/0x1c)
  330. I/cat     (  488): <7>[    1.427429]  r6:c00aa8e0 r5:c003fdd0 r4:c083c8f0 r3:00000000
  331. I/cat     (  488): <7>[    1.427429] [<c05603e8>] (dump_stack+0x0/0x1c) from [<c0032678>] (tiler_init+0x28/0x52c)
  332. I/cat     (  488): <7>[    1.427429] [<c0032650>] (tiler_init+0x0/0x52c) from [<c0058670>] (do_one_initcall+0x9c/0x16c)
  333. I/cat     (  488): <7>[    1.427856] [<c00585d4>] (do_one_initcall+0x0/0x16c) from [<c00089d4>] (kernel_init+0x90/0x130)
  334. I/cat     (  488): <7>[    1.427856] [<c0008944>] (kernel_init+0x0/0x130) from [<c00aa8e0>] (do_exit+0x0/0x65c)
  335. I/cat     (  488): <7>[    1.427856]  r5:c0008944 r4:00000000
  336. I/cat     (  488): <3>[    1.427856] class_create(): points to: dcd27440
  337. I/cat     (  488): <7>[    1.427856] omap_imt_init
  338. I/cat     (  488): <6>[    1.645324] twl6030_bci twl6030_bci: Battery Voltage at Bootup is 4028 mV
  339. I/cat     (  488): <6>[    1.653869] OMAP Watchdog Timer Rev 0x01: initial timeout 60 sec
  340. I/cat     (  488): <6>[    1.653930] device-mapper: uevent: version 1.0.3
  341. I/cat     (  488): <6>[    1.653930] device-mapper: ioctl: 4.20.0-ioctl (2011-02-02) initialised: dm-devel@redhat.com
  342. I/cat     (  488): <6>[    1.655120] cpuidle: using governor ladder
  343. I/cat     (  488): <6>[    1.655151] cpuidle: using governor menu
  344. I/cat     (  488): <7>[    1.661285] Registered led device: power
  345. I/cat     (  488): <6>[    1.661773] omap_pwm_led omap_pwm_led.0: OMAP PWM LED (lcd-backlight) at GP timer 8/0
  346. I/cat     (  488): <7>[    1.661773] Registered led device: lcd-backlight
  347. I/cat     (  488): <6>[    1.664031] usbcore: registered new interface driver usbhid
  348. I/cat     (  488): <6>[    1.664031] usbhid: USB HID core driver
  349. I/cat     (  488): <6>[    1.666229] logger: created 256K log 'log_main'
  350. I/cat     (  488): <6>[    1.666229] logger: created 256K log 'log_events'
  351. I/cat     (  488): <6>[    1.666229] logger: created 256K log 'log_radio'
  352. I/cat     (  488): <6>[    1.666534] logger: created 256K log 'log_system'
  353. I/cat     (  488): <3>[    1.667144] thermal_sensor_set_temp: no cooling agents for domain cpu
  354. I/cat     (  488): <3>[    1.667144] omap_report_temp:thermal_sensor_set_temp reports error
  355. I/cat     (  488): <3>[    1.669403] thermal_sensor_set_temp: no cooling agents for domain cpu
  356. I/cat     (  488): <3>[    1.669555] thermal_sensor_set_temp: no cooling agents for domain cpu
  357. I/cat     (  488): <6>[    1.669616] omap_temp_sensor omap_temp_sensor.0: omap_ondie_sensor : 'omap_temp_sensor'
  358. I/cat     (  488): <6>[    1.669616] pcb_temp_sensor pcb_temp_sensor.0: pcb_sensor : 'pcb_temp_sensor'
  359. I/cat     (  488): <6>[    1.669616] usbcore: registered new interface driver snd-usb-audio
  360. I/cat     (  488): <6>[    1.674255] archos_omap4_soc_probe: Archos Device SoC init
  361. I/cat     (  488): <4>[    1.679443] twl6040-codec twl6040-codec: couldn't get VDDHF regulator -19
  362. I/cat     (  488): <6>[    1.706695] asoc: null-codec-dai <-> MultiMedia1 mapping ok
  363. I/cat     (  488): <6>[    1.708160] asoc: null-codec-dai <-> MultiMedia2 mapping ok
  364. I/cat     (  488): <6>[    1.709106] asoc: null-codec-dai <-> Voice mapping ok
  365. I/cat     (  488): <6>[    1.711273] asoc: null-codec-dai <-> Tones mapping ok
  366. I/cat     (  488): <6>[    1.711853] asoc: null-codec-dai <-> Vibra mapping ok
  367. I/cat     (  488): <6>[    1.713043] asoc: null-codec-dai <-> MODEM mapping ok
  368. I/cat     (  488): <6>[    1.713562] asoc: null-codec-dai <-> MultiMedia1 LP mapping ok
  369. I/cat     (  488): <6>[    1.714172] asoc: FM Digital <-> omap-mcbsp-dai.1 mapping ok
  370. I/cat     (  488): <6>[    1.716339] asoc: twl6040-dl1 <-> mcpdm-dl mapping ok
  371. I/cat     (  488): <6>[    1.718048] asoc: dmic-hifi <-> omap-dmic-dai-0 mapping ok
  372. I/cat     (  488): <4>[    1.719635] twl6040-codec twl6040-codec: ASoC: Failed to create Aux/FM Stereo In debugfs file
  373. I/cat     (  488): <6>[    1.720428] asoc: twl6040-dl1 <-> mcpdm-dl1 mapping ok
  374. I/cat     (  488): <6>[    1.721099] asoc: twl6040-ul <-> mcpdm-ul1 mapping ok
  375. I/cat     (  488): <6>[    1.721832] asoc: twl6040-dl2 <-> mcpdm-dl2 mapping ok
  376. I/cat     (  488): <6>[    1.722534] asoc: twl6040-vib <-> mcpdm-vib mapping ok
  377. I/cat     (  488): <6>[    1.723205] asoc: Bluetooth <-> omap-mcbsp-dai.0 mapping ok
  378. I/cat     (  488): <6>[    1.723999] asoc: Bluetooth <-> omap-mcbsp-dai.0 mapping ok
  379. I/cat     (  488): <6>[    1.724670] asoc: FM Digital <-> omap-mcbsp-dai.1 mapping ok
  380. I/cat     (  488): <6>[    1.725463] asoc: MODEM <-> omap-mcbsp-dai.1 mapping ok
  381. I/cat     (  488): <6>[    1.726287] asoc: dmic-hifi <-> omap-dmic-abe-dai-0 mapping ok
  382. I/cat     (  488): <6>[    1.726989] asoc: dmic-hifi <-> omap-dmic-abe-dai-1 mapping ok
  383. I/cat     (  488): <6>[    1.727783] asoc: dmic-hifi <-> omap-dmic-abe-dai-2 mapping ok
  384. I/cat     (  488): <6>[    1.729949] input: ARCHOS-TWL6040 Headset Jack as /devices/platform/soc-audio/sound/card0/input4
  385. I/cat     (  488): <6>[    1.732940] asoc: hdmi-audio-codec <-> hdmi-audio-dai mapping ok
  386. I/cat     (  488): <6>[    1.732940] ALSA device list:
  387. I/cat     (  488): <6>[    1.733367]   #0: Archos Board (TWL6040)
  388. I/cat     (  488): <6>[    1.733367]   #1: OMAP4HDMI
  389. I/cat     (  488): <6>[    1.733551] GACT probability NOT on
  390. I/cat     (  488): <6>[    1.733551] Mirror/redirect action on
  391. I/cat     (  488): <6>[    1.733551] u32 classifier
  392. I/cat     (  488): <6>[    1.733551]     Actions configured
  393. I/cat     (  488): <6>[    1.733551] Netfilter messages via NETLINK v0.30.
  394. I/cat     (  488): <6>[    1.733734] nf_conntrack version 0.5.0 (7395 buckets, 29580 max)
  395. I/cat     (  488): <6>[    1.733734] ctnetlink v0.93: registering with nfnetlink.
  396. I/cat     (  488): <6>[    1.734649] NF_TPROXY: Transparent proxy support initialized, version 4.1.0
  397. I/cat     (  488): <6>[    1.734741] NF_TPROXY: Copyright (c) 2006-2007 BalaBit IT Ltd.
  398. I/cat     (  488): <6>[    1.734741] xt_time: kernel timezone is -0000
  399. I/cat     (  488): <6>[    1.736267] ip_tables: (C) 2000-2006 Netfilter Core Team
  400. I/cat     (  488): <6>[    1.737182] arp_tables: (C) 2002 David S. Miller
  401. I/cat     (  488): <6>[    1.737274] TCP cubic registered
  402. I/cat     (  488): <6>[    1.737274] NET: Registered protocol family 10
  403. I/cat     (  488): <6>[    1.741638] Mobile IPv6
  404. I/cat     (  488): <6>[    1.741638] ip6_tables: (C) 2000-2006 Netfilter Core Team
  405. I/cat     (  488): <6>[    1.743072] IPv6 over IPv4 tunneling driver
  406. I/cat     (  488): <6>[    1.747833] NET: Registered protocol family 17
  407. I/cat     (  488): <6>[    1.747833] NET: Registered protocol family 15
  408. I/cat     (  488): <6>[    1.747833] NET: Registered protocol family 35
  409. I/cat     (  488): <6>[    1.748168] VFP support v0.3: implementor 41 architecture 3 part 30 variant 9 rev 4
  410. I/cat     (  488): <6>[    1.748168] ThumbEE CPU extension supported.
  411. I/cat     (  488): <5>[    1.748168] Registering SWP/SWPB emulation handler
  412. I/cat     (  488): <6>[    1.751159] mmc0: new high speed MMC card at address 0001
  413. I/cat     (  488): <6>[    1.751556] mmcblk0: mmc0:0001 MMC08G 6.94 GiB
  414. I/cat     (  488): <6>[    1.751708] mmcblk0boot0: mmc0:0001 MMC08G partition 1 128 KiB
  415. I/cat     (  488): <6>[    1.751861] mmcblk0boot1: mmc0:0001 MMC08G partition 2 128 KiB
  416. I/cat     (  488): <6>[    1.753387]  mmcblk0: p1 p2 p3 p4
  417. I/cat     (  488): <6>[    1.754089] Reprogramming LPDDR2 timings to 400000000 Hz
  418. I/cat     (  488): <4>[    1.754791] sr_init: No PMIC hook to init smartreflex
  419. I/cat     (  488): <6>[    1.754882] smartreflex smartreflex.0: omap_sr_probe: SmartReflex driver initialized
  420. I/cat     (  488): <6>[    1.755096] smartreflex smartreflex.1: omap_sr_probe: SmartReflex driver initialized
  421. I/cat     (  488): <6>[    1.755187] smartreflex smartreflex.2: omap_sr_probe: SmartReflex driver initialized
  422. I/cat     (  488): <6>[    1.755493] SmartReflex class 1.5 driver: initialized (86400000ms)
  423. I/cat     (  488): <6>[    1.755981]  mmcblk0boot1: unknown partition table
  424. I/cat     (  488): <6>[    1.757690]  mmcblk0boot0: unknown partition table
  425. I/cat     (  488): <6>[    1.769012] omap_cpu_thermal_manager:sensor 31400 avg sensor 0 pcb
  426. I/cat     (  488): <6>[    1.769012] 0, delta 1626 hot spot 33026
  427. I/cat     (  488): <6>[    1.769012] omap_cpu_thermal_manager: hot spot temp 33026 - going into safe zone
  428. I/cat     (  488): <6>[    1.782348] sr_class1p5_calib_work: mpu: Calibration complete: Voltage Nominal=1380000Calib=1240000 margin=0
  429. I/cat     (  488): <6>[    1.782562] sr_class1p5_calib_work: core: Calibration complete: Voltage Nominal=1127000Calib=1063480 margin=13000
  430. I/cat     (  488): <3>[    1.813903] Power Management for TI OMAP4.
  431. I/cat     (  488): <6>[    1.814056] OMAP4 PM: Static dependency added between MPUSS and DUCATI <-> L4_PER/CFG and L3_1.
  432. I/cat     (  488): <7>[    1.814697] android_reboot_reason:normal
  433. I/cat     (  488): <7>[    1.814697]    offset:a0c size:15
  434. I/cat     (  488): <6>[    1.819152] clock: disabling unused clocks to save power
  435. I/cat     (  488): <4>[    1.899505] sr_class1p5_calib_work: iva Stop sampling: Voltage Nominal=950000 samples=11
  436. I/cat     (  488): <6>[    1.899749] sr_class1p5_calib_work: iva: Calibration complete: Voltage Nominal=950000Calib=860920 margin=13000
  437. I/cat     (  488): <4>[    1.930755] sr_class1p5_calib_work: core Stop sampling: Voltage Nominal=962000 samples=11
  438. I/cat     (  488): <6>[    1.931060] sr_class1p5_calib_work: core: Calibration complete: Voltage Nominal=962000Calib=886240 margin=38000
  439. I/cat     (  488): <4>[    1.931213] sr_class1p5_calib_work: mpu Stop sampling: Voltage Nominal=1025000 samples=12
  440. I/cat     (  488): <6>[    1.931457] sr_class1p5_calib_work: mpu: Calibration complete: Voltage Nominal=1025000Calib=840000 margin=10000
  441. I/cat     (  488): <7>[    1.971710] omapfb_calc_addr:892
  442. I/cat     (  488): <7>[    1.971771] data_start_v=0xe2000000
  443. I/cat     (  488): <7>[    1.971832] rotation_type=0
  444. I/cat     (  488): <6>[    1.972106] cannot apply mgr(lcd) on inactive device
  445. I/cat     (  488): <4>[    1.972381] omapfb omapfb: failed to apply dispc config
  446. I/cat     (  488): <6>[    1.972564] cannot apply mgr(tv) on inactive device
  447. I/cat     (  488): <4>[    1.972778] omapfb omapfb: failed to apply dispc config
  448. I/cat     (  488): <6>[    1.972961] cannot apply mgr(lcd2) on inactive device
  449. I/cat     (  488): <4>[    1.973144] omapfb omapfb: failed to apply dispc config
  450. I/cat     (  488): <7>[    1.978149] panel_enable [xga8]
  451. I/cat     (  488): <7>[    2.110748] omapfb_calc_addr:892
  452. I/cat     (  488): <7>[    2.110809] data_start_v=0xe2000000
  453. I/cat     (  488): <7>[    2.110870] rotation_type=0
  454. I/cat     (  488): <4>[    2.113494] mmc1: host does not support reading read-only switch. assuming write-enable.
  455. I/cat     (  488): <6>[    2.114624] twl_rtc twl_rtc: setting system clock to 2013-04-13 21:52:31 UTC (1365889951)
  456. I/cat     (  488): <6>[    2.115600] mmc1: new high speed SDHC card at address b368
  457. I/cat     (  488): <4>[    2.116302] Warning: unable to open an initial console.
  458. I/cat     (  488): <6>[    2.116485] mmcblk1: mmc1:b368 SDU16 14.9 GiB
  459. I/cat     (  488): <6>[    2.117645] Freeing init memory: 320K
  460. I/cat     (  488): <6>[    2.118347]  mmcblk1: p1
  461. I/cat     (  488): <3>[    2.165740] android_usb: already disabled
  462. I/cat     (  488): <6>[    2.167388] charge_level set to 2
  463. I/cat     (  488): <4>[    2.233489] mmc2: card claims to support voltages below the defined range. These will be ignored.
  464. I/cat     (  488): <4>[    2.246673] mmc2: queuing unknown CIS tuple 0x91 (3 bytes)
  465. I/cat     (  488): <6>[    2.248291] mmc2: new SDIO card at address 0001
  466. I/cat     (  488): <6>[    2.456451] android_work: sent uevent USB_STATE=CONNECTED
  467. I/cat     (  488): <6>[    2.461090] android_work: sent uevent USB_STATE=DISCONNECTED
  468. I/cat     (  488): <6>[    2.769134] EXT4-fs (mmcblk0p2): recovery complete
  469. I/cat     (  488): <6>[    2.773651] EXT4-fs (mmcblk0p2): mounted filesystem with ordered data mode. Opts: (null)
  470. I/cat     (  488): <6>[    2.928375] EXT4-fs (mmcblk0p4): mounted filesystem with ordered data mode. Opts: (null)
  471. I/cat     (  488): <3>[    2.944305] android_usb: already disabled
  472. I/cat     (  488): <6>[    7.754974] EXT4-fs (loop0): mounted filesystem with ordered data mode. Opts: (null)
  473. I/cat     (  488): <3>[    8.028259] init: init.archos_init.rc: 270: invalid option 'chmod'
  474. I/cat     (  488): <4>[    8.032806] init (1): /proc/1/oom_adj is deprecated, please use /proc/1/oom_score_adj instead.
  475. I/cat     (  488): <3>[    8.037353] init: No dynamic_args: Try to execve('/sbin/ueventd'): args: 8
  476. I/cat     (  488): <6>[    8.211395] init: command 'loglevel' r=0
  477. I/cat     (  488): <6>[    8.211425] init: Try to execute command 'sysclktz' with params '0'.
  478. I/cat     (  488): <6>[    8.211486] init: command 'sysclktz' r=0
  479. I/cat     (  488): <6>[    8.211517] init: Try to execute command 'export' with params 'PATH' '/system/sbin:/system/bin:/system/xbin:/bin:/sbin:/usr/bin:/vendor/bin:/usr/sbin'.
  480. I/cat     (  488): <6>[    8.211547] init: command 'export' r=0
  481. I/cat     (  488): <6>[    8.211578] init: Try to execute command 'export' with params 'LD_LIBRARY_PATH' '/vendor/lib:/system/lib'.
  482. I/cat     (  488): <6>[    8.211608] init: command 'export' r=0
  483. I/cat     (  488): <6>[    8.211639] init: Try to execute command 'export' with params 'ANDROID_BOOTLOGO' '1'.
  484. I/cat     (  488): <6>[    8.211669] init: command 'export' r=0
  485. I/cat     (  488): <6>[    8.211700] init: Try to execute command 'export' with params 'ANDROID_CACHE' '/cache'.
  486. I/cat     (  488): <6>[    8.211730] init: command 'export' r=0
  487. I/cat     (  488): <6>[    8.211761] init: Try to execute command 'export' with params 'ANDROID_ROOT' '/system'.
  488. I/cat     (  488): <6>[    8.211791] init: command 'export' r=0
  489. I/cat     (  488): <6>[    8.211853] init: Try to execute command 'export' with params 'ANDROID_ASSETS' '/system/app'.
  490. I/cat     (  488): <6>[    8.211883] init: command 'export' r=0
  491. I/cat     (  488): <6>[    8.211914] init: Try to execute command 'export' with params 'ANDROID_DATA' '/data'.
  492. I/cat     (  488): <6>[    8.211944] init: command 'export' r=0
  493. I/cat     (  488): <6>[    8.211975] init: Try to execute command 'export' with params 'ASEC_MOUNTPOINT' '/mnt/asec'.
  494. I/cat     (  488): <6>[    8.212005] init: command 'export' r=0
  495. I/cat     (  488): <6>[    8.212036] init: Try to execute command 'export' with params 'LOOP_MOUNTPOINT' '/mnt/obb'.
  496. I/cat     (  488): <6>[    8.212066] init: command 'export' r=0
  497. I/cat     (  488): <6>[    8.212097] init: Try to execute command 'export' with params 'ANDROID_ROOT' '/system'.
  498. I/cat     (  488): <6>[    8.212127] init: command 'export' r=0
  499. I/cat     (  488): <6>[    8.212158] init: Try to execute command 'export' with params 'ANDROID_STORAGE' '/storage'.
  500. I/cat     (  488): <6>[    8.212188] init: command 'export' r=0
  501. I/cat     (  488): <6>[    8.212219] init: Try to execute command 'export' with params 'BOOTCLASSPATH' '/system/framework/core.jar:/system/framework/core-junit.jar:/system/framework/bouncycastle.jar:/system/framework/ext.jar:/system/framework/framework.jar:/system/framework/telephony-common.jar:/system/framework/mms-common.jar:/system/framework/android.policy.jar:/system/framework/services.jar:/system/framework/apache-xml.jar'.
  502. I/cat     (  488): <6>[    8.212738] init: command 'export' r=0
  503. I/cat     (  488): <6>[    8.212799] init: Try to execute command 'export' with params 'BT_FW_PATH' '/lib/firmware'.
  504. I/cat     (  488): <6>[    8.212829] init: command 'export' r=0
  505. I/cat     (  488): <6>[    8.213012] init: command 'mount' r=0
  506. I/cat     (  488): <6>[    8.213134] init: command 'mount' r=0
  507. I/cat     (  488): <6>[    8.213165] init: Try to execute command 'mount' with params 'debugfs' '/sys/kernel/debug' '/sys/kernel/debug'.
  508. I/cat     (  488): <6>[    8.213226] init: command 'mount' r=0
  509. I/cat     (  488): <6>[    8.213348] init: command 'mkdir' r=0
  510. I/cat     (  488): <6>[    8.213409] init: command 'mkdir' r=0
  511. I/cat     (  488): <6>[    8.213500] init: command 'mkdir' r=0
  512. I/cat     (  488): <6>[    8.213592] init: command 'mount' r=0
  513. I/cat     (  488): <6>[    8.213653] init: command 'mkdir' r=0
  514. I/cat     (  488): <6>[    8.213714] init: command 'mkdir' r=0
  515. I/cat     (  488): <6>[    8.213775] init: command 'mkdir' r=0
  516. I/cat     (  488): <6>[    8.213897] init: command 'mount' r=0
  517. I/cat     (  488): <6>[    8.213958] init: command 'mkdir' r=0
  518. I/cat     (  488): <6>[    8.214080] init: command 'mount' r=0
  519. I/cat     (  488): <6>[    8.214111] init: Try to execute command 'mkdir' with params '/mnt/system'.
  520. I/cat     (  488): <6>[    8.214172] init: command 'mkdir' r=0
  521. I/cat     (  488): <6>[    8.214263] init: command 'mkdir' r=0
  522. I/cat     (  488): <6>[    8.214324] init: command 'mkdir' r=0
  523. I/cat     (  488): <6>[    8.214355] init: Try to execute command 'write' with params '/proc/sys/kernel/panic_on_oops' '1'.
  524. I/cat     (  488): <6>[    8.214447] init: command 'write' r=0
  525. I/cat     (  488): <6>[    8.214477] init: Try to execute command 'write' with params '/proc/sys/kernel/hung_task_timeout_secs' '0'.
  526. I/cat     (  488): <6>[    8.214538] init: command 'write' r=0
  527. I/cat     (  488): <6>[    8.214599] init: Try to execute command 'write' with params '/proc/cpu/alignment' '4'.
  528. I/cat     (  488): <6>[    8.215484] init: command 'write' r=0
  529. I/cat     (  488): <6>[    8.215545] init: Try to execute command 'write' with params '/proc/sys/kernel/sched_latency_ns' '10000000'.
  530. I/cat     (  488): <6>[    8.215606] init: command 'write' r=0
  531. I/cat     (  488): <6>[    8.215667] init: Try to execute command 'write' with params '/proc/sys/kernel/sched_wakeup_granularity_ns' '2000000'.
  532. I/cat     (  488): <6>[    8.215728] init: command 'write' r=0
  533. I/cat     (  488): <6>[    8.215759] init: Try to execute command 'write' with params '/proc/sys/kernel/sched_compat_yield' '1'.
  534. I/cat     (  488): <6>[    8.215850] init: command 'write' r=-2
  535. I/cat     (  488): <6>[    8.215881] init: Try to execute command 'write' with params '/proc/sys/kernel/sched_child_runs_first' '0'.
  536. I/cat     (  488): <6>[    8.215942] init: command 'write' r=0
  537. I/cat     (  488): <6>[    8.215972] init: Try to execute command 'write' with params '/proc/sys/kernel/randomize_va_space' '2'.
  538. I/cat     (  488): <6>[    8.216033] init: command 'write' r=0
  539. I/cat     (  488): <6>[    8.216064] init: Try to execute command 'write' with params '/proc/sys/kernel/kptr_restrict' '2'.
  540. I/cat     (  488): <6>[    8.216125] init: command 'write' r=0
  541. I/cat     (  488): <6>[    8.216156] init: Try to execute command 'write' with params '/proc/sys/kernel/dmesg_restrict' '1'.
  542. I/cat     (  488): <6>[    8.216217] init: command 'write' r=0
  543. I/cat     (  488): <6>[    8.216247] init: Try to execute command 'write' with params '/proc/sys/vm/mmap_min_addr' '32768'.
  544. I/cat     (  488): <6>[    8.216308] init: command 'write' r=0
  545. I/cat     (  488): <6>[    8.216369] init: Try to execute command 'write' with params '/proc/sys/kernel/sched_rt_runtime_us' '950000'.
  546. I/cat     (  488): <6>[    8.216430] init: command 'write' r=0
  547. I/cat     (  488): <6>[    8.216461] init: Try to execute command 'write' with params '/proc/sys/kernel/sched_rt_period_us' '1000000'.
  548. I/cat     (  488): <6>[    8.216522] init: command 'write' r=0
  549. I/cat     (  488): <6>[    8.216552] init: Try to execute command 'mkdir' with params '/dev/cpuctl'.
  550. I/cat     (  488): <6>[    8.216583] init: command 'mkdir' r=0
  551. I/cat     (  488): <6>[    8.290954] init: command 'mount' r=0
  552. I/cat     (  488): <6>[    8.292205] init: Try to execute command 'chown' with params 'system' 'system' '/dev/cpuctl'.
  553. I/cat     (  488): <6>[    8.292388] init: command 'chown' r=0
  554. I/cat     (  488): <6>[    8.292541] init: Try to execute command 'chown' with params 'system' 'system' '/dev/cpuctl/tasks'.
  555. I/cat     (  488): <6>[    8.292999] init: command 'chown' r=0
  556. I/cat     (  488): <6>[    8.293121] init: Try to execute command 'chmod' with params '0660' '/dev/cpuctl/tasks'.
  557. I/cat     (  488): <6>[    8.293365] init: command 'chmod' r=0
  558. I/cat     (  488): <6>[    8.293487] init: Try to execute command 'write' with params '/dev/cpuctl/cpu.shares' '1024'.
  559. I/cat     (  488): <6>[    8.293640] init: command 'write' r=-22
  560. I/cat     (  488): <6>[    8.293762] init: Try to execute command 'write' with params '/dev/cpuctl/cpu.rt_runtime_us' '950000'.
  561. I/cat     (  488): <6>[    8.293914] init: command 'write' r=0
  562. I/cat     (  488): <6>[    8.294036] init: Try to execute command 'write' with params '/dev/cpuctl/cpu.rt_period_us' '1000000'.
  563. I/cat     (  488): <6>[    8.294189] init: command 'write' r=0
  564. I/cat     (  488): <6>[    8.294311] init: Try to execute command 'mkdir' with params '/dev/cpuctl/apps'.
  565. I/cat     (  488): <6>[    8.294586] init: command 'mkdir' r=0
  566. I/cat     (  488): <6>[    8.294708] init: Try to execute command 'chown' with params 'system' 'system' '/dev/cpuctl/apps/tasks'.
  567. I/cat     (  488): <6>[    8.294860] init: command 'chown' r=0
  568. I/cat     (  488): <6>[    8.294982] init: Try to execute command 'chmod' with params '0666' '/dev/cpuctl/apps/tasks'.
  569. I/cat     (  488): <6>[    8.295135] init: command 'chmod' r=0
  570. I/cat     (  488): <6>[    8.295257] init: Try to execute command 'write' with params '/dev/cpuctl/apps/cpu.shares' '1024'.
  571. I/cat     (  488): <6>[    8.295379] init: command 'write' r=0
  572. I/cat     (  488): <6>[    8.295501] init: Try to execute command 'write' with params '/dev/cpuctl/apps/cpu.rt_runtime_us' '800000'.
  573. I/cat     (  488): <6>[    8.295654] init: command 'write' r=0
  574. I/cat     (  488): <6>[    8.295776] init: Try to execute command 'write' with params '/dev/cpuctl/apps/cpu.rt_period_us' '1000000'.
  575. I/cat     (  488): <6>[    8.295898] init: command 'write' r=0
  576. I/cat     (  488): <6>[    8.296020] init: Try to execute command 'mkdir' with params '/dev/cpuctl/apps/bg_non_interactive'.
  577. I/cat     (  488): <6>[    8.296295] init: command 'mkdir' r=0
  578. I/cat     (  488): <6>[    8.296447] init: Try to execute command 'chown' with params 'system' 'system' '/dev/cpuctl/apps/bg_non_interactive/tasks'.
  579. I/cat     (  488): <6>[    8.296600] init: command 'chown' r=0
  580. I/cat     (  488): <6>[    8.296722] init: Try to execute command 'chmod' with params '0666' '/dev/cpuctl/apps/bg_non_interactive/tasks'.
  581. I/cat     (  488): <6>[    8.296874] init: command 'chmod' r=0
  582. I/cat     (  488): <6>[    8.296997] init: Try to execute command 'write' with params '/dev/cpuctl/apps/bg_non_interactive/cpu.shares' '52'.
  583. I/cat     (  488): <6>[    8.297149] init: command 'write' r=0
  584. I/cat     (  488): <6>[    8.297271] init: Try to execute command 'write' with params '/dev/cpuctl/apps/bg_non_interactive/cpu.rt_runtime_us' '700000'.
  585. I/cat     (  488): <6>[    8.297454] init: command 'write' r=0
  586. I/cat     (  488): <6>[    8.297576] init: Try to execute command 'write' with params '/dev/cpuctl/apps/bg_non_interactive/cpu.rt_period_us' '1000000'.
  587. I/cat     (  488): <6>[    8.300598] init: command 'write' r=0
  588. I/cat     (  488): <6>[    8.300750] init: Try to execute command 'chmod' with params '0644' '/dev/xt_qtaguid'.
  589. I/cat     (  488): <6>[    8.300933] init: command 'chmod' r=0
  590. I/cat     (  488): <6>[    8.301086] init: processing action 0x3c4e0 (init)
  591. I/cat     (  488): <6>[    8.301177] init: Try to execute command 'setprop' with params 'ro.board.cpu_type' 'OMAP4460'.
  592. I/cat     (  488): <6>[    8.301330] init: command 'setprop' r=0
  593. I/cat     (  488): <6>[    8.301452] init: Try to execute command 'write' with params '/sys/class/rfkill/rfkill0/state' '0'.
  594. I/cat     (  488): <6>[    8.302062] init: command 'write' r=0
  595. I/cat     (  488): <6>[    8.320892] init: command 'mkdir' r=0
  596. I/cat     (  488): <6>[    8.321136] init: command 'mkdir' r=0
  597. I/cat     (  488): <6>[    8.321380] init: command 'mkdir' r=0
  598. I/cat     (  488): <6>[    8.321594] init: command 'mkdir' r=0
  599. I/cat     (  488): <6>[    8.321685] init: Try to execute command 'export' with params 'EXTERNAL_STORAGE' '/storage/emulated/legacy'.
  600. I/cat     (  488): <6>[    8.321777] init: command 'export' r=0
  601. I/cat     (  488): <6>[    8.321899] init: Try to execute command 'export' with params 'EMULATED_STORAGE_SOURCE' '/mnt/shell/emulated'.
  602. I/cat     (  488): <6>[    8.321990] init: command 'export' r=0
  603. I/cat     (  488): <6>[    8.322113] init: Try to execute command 'export' with params 'EMULATED_STORAGE_TARGET' '/storage/emulated'.
  604. I/cat     (  488): <6>[    8.322204] init: command 'export' r=0
  605. I/cat     (  488): <6>[    8.322326] init: Try to execute command 'export' with params 'SECONDARY_STORAGE' '/mnt/storage_sd_card'.
  606. I/cat     (  488): <6>[    8.322387] init: command 'export' r=0
  607. I/cat     (  488): <6>[    8.322509] init: Try to execute command 'export' with params 'SECOND_VOLUME_STORAGE' '/mnt/storage_sd_card'.
  608. I/cat     (  488): <6>[    8.322601] init: command 'export' r=0
  609. I/cat     (  488): <6>[    8.322723] init: Try to execute command 'symlink' with params '/storage/emulated/legacy' '/sdcard'.
  610. I/cat     (  488): <6>[    8.322875] init: command 'symlink' r=-1
  611. I/cat     (  488): <6>[    8.322998] init: Try to execute command 'symlink' with params '/storage/emulated/legacy' '/mnt/sdcard'.
  612. I/cat     (  488): <6>[    8.323150] init: command 'symlink' r=-1
  613. I/cat     (  488): <6>[    8.323272] init: Try to execute command 'symlink' with params '/storage/emulated/legacy' '/storage/sdcard0'.
  614. I/cat     (  488): <6>[    8.323394] init: command 'symlink' r=0
  615. I/cat     (  488): <6>[    8.323516] init: Try to execute command 'symlink' with params '/mnt/shell/emulated/0' '/storage/emulated/legacy'.
  616. I/cat     (  488): <6>[    8.323638] init: command 'symlink' r=0
  617. I/cat     (  488): <6>[    8.323760] init: Try to execute command 'write' with params '/sys/kernel/debug/pm_debug/smartreflex/sr_core/autocomp' '1'.
  618. I/cat     (  488): <6>[    8.323944] init: command 'write' r=-2
  619. I/cat     (  488): <6>[    8.324066] init: Try to execute command 'write' with params '/sys/kernel/debug/pm_debug/smartreflex/sr_iva/autocomp' '1'.
  620. I/cat     (  488): <6>[    8.324218] init: command 'write' r=-2
  621. I/cat     (  488): <6>[    8.324340] init: Try to execute command 'write' with params '/sys/kernel/debug/pm_debug/smartreflex/sr_mpu/autocomp' '1'.
  622. I/cat     (  488): <6>[    8.324462] init: command 'write' r=-2
  623. I/cat     (  488): <6>[    8.324584] init: Try to execute command 'write' with params '/sys/devices/platform/omapdss/display1/hpd_enabled' '1'.
  624. I/cat     (  488): <6>[    8.324890] init: command 'write' r=-2
  625. I/cat     (  488): <6>[    8.325042] init: processing action 0x40d48 (init)
  626. I/cat     (  488): <6>[    8.325103] init: Try to execute command 'insmod' with params '/lib/modules/cypress-tma340.ko'.
  627. I/cat     (  488): <6>[    8.430725] cypress-tma340 4-0024: cypress_tma340_power on
  628. I/cat     (  488): <6>[    8.455444] cypress-tma340 4-0024: BOOT 010b / TTS 14dc / APP 0622 / ID 0001
  629. I/cat     (  488): <6>[    8.455841] cypress-tma340 4-0024: tsp woke up in bootloader mode.
  630. I/cat     (  488): <6>[    8.482421] omap-rproc omap-rproc.1: Loaded BIOS image ducati-m3.bin, size 5841740
  631. I/cat     (  488): <4>[    8.482635] rproc_check_poolmem: section size does not fit within carveout memory
  632. I/cat     (  488): <3>[    8.482696] omap-rproc omap-rproc.1: static memory for IPU_MEM_IPC_VRING doesn't belong to poolmem
  633. I/cat     (  488): <3>[    8.482971] omap-rproc omap-rproc.1: Failed to process the image: -28
  634. I/cat     (  488): <6>[    8.674194] cypress-tma340 4-0024: x_max : 2048 - y_max : 2048 - finger_max : 4
  635. I/cat     (  488): <6>[    8.736724] input: cypress-tma340 as /devices/virtual/input/input5
  636. I/cat     (  488): <6>[    8.739196] init: command 'insmod' r=0
  637. I/cat     (  488): <6>[    8.739318] init: Try to execute command 'insmod' with params '/lib/modules/tr16c0-i2c.ko'.
  638. I/cat     (  488): <6>[    8.745239] init: command 'insmod' r=0
  639. I/cat     (  488): <6>[    8.745361] init: Try to execute command 'insmod' with params '/lib/modules/hso.ko'.
  640. I/cat     (  488): <3>[    8.755737] hso: version magic '3.0.8+ SMP preempt mod_unload ARMv7 ' should be '3.0.21+ SMP preempt mod_unload ARMv7 '
  641. I/cat     (  488): <6>[    8.755889] init: command 'insmod' r=-1
  642. I/cat     (  488): <6>[    8.755981] init: Try to execute command 'setprop' with params 'ro.product.device' 'A80'.
  643. I/cat     (  488): <6>[    8.756134] init: command 'setprop' r=0
  644. I/cat     (  488): <6>[    8.756286] init: Try to execute command 'setprop' with params 'ro.build.product' 'G9A80'.
  645. I/cat     (  488): <6>[    8.756408] init: command 'setprop' r=0
  646. I/cat     (  488): <6>[    8.756530] init: Try to execute command 'setprop' with params 'ro.product.name' 'G9A80'.
  647. I/cat     (  488): <6>[    8.756652] init: command 'setprop' r=0
  648. I/cat     (  488): <6>[    8.756774] init: Try to execute command 'setprop' with params 'ro.product.model' 'ARCHOS 80G9'.
  649. I/cat     (  488): <6>[    8.756896] init: command 'setprop' r=0
  650. I/cat     (  488): <6>[    8.757049] init: Try to execute command 'setprop' with params 'ro.com.google.clientidbase' 'android-archos'.
  651. I/cat     (  488): <6>[    8.757171] init: command 'setprop' r=0
  652. I/cat     (  488): <6>[    8.757293] init: Try to execute command 'setprop' with params 'ro.board.has_hdmi' 'yes'.
  653. I/cat     (  488): <6>[    8.757415] init: command 'setprop' r=0
  654. I/cat     (  488): <6>[    8.757537] init: Try to execute command 'setprop' with params 'ro.board.has_analog_out' 'no'.
  655. I/cat     (  488): <6>[    8.757659] init: command 'setprop' r=0
  656. I/cat     (  488): <6>[    8.757812] init: Try to execute command 'setprop' with params 'ro.board.use_bluetooth' 'yes'.
  657. I/cat     (  488): <6>[    8.757934] init: command 'setprop' r=0
  658. I/cat     (  488): <6>[    8.758056] init: Try to execute command 'setprop' with params 'ro.board.has_soft_keys' 'no'.
  659. I/cat     (  488): <6>[    8.758178] init: command 'setprop' r=0
  660. I/cat     (  488): <6>[    8.758300] init: Try to execute command 'setprop' with params 'ro.board.has_earpiece' 'no'.
  661. I/cat     (  488): <6>[    8.758453] init: command 'setprop' r=0
  662. I/cat     (  488): <6>[    8.758575] init: Try to execute command 'setprop' with params 'ro.board.has_speaker' 'yes'.
  663. I/cat     (  488): <6>[    8.758850] init: command 'setprop' r=0
  664. I/cat     (  488): <6>[    8.758972] init: Try to execute command 'setprop' with params 'ro.board.has_hp_detection' 'yes'.
  665. I/cat     (  488): <6>[    8.759094] init: command 'setprop' r=0
  666. I/cat     (  488): <6>[    8.759246] init: Try to execute command 'setprop' with params 'ro.board.desktop_experience' 'yes'.
  667. I/cat     (  488): <6>[    8.759368] init: command 'setprop' r=0
  668. I/cat     (  488): <6>[    8.759490] init: Try to execute command 'setprop' with params 'ro.board.display_portrait' '3'.
  669. I/cat     (  488): <6>[    8.759613] init: command 'setprop' r=0
  670. I/cat     (  488): <6>[    8.759735] init: Try to execute command 'setprop' with params 'ro.board.tv_portrait' '3'.
  671. I/cat     (  488): <6>[    8.759887] init: command 'setprop' r=0
  672. I/cat     (  488): <6>[    8.760009] init: Try to execute command 'setprop' with params 'ro.board.has_gps' 'yes'.
  673. I/cat     (  488): <6>[    8.760131] init: command 'setprop' r=0
  674. I/cat     (  488): <6>[    8.760253] init: Try to execute command 'setprop' with params 'ro.board.has_gsm' 'no'.
  675. I/cat     (  488): <6>[    8.760375] init: command 'setprop' r=0
  676. I/cat     (  488): <6>[    8.760498] init: Try to execute command 'setprop' with params 'ro.board.has_mmc' 'yes'.
  677. I/cat     (  488): <6>[    8.760650] init: command 'setprop' r=0
  678. I/cat     (  488): <6>[    8.760772] init: Try to execute command 'setprop' with params 'ro.board.has_data_key' 'yes'.
  679. I/cat     (  488): <6>[    8.760894] init: command 'setprop' r=0
  680. I/cat     (  488): <6>[    8.761016] init: Try to execute command 'setprop' with params 'ro.board.has_camera' 'yes'.
  681. I/cat     (  488): <6>[    8.761138] init: command 'setprop' r=0
  682. I/cat     (  488): <6>[    8.761260] init: Try to execute command 'setprop' with params 'ro.board.camera_type' 'OV7675'.
  683. I/cat     (  488): <6>[    8.761413] init: command 'setprop' r=0
  684. I/cat     (  488): <6>[    8.761535] init: Try to execute command 'setprop' with params 'ro.board.is_front_camera' 'yes'.
  685. I/cat     (  488): <6>[    8.761657] init: command 'setprop' r=0
  686. I/cat     (  488): <6>[    8.761779] init: Try to execute command 'setprop' with params 'ro.board.camera_hflipped' 'yes'.
  687. I/cat     (  488): <6>[    8.761901] init: command 'setprop' r=0
  688. I/cat     (  488): <6>[    8.762023] init: Try to execute command 'setprop' with params 'ro.board.camera_vflipped' 'no'.
  689. I/cat     (  488): <6>[    8.762176] init: command 'setprop' r=0
  690. I/cat     (  488): <6>[    8.762298] init: Try to execute command 'setprop' with params 'ro.board.has_vibrator' 'no'.
  691. I/cat     (  488): <6>[    8.762420] init: command 'setprop' r=0
  692. I/cat     (  488): <6>[    8.762542] init: Try to execute command 'setprop' with params 'ro.board.has_dsp' 'yes'.
  693. I/cat     (  488): <6>[    8.762664] init: command 'setprop' r=0
  694. I/cat     (  488): <6>[    8.762786] init: Try to execute command 'setprop' with params 'ro.board.brightness.delay' '800'.
  695. I/cat     (  488): <6>[    8.762939] init: command 'setprop' r=0
  696. I/cat     (  488): <6>[    8.763061] init: Try to execute command 'setprop' with params 'ro.board.brightness.dim' '10'.
  697. I/cat     (  488): <6>[    8.763183] init: command 'setprop' r=0
  698. I/cat     (  488): <6>[    8.763305] init: Try to execute command 'setprop' with params 'ro.board.brightness.dim_default' '135'.
  699. I/cat     (  488): <6>[    8.763427] init: command 'setprop' r=0
  700. I/cat     (  488): <6>[    8.763580] init: Try to execute command 'setprop' with params 'ro.board.light_sensor' 'no'.
  701. I/cat     (  488): <6>[    8.763702] init: command 'setprop' r=0
  702. I/cat     (  488): <6>[    8.763824] init: Try to execute command 'setprop' with params 'ro.board.has_compass' 'yes'.
  703. I/cat     (  488): <6>[    8.763946] init: command 'setprop' r=0
  704. I/cat     (  488): <6>[    8.764068] init: Try to execute command 'setprop' with params 'ro.board.can_charge_when_off' 'no'.
  705. I/cat     (  488): <6>[    8.764221] init: command 'setprop' r=0
  706. I/cat     (  488): <6>[    8.764343] init: Try to execute command 'setprop' with params 'media.stagefright.enable-player' 'true'.
  707. I/cat     (  488): <6>[    8.764465] init: command 'setprop' r=0
  708. I/cat     (  488): <6>[    8.764587] init: Try to execute command 'setprop' with params 'media.stagefright.enable-http' 'true'.
  709. D/hotplugd(  509): HotPlug Service Start argc:1
  710. I/cat     (  488): <6>[    8.764709] init: command 'setprop' r=0
  711. D/hotplugd(  509): hotplug.modeswitch.d not set...checking known locations
  712. D/hotplugd(  509): /etc/usb_modeswitch found
  713. I/cat     (  488): <6>[    8.764831] init: processing action 0x34690 (fs)
  714. I/hotplugd(  509): Starting hotplugd For UsbModeSwitch Management - Settings:modeswitch.d:/etc/usb_modeswitch length:19 debug:1
  715. D/hotplugd(  509): Give us a go on your UEVENT
  716. I/cat     (  488): <6>[    8.764923] init: Try to execute command 'mount' with params 'rawfs' '/dev/block/mmcblk0p1' '/mnt/rawfs'.
  717. I/cat     (  488): <6>[    8.765991] init: command 'mount' r=0
  718. I/cat     (  488): <6>[    8.766143] init: processing action 0x3cad0 (fs)
  719. I/cat     (  488): <6>[    8.766204] init: Try to execute command 'chmod' with params '0777' '/dev/ion'.
  720. I/cat     (  488): <6>[    8.766418] init: command 'chmod' r=0
  721. I/cat     (  488): <6>[    8.766662] init: Try to execute command 'chown' with params 'radio' 'radio' '/factory'.
  722. I/cat     (  488): <6>[    8.766815] init: command 'chown' r=-2
  723. I/cat     (  488): <6>[    8.766937] init: Try to execute command 'chmod' with params '0775' '/factory'.
  724. I/cat     (  488): <6>[    8.767059] init: command 'chmod' r=-2
  725. I/cat     (  488): <6>[    8.767181] init: Try to execute command 'chown' with params 'root' 'system' '/sys/devices/system/cpu/cpu0/cpufreq/scaling_governor'.
  726. I/cat     (  488): <6>[    8.767456] init: command 'chown' r=0
  727. E/uim-sysfs(  493): uim: Inserted btwilink module
  728. I/cat     (  488): <6>[    8.767578] init: Try to execute command 'chmod' with params '0664' '/sys/devices/system/cpu/cpu0/cpufreq/scaling_governor'.
  729. E/uim-sysfs(  493): uim:FM driver module un-available...
  730. E/uim-sysfs(  493): uim:FM driver built into the kernel ?
  731. E/uim-sysfs(  493): uim:GPS driver module un-available...
  732. E/uim-sysfs(  493): uim:GPS driver built into the kernel ?
  733. E/uim-sysfs(  493): uim:FM V4L2 driver module un-available...
  734. E/uim-sysfs(  493): uim:FM V4L2 driver built into the kernel ?
  735. I/cat     (  488): <6>[    8.767761] init: command 'chmod' r=0
  736. E/uim-sysfs(  493): uim:found bluetooth rfkill entry @ 1
  737. E/uim-sysfs(  493):
  738. E/uim-sysfs(  493): uim:changed permissions for /sys/class/rfkill/rfkill1/state(0)
  739. E/uim-sysfs(  493):
  740. I/cat     (  488): <6>[    8.767883] init: Try to execute command 'chown' with params 'root' 'system' '/sys/devices/system/cpu/cpu0/cpufreq/scaling_max_freq'.
  741. I/cat     (  488): <6>[    8.768127] init: command 'chown' r=0
  742. I/cat     (  488): <6>[    8.768249] init: Try to execute command 'chmod' with params '0664' '/sys/devices/system/cpu/cpu0/cpufreq/scaling_max_freq'.
  743. I/cat     (  488): <6>[    8.768432] init: command 'chmod' r=0
  744. I/cat     (  488): <6>[    8.768554] init: Try to execute command 'chown' with params 'root' 'system' '/sys/devices/system/cpu/cpu0/cpufreq/scaling_min_freq'.
  745. I/cat     (  488): <6>[    8.768798] init: command 'chown' r=0
  746. I/cat     (  488): <6>[    8.768920] init: Try to execute command 'chmod' with params '0664' '/sys/devices/system/cpu/cpu0/cpufreq/scaling_min_freq'.
  747. I/cat     (  488): <6>[    8.769104] init: command 'chmod' r=0
  748. I/cat     (  488): <6>[    8.769226] init: Try to execute command 'chown' with params 'system' 'system' '/sys/devices/system/cpu/cpu0/cpufreq/boost_cpufreq'.
  749. I/cat     (  488): <6>[    8.769470] init: command 'chown' r=0
  750. I/cat     (  488): <6>[    8.769592] init: Try to execute command 'chmod' with params '0664' '/sys/devices/system/cpu/cpu0/cpufreq/boost_cpufreq'.
  751. I/cat     (  488): <6>[    8.769775] init: command 'chmod' r=0
  752. I/cat     (  488): <6>[    8.769897] init: Try to execute command 'write' with params '/sys/devices/system/cpu/cpufreq/hotplug/boost_timeout' '60000000'.
  753. I/cat     (  488): <6>[    8.770080] init: command 'write' r=-2
  754. I/cat     (  488): <6>[    8.770202] init: Try to execute command 'write' with params '/sys/devices/system/cpu/cpu0/cpufreq/boost_cpufreq' '1'.
  755. I/cat     (  488): <6>[    8.770416] init: command 'write' r=0
  756. I/cat     (  488): <6>[    8.770538] init: Try to execute command 'chown' with params 'media' 'media' '/dev/syslink-proc4430'.
  757. I/cat     (  488): <6>[    8.770721] init: command 'chown' r=-2
  758. I/cat     (  488): <6>[    8.770843] init: Try to execute command 'chown' with params 'media' 'media' '/dev/syslink-procmgr'.
  759. I/cat     (  488): <6>[    8.770996] init: command 'chown' r=-2
  760. I/cat     (  488): <6>[    8.771118] init: Try to execute command 'chown' with params 'media' 'media' '/dev/syslink_ipc'.
  761. I/cat     (  488): <6>[    8.771240] init: command 'chown' r=-2
  762. I/cat     (  488): <6>[    8.771392] init: Try to execute command 'chown' with params 'media' 'media' '/dev/omap-rproc0'.
  763. I/cat     (  488): <6>[    8.771514] init: command 'chown' r=-2
  764. I/cat     (  488): <6>[    8.771636] init: Try to execute command 'chown' with params 'media' 'media' '/dev/omap-rproc1'.
  765. I/cat     (  488): <6>[    8.771789] init: command 'chown' r=-2
  766. I/cat     (  488): <6>[    8.771911] init: Try to execute command 'chown' with params 'media' 'media' '/dev/omap-rproc2'.
  767. I/cat     (  488): <6>[    8.772064] init: command 'chown' r=-2
  768. I/cat     (  488): <6>[    8.772186] init: Try to execute command 'chown' with params 'media' 'media' '/dev/iovmm-omap0'.
  769. I/cat     (  488): <6>[    8.772338] init: command 'chown' r=-2
  770. I/cat     (  488): <6>[    8.772460] init: Try to execute command 'chown' with params 'media' 'media' '/dev/iovmm-omap1'.
  771. I/cat     (  488): <6>[    8.772613] init: command 'chown' r=-2
  772. I/cat     (  488): <6>[    8.772735] init: Try to execute command 'chown' with params 'media' 'media' '/dev/omap-devh0'.
  773. I/cat     (  488): <6>[    8.772888] init: command 'chown' r=-2
  774. I/cat     (  488): <6>[    8.773010] init: Try to execute command 'chown' with params 'media' 'media' '/dev/omap-devh1'.
  775. I/cat     (  488): <6>[    8.773162] init: command 'chown' r=-2
  776. I/cat     (  488): <6>[    8.773284] init: Try to execute command 'chown' with params 'media' 'media' '/dev/omap-devh2'.
  777. I/cat     (  488): <6>[    8.773437] init: command 'chown' r=-2
  778. I/cat     (  488): <6>[    8.773559] init: Try to execute command 'chmod' with params '660' '/dev/syslink-proc4430'.
  779. I/cat     (  488): <6>[    8.773712] init: command 'chmod' r=-2
  780. I/cat     (  488): <6>[    8.773834] init: Try to execute command 'chmod' with params '660' '/dev/syslink-procmgr'.
  781. I/cat     (  488): <6>[    8.773956] init: command 'chmod' r=-2
  782. I/cat     (  488): <6>[    8.774078] init: Try to execute command 'chmod' with params '660' '/dev/syslink_ipc'.
  783. I/cat     (  488): <6>[    8.774230] init: command 'chmod' r=-2
  784. I/cat     (  488): <6>[    8.774383] init: Try to execute command 'chmod' with params '440' '/dev/omap-rproc0'.
  785. I/cat     (  488): <6>[    8.774536] init: command 'chmod' r=-2
  786. I/cat     (  488): <6>[    8.774658] init: Try to execute command 'chmod' with params '440' '/dev/omap-rproc1'.
  787. I/cat     (  488): <6>[    8.774810] init: command 'chmod' r=-2
  788. I/cat     (  488): <6>[    8.774932] init: Try to execute command 'chmod' with params '440' '/dev/omap-rproc2'.
  789. I/cat     (  488): <6>[    8.775054] init: command 'chmod' r=-2
  790. I/cat     (  488): <6>[    8.775177] init: Try to execute command 'chmod' with params '440' '/dev/iovmm-omap0'.
  791. I/cat     (  488): <6>[    8.775329] init: command 'chmod' r=-2
  792. I/cat     (  488): <6>[    8.775451] init: Try to execute command 'chmod' with params '440' '/dev/iovmm-omap1'.
  793. I/cat     (  488): <6>[    8.775573] init: command 'chmod' r=-2
  794. D/hotplugd(  509):  host { action:'add' sub:'bluetooth', type:'host', name:'', vendor: product:
  795. D/hotplugd(  509):                      path:'/devices/virtual/bluetooth/hci0' }
  796. D/hotplugd(  509):   { action:'add' sub:'rfkill', type:'', name:'', vendor: product:
  797. D/hotplugd(  509):                      path:'/devices/virtual/bluetooth/hci0/rfkill1' }
  798. D/hotplugd(  509):   { action:'add' sub:'drivers', type:'', name:'', vendor: product:
  799. D/hotplugd(  509):                      path:'/bus/platform/drivers/btwilink' }
  800. D/hotplugd(  509):   { action:'change' sub:'rfkill', type:'', name:'', vendor: product:
  801. D/hotplugd(  509):                      path:'/devices/virtual/bluetooth/hci0/rfkill1' }
  802. I/cat     (  488): <6>[    8.775695] init: Try to execute command 'chmod' with params '440' '/dev/omap-devh0'.
  803. I/cat     (  488): <6>[    8.775848] init: command 'chmod' r=-2
  804. I/cat     (  488): <6>[    8.775970] init: Try to execute command 'chmod' with params '440' '/dev/omap-devh1'.
  805. I/cat     (  488): <6>[    8.776092] init: command 'chmod' r=-2
  806. I/cat     (  488): <6>[    8.776214] init: Try to execute command 'chmod' with params '440' '/dev/omap-devh2'.
  807. I/cat     (  488): <6>[    8.776367] init: command 'chmod' r=-2
  808. I/cat     (  488): <6>[    8.776489] init: Try to execute command 'chmod' with params '777' '/dev/notifyducatidrv'.
  809. I/cat     (  488): <6>[    8.776611] init: command 'chmod' r=-2
  810. I/cat     (  488): <6>[    8.776733] init: Try to execute command 'chmod' with params '777' '/dev/ipcnotify'.
  811. I/cat     (  488): <6>[    8.776885] init: command 'chmod' r=-2
  812. I/cat     (  488): <6>[    8.777008] init: Try to execute command 'chmod' with params '777' '/dev/syslink_platform'.
  813. I/cat     (  488): <6>[    8.777160] init: command 'chmod' r=-2
  814. I/cat     (  488): <6>[    8.777282] init: Try to execute command 'chown' with params 'media' 'media' '/dev/tiler'.
  815. I/cat     (  488): <6>[    8.777435] init: command 'chown' r=0
  816. I/cat     (  488): <6>[    8.777557] init: Try to execute command 'chmod' with params '0777' '/dev/tiler'.
  817. I/cat     (  488): <6>[    8.777679] init: command 'chmod' r=0
  818. I/cat     (  488): <6>[    8.777801] init: Try to execute command 'chmod' with params '0777' '/dev/dmm'.
  819. I/cat     (  488): <6>[    8.777954] init: command 'chmod' r=-2
  820. I/cat     (  488): <6>[    8.778076] init: Try to execute command 'chmod' with params '0660' '/dev/ttyS0'.
  821. I/cat     (  488): <6>[    8.778198] init: command 'chmod' r=-2
  822. I/cat     (  488): <6>[    8.778320] init: Try to execute command 'chown' with params 'radio' 'radio' '/dev/ttyS0'.
  823. I/cat     (  488): <6>[    8.778472] init: command 'chown' r=-2
  824. I/cat     (  488): <6>[    8.778594] init: Try to execute command 'chown' with params 'system' 'system' '/sys/devices/platform/omapdss/display0/enabled'.
  825. I/cat     (  488): <6>[    8.778930] init: command 'chown' r=0
  826. I/cat     (  488): <6>[    8.779052] init: Try to execute command 'chown' with params 'system' 'system' '/sys/devices/platform/omapdss/display1/enabled'.
  827. I/cat     (  488): <6>[    8.779357] init: command 'chown' r=0
  828. I/cat     (  488): <6>[    8.779479] init: Try to execute command 'chown' with params 'system' 'system' '/sys/devices/platform/omapdss/display1/hpd_enabled'.
  829. I/cat     (  488): <6>[    8.779815] init: command 'chown' r=-2
  830. I/cat     (  488): <6>[    8.779968] init: Try to execute command 'chown' with params 'system' 'system' '/sys/devices/platform/omapdss/display2/enabled'.
  831. I/cat     (  488): <6>[    8.780181] init: command 'chown' r=-2
  832. I/cat     (  488): <6>[    8.780303] init: Try to execute command 'chown' with params 'system' 'system' '/sys/devices/platform/omapdss/display3/enabled'.
  833. I/cat     (  488): <6>[    8.780548] init: command 'chown' r=-2
  834. I/cat     (  488): <6>[    8.780670] init: Try to execute command 'chown' with params 'system' 'system' '/sys/devices/platform/omapdss/display0/name'.
  835. I/cat     (  488): <6>[    8.780914] init: command 'chown' r=0
  836. I/cat     (  488): <6>[    8.781036] init: Try to execute command 'chown' with params 'system' 'system' '/sys/devices/platform/omapdss/display1/name'.
  837. I/cat     (  488): <6>[    8.781280] init: command 'chown' r=0
  838. I/cat     (  488): <6>[    8.781433] init: Try to execute command 'chown' with params 'system' 'system' '/sys/devices/platform/omapdss/display2/name'.
  839. I/cat     (  488): <6>[    8.781646] init: command 'chown' r=-2
  840. I/cat     (  488): <6>[    8.781768] init: Try to execute command 'chown' with params 'system' 'system' '/sys/devices/platform/omapdss/display3/name'.
  841. I/cat     (  488): <6>[    8.781951] init: command 'chown' r=-2
  842. I/cat     (  488): <6>[    8.782073] init: Try to execute command 'chown' with params 'system' 'system' '/sys/devices/platform/omapdss/overlay0/manager'.
  843. I/cat     (  488): <6>[    8.782409] init: command 'chown' r=0
  844. I/cat     (  488): <6>[    8.782531] init: Try to execute command 'chown' with params 'system' 'system' '/sys/devices/platform/omapdss/overlay1/manager'.
  845. I/cat     (  488): <6>[    8.782836] init: command 'chown' r=0
  846. I/cat     (  488): <6>[    8.782958] init: Try to execute command 'chown' with params 'system' 'system' '/sys/devices/platform/omapdss/overlay2/manager'.
  847. I/cat     (  488): <6>[    8.783050] init: command 'chown' r=0
  848. I/cat     (  488): <6>[    8.783081] init: Try to execute command 'chown' with params 'system' 'system' '/sys/devices/platform/omapdss/overlay3/manager'.
  849. I/cat     (  488): <6>[    8.783142] init: command 'chown' r=0
  850. I/cat     (  488): <6>[    8.783203] init: Try to execute command 'chown' with params 'system' 'system' '/sys/devices/platform/omapdss/overlay0/zorder'.
  851. I/cat     (  488): <6>[    8.783264] init: command 'chown' r=0
  852. I/cat     (  488): <6>[    8.783294] init: Try to execute command 'chown' with params 'system' 'system' '/sys/devices/platform/omapdss/overlay1/zorder'.
  853. I/cat     (  488): <6>[    8.783386] init: command 'chown' r=0
  854. I/cat     (  488): <6>[    8.783416] init: Try to execute command 'chown' with params 'system' 'system' '/sys/devices/platform/omapdss/overlay2/zorder'.
  855. I/cat     (  488): <6>[    8.783477] init: command 'chown' r=0
  856. I/cat     (  488): <6>[    8.783538] init: Try to execute command 'chown' with params 'system' 'system' '/sys/devices/platform/omapdss/overlay3/zorder'.
  857. I/cat     (  488): <6>[    8.783599] init: command 'chown' r=0
  858. I/cat     (  488): <6>[    8.783630] init: Try to execute command 'chown' with params 'system' 'system' '/sys/devices/platform/omapdss/overlay1/position'.
  859. I/cat     (  488): <6>[    8.783721] init: command 'chown' r=0
  860. I/cat     (  488): <6>[    8.783752] init: Try to execute command 'chown' with params 'system' 'system' '/sys/devices/platform/omapdss/overlay1/input_size'.
  861. I/cat     (  488): <6>[    8.783813] init: command 'chown' r=0
  862. I/cat     (  488): <6>[    8.783874] init: Try to execute command 'chown' with params 'system' 'system' '/sys/devices/platform/omapdss/overlay1/output_size'.
  863. I/cat     (  488): <6>[    8.783935] init: command 'chown' r=0
  864. I/cat     (  488): <6>[    8.783966] init: Try to execute command 'chown' with params 'system' 'system' '/sys/devices/platform/omapdss/overlay2/position'.
  865. I/cat     (  488): <6>[    8.784057] init: command 'chown' r=0
  866. I/cat     (  488): <6>[    8.784088] init: Try to execute command 'chown' with params 'system' 'system' '/sys/devices/platform/omapdss/overlay2/input_size'.
  867. I/cat     (  488): <6>[    8.784149] init: command 'chown' r=0
  868. I/cat     (  488): <6>[    8.784179] init: Try to execute command 'chown' with params 'system' 'system' '/sys/devices/platform/omapdss/overlay2/output_size'.
  869. I/cat     (  488): <6>[    8.784271] init: command 'chown' r=0
  870. I/cat     (  488): <6>[    8.784301] init: Try to execute command 'chown' with params 'system' 'system' '/sys/devices/platform/omapdss/overlay3/position'.
  871. I/cat     (  488): <6>[    8.784362] init: command 'chown' r=0
  872. I/cat     (  488): <6>[    8.784423] init: Try to execute command 'chown' with params 'system' 'system' '/sys/devices/platform/omapdss/overlay3/input_size'.
  873. I/cat     (  488): <6>[    8.784484] init: command 'chown' r=0
  874. I/cat     (  488): <6>[    8.784515] init: Try to execute command 'chown' with params 'system' 'system' '/sys/devices/platform/omapdss/overlay3/output_size'.
  875. I/cat     (  488): <6>[    8.784606] init: command 'chown' r=0
  876. I/cat     (  488): <6>[    8.784637] init: Try to execute command 'chown' with params 'system' 'system' '/sys/devices/platform/omapdss/manager0/name'.
  877. I/cat     (  488): <6>[    8.784698] init: command 'chown' r=0
  878. I/cat     (  488): <6>[    8.784729] init: Try to execute command 'chown' with params 'system' 'system' '/sys/devices/platform/omapdss/manager0/display'.
  879. I/cat     (  488): <6>[    8.784820] init: command 'chown' r=0
  880. I/cat     (  488): <6>[    8.784851] init: Try to execute command 'chown' with params 'system' 'system' '/sys/devices/platform/omapdss/manager1/name'.
  881. I/cat     (  488): <6>[    8.784912] init: command 'chown' r=0
  882. I/cat     (  488): <6>[    8.784973] init: Try to execute command 'chown' with params 'system' 'system' '/sys/devices/platform/omapdss/manager1/display'.
  883. I/cat     (  488): <6>[    8.785034] init: command 'chown' r=0
  884. I/cat     (  488): <6>[    8.785064] init: Try to execute command 'chown' with params 'system' 'system' '/sys/devices/platform/omapdss/manager2/name'.
  885. I/cat     (  488): <6>[    8.785125] init: command 'chown' r=0
  886. I/cat     (  488): <6>[    8.785156] init: Try to execute command 'chown' with params 'system' 'system' '/sys/devices/platform/omapdss/manager2/display'.
  887. I/cat     (  488): <6>[    8.785247] init: command 'chown' r=0
  888. I/cat     (  488): <6>[    8.785278] init: Try to execute command 'chown' with params 'system' 'system' '/sys/devices/platform/omapdss/overlay0/enabled'.
  889. I/cat     (  488): <6>[    8.785339] init: command 'chown' r=0
  890. I/cat     (  488): <6>[    8.785400] init: Try to execute command 'chown' with params 'system' 'system' '/sys/devices/platform/omapdss/overlay1/enabled'.
  891. I/cat     (  488): <6>[    8.785461] init: command 'chown' r=0
  892. I/cat     (  488): <6>[    8.785491] init: Try to execute command 'chown' with params 'system' 'system' '/sys/devices/platform/omapdss/overlay2/enabled'.
  893. I/cat     (  488): <6>[    8.785552] init: command 'chown' r=0
  894. I/cat     (  488): <6>[    8.785614] init: Try to execute command 'chown' with params 'system' 'system' '/sys/devices/platform/omapdss/overlay3/enabled'.
  895. I/cat     (  488): <6>[    8.785675] init: command 'chown' r=0
  896. I/cat     (  488): <6>[    8.785705] init: Try to execute command 'chown' with params 'system' 'system' '/sys/devices/platform/omapdss/display0/timings'.
  897. I/cat     (  488): <6>[    8.785797] init: command 'chown' r=0
  898. I/cat     (  488): <6>[    8.785827] init: Try to execute command 'chown' with params 'system' 'system' '/sys/devices/platform/omapdss/display1/timings'.
  899. I/cat     (  488): <6>[    8.785919] init: command 'chown' r=0
  900. I/cat     (  488): <6>[    8.785980] init: Try to execute command 'chown' with params 'system' 'system' '/sys/devices/platform/omapdss/display2/timings'.
  901. I/cat     (  488): <6>[    8.786041] init: command 'chown' r=-2
  902. I/cat     (  488): <6>[    8.786071] init: Try to execute command 'chown' with params 'system' 'system' '/sys/devices/platform/omapdss/display3/timings'.
  903. I/cat     (  488): <6>[    8.786132] init: command 'chown' r=-2
  904. I/cat     (  488): <6>[    8.786193] init: Try to execute command 'chown' with params 'system' 'system' '/sys/module/omapdss/parameters/overscan_percent'.
  905. I/cat     (  488): <6>[    8.786285] init: command 'chown' r=-2
  906. I/cat     (  488): <6>[    8.786315] init: Try to execute command 'chown' with params 'system' 'system' '/sys/devices/platform/omapdss/display1/s3d_enable'.
  907. I/cat     (  488): <6>[    8.786407] init: command 'chown' r=0
  908. I/cat     (  488): <6>[    8.786437] init: Try to execute command 'chown' with params 'system' 'system' '/sys/devices/platform/omapdss/display1/s3d_type'.
  909. I/cat     (  488): <6>[    8.786529] init: command 'chown' r=0
  910. I/cat     (  488): <6>[    8.786560] init: Try to execute command 'symlink' with params '/dev/ttyO0' '/dev/tigps'.
  911. I/cat     (  488): <6>[    8.786621] init: command 'symlink' r=0
  912. I/cat     (  488): <6>[    8.786651] init: Try to execute command 'write' with params '/sys/devices/system/cpu/cpufreq/hotplug/boost_timeout' '3000000'.
  913. I/cat     (  488): <6>[    8.786712] init: command 'write' r=-2
  914. I/cat     (  488): <6>[    8.786743] init: Try to execute command 'write' with params '/sys/devices/platform/omapdss/display1/hpd_enabled' '1'.
  915. I/create_sysid(  487): Sys_pk_build_product_key [6KF2F3U0FCS132] [6KF2-F3U0-FCS1-32]
  916. I/cat     (  488): <6>[    8.786804] init: command 'write' r=-2
  917. I/cat     (  488): <6>[    8.786834] init: Try to execute command 'chown' with params 'system' 'system' '/sys/class/graphics/fb0/overlays'.
  918. I/cat     (  488): <6>[    8.786956] init: command 'chown' r=0
  919. I/cat     (  488): <6>[    8.786987] init: Try to execute command 'chown' with params 'system' 'system' '/sys/class/graphics/fb0/fit_to_screen'.
  920. I/cat     (  488): <6>[    8.787109] init: command 'chown' r=-2
  921. I/cat     (  488): <6>[    8.787139] init: Try to execute command 'chown' with params 'system' 'system' '/sys/class/graphics/fb1/overlays'.
  922. I/cat     (  488): <6>[    8.787231] init: command 'chown' r=0
  923. I/cat     (  488): <6>[    8.787261] init: Try to execute command 'write' with params '/sys/devices/platform/nl5550.0/gps_nshutdown/value' '0'.
  924. I/cat     (  488): <6>[    8.787353] init: command 'write' r=0
  925. I/cat     (  488): <6>[    8.787414] init: Try to execute command 'setprop' with params 'tv.hdmi.uicloning.enable' 'true'.
  926. I/cat     (  488): <6>[    8.787445] init: command 'setprop' r=0
  927. I/cat     (  488): <6>[    8.787506] init: Try to execute command 'setprop' with params 'touch.deviceTypeOnHdmi' 'touchScreen'.
  928. I/cat     (  488): <6>[    8.787536] init: command 'setprop' r=0
  929. I/cat     (  488): <6>[    8.787567] init: Try to execute command 'setprop' with params 'touch.strictPositionOnHdmi' 'off'.
  930. I/cat     (  488): <6>[    8.787628] init: command 'setprop' r=0
  931. I/cat     (  488): <6>[    8.787658] init: Try to execute command 'chmod' with params '0444' '/system/usr/keychars/omap-keypad.kcm.bin'.
  932. I/cat     (  488): <6>[    8.789459] init: command 'chmod' r=-2
  933. I/cat     (  488): <6>[    8.789489] init: Try to execute command 'chmod' with params '0444' '/system/usr/keychars/qwerty.kcm.bin'.
  934. I/cat     (  488): <6>[    8.789550] init: command 'chmod' r=-2
  935. I/cat     (  488): <6>[    8.789581] init: processing action 0x41560 (fs)
  936. I/cat     (  488): <6>[    8.789611] init: Try to execute command 'mount' with params 'rawfs' '/dev/block/mmcblk0p1' '/mnt/rawfs'.
  937. I/cat     (  488): <6>[    8.789672] init: command 'mount' r=-1
  938. I/cat     (  488): <6>[    8.789733] init: Try to execute command 'mount_all' with params '/fstab.archosa80sboard'.
  939. I/cat     (  488): <6>[    8.791259] fs_mgr: Running /system/bin/e2fsck on /dev/block/mmcblk0p4
  940. I/cat     (  488): <6>[    8.918548] init: command 'mount_all' r=0
  941. I/cat     (  488): <6>[    8.918670] init: processing action 0x346e8 (post-fs)
  942. I/cat     (  488): <6>[    8.918762] init: Try to execute command 'chown' with params 'system' 'system' '/mnt/rawfs/params'.
  943. I/cat     (  488): <6>[    8.919952] init: command 'chown' r=0
  944. I/cat     (  488): <6>[    8.920196] init: command 'mount' r=0
  945. I/cat     (  488): <6>[    8.920288] init: command 'mount' r=0
  946. I/cat     (  488): <6>[    8.920379] init: Try to execute command 'chown' with params 'root' 'system' '/mnt/system'.
  947. I/cat     (  488): <6>[    8.920593] init: command 'chown' r=0
  948. I/cat     (  488): <6>[    8.920715] init: Try to execute command 'chmod' with params '0770' '/mnt/system'.
  949. I/cat     (  488): <6>[    8.920867] init: command 'chmod' r=0
  950. I/cat     (  488): <6>[    8.920989] init: Try to execute command 'chown' with params 'root' 'system' '/mnt/rawfs'.
  951. I/cat     (  488): <6>[    8.921112] init: command 'chown' r=0
  952. I/cat     (  488): <6>[    8.921234] init: Try to execute command 'chmod' with params '0770' '/mnt/rawfs'.
  953. I/cat     (  488): <6>[    8.921356] init: command 'chmod' r=0
  954. I/cat     (  488): <6>[    8.924743] init: command 'mkdir' r=0
  955. I/cat     (  488): <6>[    8.924835] init: Try to execute command 'chown' with params 'system' 'cache' '/data/cache'.
  956. I/cat     (  488): <6>[    8.924987] init: command 'chown' r=0
  957. I/cat     (  488): <6>[    8.925109] init: Try to execute command 'chmod' with params '0771' '/data/cache'.
  958. I/cat     (  488): <6>[    8.925262] init: command 'chmod' r=0
  959. I/cat     (  488): <6>[    8.925384] init: Try to execute command 'chown' with params 'system' 'cache' '/cache/recovery'.
  960. I/cat     (  488): <6>[    8.925628] init: command 'chown' r=-2
  961. I/cat     (  488): <6>[    8.925750] init: Try to execute command 'chmod' with params '0770' '/cache/recovery'.
  962. I/cat     (  488): <6>[    8.925903] init: command 'chmod' r=-2
  963. I/cat     (  488): <6>[    8.926025] init: Try to execute command 'chown' with params 'root' 'log' '/proc/vmallocinfo'.
  964. I/cat     (  488): <6>[    8.926208] init: command 'chown' r=0
  965. I/cat     (  488): <6>[    8.926330] init: Try to execute command 'chmod' with params '0440' '/proc/vmallocinfo'.
  966. I/cat     (  488): <6>[    8.926513] init: command 'chmod' r=0
  967. I/cat     (  488): <6>[    8.926635] init: Try to execute command 'chown' with params 'root' 'system' '/proc/kmsg'.
  968. I/cat     (  488): <6>[    8.926818] init: command 'chown' r=0
  969. I/cat     (  488): <6>[    8.926940] init: Try to execute command 'chmod' with params '0440' '/proc/kmsg'.
  970. I/cat     (  488): <6>[    8.927093] init: command 'chmod' r=0
  971. I/cat     (  488): <6>[    8.927215] init: Try to execute command 'chown' with params 'root' 'system' '/proc/sysrq-trigger'.
  972. I/cat     (  488): <6>[    8.927398] init: command 'chown' r=0
  973. I/cat     (  488): <6>[    8.927520] init: Try to execute command 'chmod' with params '0220' '/proc/sysrq-trigger'.
  974. I/cat     (  488): <6>[    8.927673] init: command 'chmod' r=0
  975. I/cat     (  488): <6>[    8.928192] init: command 'mkdir' r=0
  976. I/cat     (  488): <6>[    8.928283] init: processing action 0x34a30 (post-fs-data)
  977. I/cat     (  488): <6>[    8.928375] init: Try to execute command 'chown' with params 'system' 'system' '/data'.
  978. I/cat     (  488): <6>[    8.928527] init: command 'chown' r=0
  979. I/cat     (  488): <6>[    8.928649] init: Try to execute command 'chmod' with params '0771' '/data'.
  980. I/cat     (  488): <6>[    8.928802] init: command 'chmod' r=0
  981. I/cat     (  488): <6>[    8.928924] init: Try to execute command 'mkdir' with params '/data/media'.
  982. I/cat     (  488): <6>[    8.929077] init: command 'mkdir' r=0
  983. I/cat     (  488): <6>[    8.929199] init: Try to execute command 'chown' with params 'media_rw' 'media_rw' '/data/media'.
  984. I/cat     (  488): <6>[    8.929382] init: command 'chown' r=0
  985. I/cat     (  488): <6>[    8.929504] init: Try to execute command 'chmod' with params '770' '/data/media'.
  986. I/cat     (  488): <6>[    8.929626] init: command 'chmod' r=0
  987. I/cat     (  488): <6>[    8.930114] init: command 'mkdir' r=0
  988. I/cat     (  488): <6>[    8.930206] init: Try to execute command 'chown' with params 'system' 'sdcard_rw' '/data/nand'.
  989. I/cat     (  488): <6>[    8.930358] init: command 'chown' r=0
  990. I/cat     (  488): <6>[    8.930480] init: Try to execute command 'chmod' with params '775' '/data/nand'.
  991. I/cat     (  488): <6>[    8.930755] init: command 'chmod' r=0
  992. I/cat     (  488): <6>[    8.931213] init: command 'mkdir' r=0
  993. I/cat     (  488): <6>[    8.931304] init: Try to execute command 'copy' with params '/proc/apanic_console' '/data/dontpanic/apanic_console'.
  994. I/cat     (  488): <6>[    8.931457] init: command 'copy' r=-1
  995. I/cat     (  488): <6>[    8.931579] init: Try to execute command 'chown' with params 'root' 'log' '/data/dontpanic/apanic_console'.
  996. I/cat     (  488): <6>[    8.931732] init: command 'chown' r=-2
  997. I/cat     (  488): <6>[    8.931854] init: Try to execute command 'chmod' with params '0640' '/data/dontpanic/apanic_console'.
  998. I/cat     (  488): <6>[    8.931945] init: command 'chmod' r=-2
  999. I/cat     (  488): <6>[    8.932067] init: Try to execute command 'copy' with params '/proc/apanic_threads' '/data/dontpanic/apanic_threads'.
  1000. I/cat     (  488): <6>[    8.932189] init: command 'copy' r=-1
  1001. I/cat     (  488): <6>[    8.932312] init: Try to execute command 'chown' with params 'root' 'log' '/data/dontpanic/apanic_threads'.
  1002. I/cat     (  488): <6>[    8.932464] init: command 'chown' r=-2
  1003. I/cat     (  488): <6>[    8.932586] init: Try to execute command 'chmod' with params '0640' '/data/dontpanic/apanic_threads'.
  1004. I/cat     (  488): <6>[    8.932708] init: command 'chmod' r=-2
  1005. I/cat     (  488): <6>[    8.932830] init: Try to execute command 'write' with params '/proc/apanic_console' '1'.
  1006. I/cat     (  488): <6>[    8.932952] init: command 'write' r=-2
  1007. I/cat     (  488): <6>[    8.933410] init: command 'mkdir' r=0
  1008. I/cat     (  488): <6>[    8.933502] init: Try to execute command 'chown' with params 'system' 'system' '/data/dalvik-cache'.
  1009. I/cat     (  488): <6>[    8.933654] init: command 'chown' r=0
  1010. I/cat     (  488): <6>[    8.933776] init: Try to execute command 'chmod' with params '0771' '/data/dalvik-cache'.
  1011. I/cat     (  488): <6>[    8.933929] init: command 'chmod' r=0
  1012. I/cat     (  488): <6>[    8.934356] init: command 'mkdir' r=0
  1013. I/cat     (  488): <6>[    8.934448] init: Try to execute command 'chown' with params 'system' 'system' '/data/cache/dalvik-cache'.
  1014. I/cat     (  488): <6>[    8.934600] init: command 'chown' r=0
  1015. I/cat     (  488): <6>[    8.934722] init: Try to execute command 'chmod' with params '0771' '/data/cache/dalvik-cache'.
  1016. I/cat     (  488): <6>[    8.934875] init: command 'chmod' r=0
  1017. I/cat     (  488): <6>[    8.935333] init: command 'mkdir' r=0
  1018. I/cat     (  488): <6>[    8.935424] init: Try to execute command 'chown' with params 'system' 'system' '/data/resource-cache'.
  1019. I/cat     (  488): <6>[    8.935577] init: command 'chown' r=0
  1020. I/cat     (  488): <6>[    8.935699] init: Try to execute command 'chmod' with params '0771' '/data/resource-cache'.
  1021. I/cat     (  488): <6>[    8.935852] init: command 'chmod' r=0
  1022. I/cat     (  488): <6>[    8.936309] init: command 'mkdir' r=0
  1023. I/cat     (  488): <6>[    8.936737] init: command 'mkdir' r=0
  1024. I/cat     (  488): <6>[    8.937133] init: command 'mkdir' r=0
  1025. I/cat     (  488): <6>[    8.937561] init: command 'mkdir' r=0
  1026. I/cat     (  488): <6>[    8.937957] init: command 'mkdir' r=0
  1027. I/cat     (  488): <6>[    8.938537] init: command 'mkdir' r=0
  1028. I/cat     (  488): <6>[    8.939056] init: command 'mkdir' r=0
  1029. I/cat     (  488): <6>[    8.939483] init: command 'mkdir' r=0
  1030. I/cat     (  488): <6>[    8.939880] init: command 'mkdir' r=0
  1031. I/cat     (  488): <6>[    8.940307] init: command 'mkdir' r=0
  1032. I/cat     (  488): <6>[    8.940399] init: Try to execute command 'chmod' with params '0660' '/data/misc/wifi/wpa_supplicant.conf'.
  1033. I/cat     (  488): <6>[    8.940551] init: command 'chmod' r=-2
  1034. I/cat     (  488): <6>[    8.941040] init: command 'mkdir' r=0
  1035. I/cat     (  488): <6>[    8.941284] init: command 'mkdir' r=0
  1036. I/cat     (  488): <6>[    8.941558] init: command 'mkdir' r=0
  1037. I/cat     (  488): <6>[    8.944671] init: command 'mkdir' r=0
  1038. I/cat     (  488): <6>[    8.945098] init: command 'mkdir' r=0
  1039. I/cat     (  488): <6>[    8.945495] init: command 'mkdir' r=0
  1040. I/cat     (  488): <6>[    8.945922] init: command 'mkdir' r=0
  1041. I/cat     (  488): <6>[    8.947174] init: command 'mkdir' r=0
  1042. I/cat     (  488): <6>[    8.947601] init: command 'mkdir' r=0
  1043. I/cat     (  488): <6>[    8.948028] init: command 'mkdir' r=0
  1044. I/cat     (  488): <6>[    8.948455] init: command 'mkdir' r=0
  1045. I/cat     (  488): <6>[    8.948883] init: command 'mkdir' r=0
  1046. I/cat     (  488): <6>[    8.949371] init: command 'mkdir' r=0
  1047. I/cat     (  488): <6>[    8.949462] init: Try to execute command 'chown' with params 'system' 'system' '/data/misc/smb/fusesmb.conf'.
  1048. I/cat     (  488): <6>[    8.949615] init: command 'chown' r=-2
  1049. I/cat     (  488): <6>[    8.949737] init: Try to execute command 'chmod' with params '666' '/data/misc/smb/fusesmb.conf'.
  1050. I/cat     (  488): <6>[    8.949859] init: command 'chmod' r=-2
  1051. I/cat     (  488): <6>[    8.949981] init: Try to execute command 'chown' with params 'system' 'cache' '/data/cache'.
  1052. I/cat     (  488): <6>[    8.950134] init: command 'chown' r=0
  1053. I/cat     (  488): <6>[    8.950256] init: Try to execute command 'chmod' with params '0771' '/data/cache'.
  1054. I/cat     (  488): <6>[    8.950408] init: command 'chmod' r=0
  1055. I/cat     (  488): <6>[    8.950653] init: command 'mkdir' r=0
  1056. I/cat     (  488): <6>[    8.950744] init: Try to execute command 'chown' with params 'system' 'system' '/data/resource-cache'.
  1057. I/cat     (  488): <6>[    8.950897] init: command 'chown' r=0
  1058. I/cat     (  488): <6>[    8.951019] init: Try to execute command 'chmod' with params '0771' '/data/resource-cache'.
  1059. I/cat     (  488): <6>[    8.951171] init: command 'chmod' r=0
  1060. I/cat     (  488): <6>[    8.951599] init: command 'mkdir' r=0
  1061. I/cat     (  488): <6>[    8.952026] init: command 'mkdir' r=0
  1062. I/cat     (  488): <6>[    8.952117] init: Try to execute command 'copy' with params '/system/etc/wifi/softap/hostapd.conf' '/data/misc/wifi/hostapd.conf'.
  1063. I/cat     (  488): <6>[    8.953765] init: command 'copy' r=-1
  1064. I/cat     (  488): <6>[    8.953887] init: Try to execute command 'chown' with params 'system' 'system' '/sys/class/android_usb/android0/f_mass_storage/lun/file'.
  1065. I/cat     (  488): <6>[    8.954498] init: command 'chown' r=0
  1066. I/cat     (  488): <6>[    8.954620] init: Try to execute command 'chmod' with params '0660' '/sys/class/android_usb/android0/f_mass_storage/lun/file'.
  1067. I/cat     (  488): <6>[    8.955017] init: command 'chmod' r=0
  1068. I/cat     (  488): <6>[    8.955139] init: Try to execute command 'chown' with params 'system' 'system' '/sys/class/android_usb/android0/f_rndis/ethaddr'.
  1069. I/cat     (  488): <6>[    8.955444] init: command 'chown' r=0
  1070. I/cat     (  488): <6>[    8.955566] init: Try to execute command 'chmod' with params '0660' '/sys/class/android_usb/android0/f_rndis/ethaddr'.
  1071. I/cat     (  488): <6>[    8.955810] init: command 'chmod' r=0
  1072. I/cat     (  488): <6>[    8.955932] init: Try to execute command 'insmod' with params '/lib/modules/fuse.ko'.
  1073. I/cat     (  488): <6>[    8.956085] init: command 'insmod' r=-1
  1074. I/cat     (  488): <6>[    8.956207] init: Try to execute command 'class_start' with params 'late_start'.
  1075. I/cat     (  488): <5>[    8.956420] init: starting 'sdcard'
  1076. I/cat     (  488): <6>[    8.957183] init: command 'class_start' r=0
  1077. I/cat     (  488): <6>[    8.957336] init: processing action 0x3c828 (post-fs-data)
  1078. I/cat     (  488): <3>[    8.957519] init: No dynamic_args: Try to execve('/system/bin/sdcard'): args: Uý
  1079. I/cat     (  488): <6>[    8.958099] init: command 'mkdir' r=0
  1080. I/cat     (  488): <6>[    8.958343] init: command 'mkdir' r=0
  1081. I/cat     (  488): <6>[    8.958618] init: processing action 0x3ec80 (post-fs-data)
  1082. I/cat     (  488): <6>[    8.958709] init: Try to execute command 'insmod' with params '/system/lib/modules/usb_wwan.ko'.
  1083. I/cat     (  488): <6>[    8.969085] init: command 'insmod' r=0
  1084. I/cat     (  488): <6>[    8.969238] init: Try to execute command 'insmod' with params '/system/lib/modules/option.ko'.
  1085. I/cat     (  488): <6>[    8.982025] USB Serial support registered for GSM modem (1-port)
  1086. I/cat     (  488): <6>[    8.982543] usbcore: registered new interface driver option
  1087. I/cat     (  488): <6>[    8.982604] option: v0.7.2:USB Driver for GSM modems
  1088. I/cat     (  488): <6>[    8.982727] init: command 'insmod' r=0
  1089. I/cat     (  488): <6>[    8.982818] init: Try to execute command 'insmod' with params '/system/lib/modules/hso.ko'.
  1090. E/powerd  (  486): err: open(/sys/devices/platform/jm20329/timeout): (2) - No such file or directory
  1091. I/cat     (  488): <6>[    8.995605] hso: /storage/media/Downloads/Android/cyanogen_mod_bundle10.1_linaro/cm-10.1/kernel/archos/archos_g9/drivers/net/usb/hso.c: Option Wireless
  1092. I/cat     (  488): <6>[    8.996093] usbcore: registered new interface driver hso
  1093. I/cat     (  488): <6>[    8.996215] init: command 'insmod' r=0
  1094. I/cat     (  488): <6>[    8.996307] init: processing action 0x428e0 (property_service_init)
  1095. I/cat     (  488): <6>[    8.996398] init: Try to execute command 'property_service_init'.
  1096. I/cat     (  488): <6>[    9.007476] init: Created socket '/dev/socket/property_service' with mode '666', user '0', group '0'
  1097. I/cat     (  488): <6>[    9.007629] init: command 'property_service_init' r=0
  1098. I/cat     (  488): <6>[    9.007751] init: processing action 0x42928 (signal_init)
  1099. I/cat     (  488): <6>[    9.007812] init: Try to execute command 'signal_init'.
  1100. I/cat     (  488): <6>[    9.008026] init: waitpid returned pid 208, status = 00000009
  1101. I/cat     (  488): <3>[    9.008148] init: untracked pid 208 exited
  1102. I/cat     (  488): <6>[    9.008209] init: command 'signal_init' r=0
  1103. I/cat     (  488): <6>[    9.008331] init: processing action 0x42970 (check_startup)
  1104. I/cat     (  488): <6>[    9.008392] init: Try to execute command 'check_startup'.
  1105. I/cat     (  488): <6>[    9.008544] init: command 'check_startup' r=0
  1106. I/cat     (  488): <6>[    9.008666] init: processing action 0x3c8b8 (early-boot)
  1107. I/cat     (  488): <6>[    9.009307] init: command 'mkdir' r=0
  1108. I/cat     (  488): <6>[    9.009735] init: command 'mkdir' r=0
  1109. I/cat     (  488): <6>[    9.009826] init: Try to execute command 'insmod' with params '/system/lib/modules/compat.ko'.
  1110. I/cat     (  488): <6>[    9.089935] Compat-drivers backport release: compat-wireless-v3.6.8-1
  1111. I/cat     (  488): <6>[    9.090057] Backport based on linux-stable.git v3.6.8
  1112. I/cat     (  488): <6>[    9.090118] compat.git: linux-stable.git
  1113. I/cat     (  488): <6>[    9.091430] init: command 'insmod' r=0
  1114. I/cat     (  488): <6>[    9.091552] init: Try to execute command 'insmod' with params '/system/lib/modules/cfg80211.ko'.
  1115. I/cat     (  488): <6>[    9.306945] cfg80211: Calling CRDA to update world regulatory domain
  1116. I/AKMD2   (  491): AK8975/B for Android v20110331 (Library: v1.2.3.114) started.
  1117. I/AKMD2   (  491): Debug: OFF
  1118. I/AKMD2   (  491): Debug level: 0
  1119. I/AKMD2   (  491): Output to: LOGD
  1120. I/cat     (  488): <6>[    9.308105] init: command 'insmod' r=0
  1121. I/cat     (  488): <6>[    9.308135] init: Try to execute command 'insmod' with params '/system/lib/modules/mac80211.ko'.
  1122. I/cat     (  488): <6>[    9.752044] init: command 'insmod' r=0
  1123. I/cat     (  488): <6>[    9.752105] init: Try to execute command 'insmod' with params '/system/lib/modules/wlcore.ko' 'debug_level=0x63c00'.
  1124. I/cat     (  488): <6>[    9.903869] init: command 'insmod' r=0
  1125. I/cat     (  488): <6>[    9.903930] init: Try to execute command 'insmod' with params '/system/lib/modules/wl12xx.ko'.
  1126. I/cat     (  488): <6>[    9.945922] init: command 'insmod' r=0
  1127. I/cat     (  488): <6>[    9.946105] init: Try to execute command 'insmod' with params '/system/lib/modules/compat.ko'.
  1128. I/cat     (  488): <6>[   10.002838] init: command 'insmod' r=-1
  1129. I/cat     (  488): <6>[   10.003021] init: Try to execute command 'insmod' with params '/system/lib/modules/bluetooth/bluetooth.ko'.
  1130. I/cat     (  488): <6>[   10.220153] Bluetooth: Core ver 2.16
  1131. I/cat     (  488): <6>[   10.220275] NET: Registered protocol family 31
  1132. I/cat     (  488): <6>[   10.220306] Bluetooth: HCI device and connection manager initialized
  1133. I/DEBUG   (  496): debuggerd: Apr 11 2013 22:30:55
  1134. I/cat     (  488): <6>[   10.220367] Bluetooth: HCI socket layer initialized
  1135. I/cat     (  488): <6>[   10.220367] Bluetooth: L2CAP socket layer initialized
  1136. I/cat     (  488): <6>[   10.220428] Bluetooth: SCO socket layer initialized
  1137. I/cat     (  488): <6>[   10.221313] init: command 'insmod' r=0
  1138. I/cat     (  488): <6>[   10.221374] init: Try to execute command 'insmod' with params '/system/lib/modules/bluetooth/rfcomm.ko'.
  1139. I/cat     (  488): <6>[   10.258850] Bluetooth: RFCOMM TTY layer initialized
  1140. I/cat     (  488): <6>[   10.259094] Bluetooth: RFCOMM socket layer initialized
  1141. I/cat     (  488): <6>[   10.259155] Bluetooth: RFCOMM ver 1.11
  1142. I/cat     (  488): <6>[   10.259948] init: command 'insmod' r=0
  1143. I/cat     (  488): <6>[   10.260040] init: Try to execute command 'insmod' with params '/system/lib/modules/bluetooth/hidp.ko'.
  1144. I/cat     (  488): <6>[   10.302429] Bluetooth: HIDP (Human Interface Emulation) ver 1.2
  1145. I/cat     (  488): <6>[   10.302612] Bluetooth: HIDP socket layer initialized
  1146. I/cat     (  488): <6>[   10.303192] init: command 'insmod' r=0
  1147. I/cat     (  488): <6>[   10.303283] init: Try to execute command 'insmod' with params '/system/lib/modules/bluetooth/hci_uart.ko'.
  1148. I/cat     (  488): <6>[   10.356842] Bluetooth: HCI UART driver ver 2.2
  1149. I/cat     (  488): <6>[   10.356964] Bluetooth: HCI H4 protocol initialized
  1150. I/cat     (  488): <6>[   10.357025] Bluetooth: HCI BCSP protocol initialized
  1151. I/cat     (  488): <6>[   10.357086] Bluetooth: HCILL protocol initialized
  1152. I/cat     (  488): <6>[   10.357147] Bluetooth: HCIATH3K protocol initialized
  1153. I/cat     (  488): <6>[   10.357208] Bluetooth: HCI Three-wire UART (H5) protocol initialized
  1154. I/cat     (  488): <6>[   10.358123] init: command 'insmod' r=0
  1155. I/cat     (  488): <6>[   10.358245] init: Try to execute command 'insmod' with params '/system/lib/modules/bluetooth/bnep.ko'.
  1156. I/cat     (  488): <6>[   10.388580] Bluetooth: BNEP (Ethernet Emulation) ver 1.3
  1157. I/cat     (  488): <6>[   10.388702] Bluetooth: BNEP filters: protocol multicast
  1158. I/cat     (  488): <6>[   10.388824] Bluetooth: BNEP socket layer initialized
  1159. I/cat     (  488): <6>[   10.389434] init: command 'insmod' r=0
  1160. I/cat     (  488): <6>[   10.389556] init: Try to execute command 'insmod' with params '/system/lib/modules/tty_hci.ko'.
  1161. I/cat     (  488): <6>[   10.393341] (hci_tty): inside hci_tty_init
  1162. I/cat     (  488): <6>[   10.394287] (hci_tty): allocated 245, 0
  1163. I/cat     (  488): <6>[   10.394378] init: command 'insmod' r=0
  1164. I/cat     (  488): <6>[   10.394531] init: processing action 0x41328 (early-boot)
  1165. I/cat     (  488): <6>[   10.394592] init: Try to execute command 'write' with params '/sys/class/android_usb/android0/iManufacturer' '$ro.product.manufacturer'.
  1166. I/cat     (  488): <3>[   10.394744] init: using deprecated syntax for specifying property 'ro.product.manufacturer', use ${name} instead
  1167. I/cat     (  488): <6>[   10.395080] init: command 'write' r=0
  1168. I/cat     (  488): <6>[   10.395172] init: Try to execute command 'write' with params '/sys/class/android_usb/android0/iProduct' '$ro.product.model'.
  1169. I/cat     (  488): <3>[   10.395263] init: using deprecated syntax for specifying property 'ro.product.model', use ${name} instead
  1170. I/cat     (  488): <6>[   10.395538] init: command 'write' r=0
  1171. I/cat     (  488): <6>[   10.395629] init: Try to execute command 'write' with params '/sys/class/android_usb/android0/iSerial' '$ro.serialno'.
  1172. I/cat     (  488): <3>[   10.395721] init: using deprecated syntax for specifying property 'ro.serialno', use ${name} instead
  1173. I/cat     (  488): <6>[   10.395996] init: command 'write' r=0
  1174. I/cat     (  488): <6>[   10.396087] init: Try to execute command 'write' with params '/sys/class/android_usb/android0/idVendor' '0E79'.
  1175. I/cat     (  488): <6>[   10.396331] init: command 'write' r=0
  1176. I/cat     (  488): <6>[   10.396484] init: Try to execute command 'write' with params '/sys/class/android_usb/android0/idProduct' '1500'.
  1177. I/cat     (  488): <6>[   10.396728] init: command 'write' r=0
  1178. I/cat     (  488): <6>[   10.396850] init: Try to execute command 'write' with params '/sys/class/android_usb/android0/f_rndis/wceis' '1'.
  1179. I/cat     (  488): <6>[   10.397186] init: command 'write' r=0
  1180. I/cat     (  488): <6>[   10.397308] init: Try to execute command 'write' with params '/sys/class/android_usb/f_mass_storage/inquiry_string' 'Archos A80     0100'.
  1181. I/cat     (  488): <6>[   10.397613] init: command 'write' r=0
  1182. I/cat     (  488): <6>[   10.397735] init: Try to execute command 'chown' with params 'root' 'system' '/sys/devices/platform/omap/omap_i2c.4/i2c-4/4-0024/calibration_trigger'.
  1183. I/cat     (  488): <6>[   10.398071] init: command 'chown' r=0
  1184. I/cat     (  488): <6>[   10.398193] init: Try to execute command 'chown' with params 'root' 'system' '/sys/devices/platform/omap/omap_i2c.4/i2c-4/4-005c/calibration_trigger'.
  1185. I/cat     (  488): <6>[   10.398498] init: command 'chown' r=-2
  1186. I/cat     (  488): <6>[   10.398620] init: Try to execute command 'chown' with params 'root' 'radio' '/sys/bus/usb/devices/usb1/power/control'.
  1187. I/cat     (  488): <6>[   10.399047] init: command 'chown' r=0
  1188. I/cat     (  488): <6>[   10.399200] init: Try to execute command 'chmod' with params '664' '/sys/devices/platform/omap/omap_i2c.4/i2c-4/4-0024/calibration_trigger'.
  1189. I/cat     (  488): <6>[   10.399505] init: command 'chmod' r=0
  1190. I/cat     (  488): <6>[   10.399627] init: Try to execute command 'chmod' with params '664' '/sys/devices/platform/omap/omap_i2c.4/i2c-4/4-005c/calibration_trigger'.
  1191. I/cat     (  488): <6>[   10.399902] init: command 'chmod' r=-2
  1192. I/cat     (  488): <6>[   10.400054] init: Try to execute command 'chmod' with params '664' '/sys/bus/usb/devices/usb1/power/control'.
  1193. I/cat     (  488): <6>[   10.400329] init: command 'chmod' r=0
  1194. I/cat     (  488): <6>[   10.400451] init: processing action 0x35568 (boot)
  1195. I/cat     (  488): <6>[   10.400512] init: Try to execute command 'ifup' with params 'lo'.
  1196. I/cat     (  488): <6>[   10.401489] init: command 'ifup' r=0
  1197. I/cat     (  488): <6>[   10.401641] init: Try to execute command 'hostname' with params 'localhost'.
  1198. I/cat     (  488): <6>[   10.401855] init: command 'hostname' r=0
  1199. I/cat     (  488): <6>[   10.401977] init: Try to execute command 'domainname' with params 'localdomain'.
  1200. I/cat     (  488): <6>[   10.402160] init: command 'domainname' r=0
  1201. I/cat     (  488): <6>[   10.402313] init: Try to execute command 'setrlimit' with params '13' '40' '40'.
  1202. I/cat     (  488): <6>[   10.402404] init: command 'setrlimit' r=0
  1203. I/cat     (  488): <6>[   10.402526] init: Try to execute command 'write' with params '/proc/sys/vm/overcommit_memory' '1'.
  1204. I/cat     (  488): <6>[   10.402679] init: command 'write' r=0
  1205. I/cat     (  488): <6>[   10.402801] init: Try to execute command 'write' with params '/proc/sys/vm/min_free_order_shift' '4'.
  1206. I/cat     (  488): <6>[   10.402984] init: command 'write' r=0
  1207. I/cat     (  488): <6>[   10.403106] init: Try to execute command 'chown' with params 'root' 'system' '/sys/module/lowmemorykiller/parameters/adj'.
  1208. I/cat     (  488): <6>[   10.403381] init: command 'chown' r=0
  1209. I/cat     (  488): <6>[   10.403533] init: Try to execute command 'chmod' with params '0664' '/sys/module/lowmemorykiller/parameters/adj'.
  1210. I/cat     (  488): <6>[   10.403717] init: command 'chmod' r=0
  1211. I/cat     (  488): <6>[   10.403839] init: Try to execute command 'chown' with params 'root' 'system' '/sys/module/lowmemorykiller/parameters/minfree'.
  1212. I/cat     (  488): <6>[   10.404083] init: command 'chown' r=0
  1213. I/cat     (  488): <6>[   10.404205] init: Try to execute command 'chmod' with params '0664' '/sys/module/lowmemorykiller/parameters/minfree'.
  1214. I/cat     (  488): <6>[   10.404388] init: command 'chmod' r=0
  1215. I/cat     (  488): <6>[   10.404510] init: Try to execute command 'setprop' with params 'persist.archos.suspend' 'enabled'.
  1216. I/cat     (  488): <6>[   10.405181] init: command 'setprop' r=0
  1217. I/cat     (  488): <6>[   10.405334] init: Try to execute command 'setprop' with params 'windowsmgr.max_events_per_sec' '65'.
  1218. I/cat     (  488): <6>[   10.405456] init: command 'setprop' r=0
  1219. I/cat     (  488): <6>[   10.405578] init: Try to execute command 'copy' with params '/system/usr/inc' '/tmp/inc'.
  1220. I/cat     (  488): <6>[   10.405731] init: command 'copy' r=-1
  1221. I/cat     (  488): <6>[   10.405853] init: Try to execute command 'chmod' with params '777' '/tmp/inc'.
  1222. I/cat     (  488): <6>[   10.406005] init: command 'chmod' r=-2
  1223. I/cat     (  488): <6>[   10.406127] init: Try to execute command 'exec' with params '/tmp/inc'.
  1224. I/cat     (  488): <6>[   10.406768] init: Getting for pid '480' after fork() system call when exec the command '/tmp/inc'.
  1225. I/cat     (  488): <6>[   10.406921] init: Waiting for finish the executed command '/tmp/inc'.
  1226. I/cat     (  488): <6>[   10.407043] init: Getting for pid '0' after fork() system call when exec the command '/tmp/inc'.
  1227. I/cat     (  488): <6>[   10.407287] init: Ready to go to exec the command '/tmp/inc'.
  1228. I/cat     (  488): <6>[   10.407989] init: Command '/tmp/inc' finished.
  1229. I/cat     (  488): <6>[   10.408111] init: command 'exec' r=0
  1230. I/cat     (  488): <6>[   10.408294] init: Try to execute command 'write' with params '/proc/sys/vm/dirty_expire_centisecs' '200'.
  1231. I/cat     (  488): <6>[   10.408477] init: command 'write' r=0
  1232. I/cat     (  488): <6>[   10.408599] init: Try to execute command 'write' with params '/proc/sys/vm/dirty_background_ratio' '5'.
  1233. I/cat     (  488): <6>[   10.408782] init: command 'write' r=0
  1234. I/cat     (  488): <6>[   10.408905] init: Try to execute command 'chown' with params 'radio' 'system' '/sys/android_power/state'.
  1235. I/cat     (  488): <6>[   10.409088] init: command 'chown' r=-2
  1236. I/cat     (  488): <6>[   10.409210] init: Try to execute command 'chown' with params 'radio' 'system' '/sys/android_power/request_state'.
  1237. I/cat     (  488): <6>[   10.409362] init: command 'chown' r=-2
  1238. I/cat     (  488): <6>[   10.409484] init: Try to execute command 'chown' with params 'radio' 'system' '/sys/android_power/acquire_full_wake_lock'.
  1239. I/cat     (  488): <6>[   10.409637] init: command 'chown' r=-2
  1240. I/cat     (  488): <6>[   10.409759] init: Try to execute command 'chown' with params 'radio' 'system' '/sys/android_power/acquire_partial_wake_lock'.
  1241. I/cat     (  488): <6>[   10.409912] init: command 'chown' r=-2
  1242. I/cat     (  488): <6>[   10.410034] init: Try to execute command 'chown' with params 'radio' 'system' '/sys/android_power/release_wake_lock'.
  1243. I/cat     (  488): <6>[   10.410186] init: command 'chown' r=-2
  1244. I/cat     (  488): <6>[   10.410308] init: Try to execute command 'chown' with params 'radio' 'system' '/sys/power/state'.
  1245. I/cat     (  488): <6>[   10.410522] init: command 'chown' r=0
  1246. I/cat     (  488): <6>[   10.410644] init: Try to execute command 'chown' with params 'radio' 'system' '/sys/power/wake_lock'.
  1247. I/cat     (  488): <6>[   10.410827] init: command 'chown' r=0
  1248. I/cat     (  488): <6>[   10.410949] init: Try to execute command 'chown' with params 'radio' 'system' '/sys/power/wake_unlock'.
  1249. I/cat     (  488): <6>[   10.411132] init: command 'chown' r=0
  1250. I/cat     (  488): <6>[   10.411254] init: Try to execute command 'chmod' with params '0660' '/sys/power/state'.
  1251. I/cat     (  488): <6>[   10.411407] init: command 'chmod' r=0
  1252. I/cat     (  488): <6>[   10.411529] init: Try to execute command 'chmod' with params '0660' '/sys/power/wake_lock'.
  1253. I/cat     (  488): <6>[   10.411682] init: command 'chmod' r=0
  1254. I/cat     (  488): <6>[   10.411804] init: Try to execute command 'chmod' with params '0660' '/sys/power/wake_unlock'.
  1255. I/cat     (  488): <6>[   10.411956] init: command 'chmod' r=0
  1256. I/cat     (  488): <6>[   10.412078] init: Try to execute command 'chown' with params 'system' 'system' '/sys/devices/system/cpu/cpufreq/interactive/timer_rate'.
  1257. I/cat     (  488): <6>[   10.412322] init: command 'chown' r=0
  1258. I/cat     (  488): <6>[   10.412445] init: Try to execute command 'chmod' with params '0660' '/sys/devices/system/cpu/cpufreq/interactive/timer_rate'.
  1259. I/cat     (  488): <6>[   10.412628] init: command 'chmod' r=0
  1260. I/cat     (  488): <6>[   10.412750] init: Try to execute command 'chown' with params 'system' 'system' '/sys/devices/system/cpu/cpufreq/interactive/min_sample_time'.
  1261. I/cat     (  488): <6>[   10.412994] init: command 'chown' r=0
  1262. I/cat     (  488): <6>[   10.413116] init: Try to execute command 'chmod' with params '0660' '/sys/devices/system/cpu/cpufreq/interactive/min_sample_time'.
  1263. I/cat     (  488): <6>[   10.413360] init: command 'chmod' r=0
  1264. I/cat     (  488): <6>[   10.413482] init: Try to execute command 'chown' with params 'system' 'system' '/sys/devices/system/cpu/cpufreq/interactive/hispeed_freq'.
  1265. I/cat     (  488): <6>[   10.413757] init: command 'chown' r=0
  1266. I/cat     (  488): <6>[   10.413879] init: Try to execute command 'chmod' with params '0660' '/sys/devices/system/cpu/cpufreq/interactive/hispeed_freq'.
  1267. I/cat     (  488): <6>[   10.414093] init: command 'chmod' r=0
  1268. I/cat     (  488): <6>[   10.414245] init: Try to execute command 'chown' with params 'system' 'system' '/sys/devices/system/cpu/cpufreq/interactive/go_hispeed_load'.
  1269. I/cat     (  488): <6>[   10.414489] init: command 'chown' r=0
  1270. I/cat     (  488): <6>[   10.414611] init: Try to execute command 'chmod' with params '0660' '/sys/devices/system/cpu/cpufreq/interactive/go_hispeed_load'.
  1271. I/cat     (  488): <6>[   10.414825] init: command 'chmod' r=0
  1272. I/cat     (  488): <6>[   10.415008] init: Try to execute command 'chown' with params 'system' 'system' '/sys/devices/system/cpu/cpufreq/interactive/above_hispeed_delay'.
  1273. I/cat     (  488): <6>[   10.415283] init: command 'chown' r=-2
  1274. I/cat     (  488): <6>[   10.415405] init: Try to execute command 'chmod' with params '0660' '/sys/devices/system/cpu/cpufreq/interactive/above_hispeed_delay'.
  1275. I/cat     (  488): <6>[   10.415649] init: command 'chmod' r=-2
  1276. I/cat     (  488): <6>[   10.415771] init: Try to execute command 'chown' with params 'system' 'system' '/sys/devices/system/cpu/cpufreq/interactive/boost'.
  1277. I/cat     (  488): <6>[   10.416015] init: command 'chown' r=-2
  1278. I/cat     (  488): <6>[   10.416168] init: Try to execute command 'chmod' with params '0660' '/sys/devices/system/cpu/cpufreq/interactive/boost'.
  1279. I/cat     (  488): <6>[   10.416351] init: command 'chmod' r=-2
  1280. I/cat     (  488): <6>[   10.416503] init: Try to execute command 'chown' with params 'system' 'system' '/sys/devices/system/cpu/cpufreq/interactive/boostpulse'.
  1281. I/cat     (  488): <6>[   10.416748] init: command 'chown' r=-2
  1282. I/cat     (  488): <6>[   10.416870] init: Try to execute command 'chown' with params 'system' 'system' '/sys/devices/system/cpu/cpufreq/interactive/input_boost'.
  1283. I/cat     (  488): <6>[   10.417114] init: command 'chown' r=-2
  1284. I/cat     (  488): <6>[   10.417236] init: Try to execute command 'chmod' with params '0660' '/sys/devices/system/cpu/cpufreq/interactive/input_boost'.
  1285. I/cat     (  488): <6>[   10.417480] init: command 'chmod' r=-2
  1286. I/cat     (  488): <6>[   10.417633] init: Try to execute command 'chown' with params 'system' 'system' '/sys/devices/system/cpu/cpufreq/interactive/boostpulse_duration'.
  1287. I/cat     (  488): <6>[   10.417877] init: command 'chown' r=-2
  1288. I/cat     (  488): <6>[   10.417999] init: Try to execute command 'chmod' with params '0660' '/sys/devices/system/cpu/cpufreq/interactive/boostpulse_duration'.
  1289. I/cat     (  488): <6>[   10.418243] init: command 'chmod' r=-2
  1290. I/cat     (  488): <6>[   10.418365] init: Try to execute command 'chown' with params 'system' 'system' '/sys/devices/system/cpu/cpu0/cpufreq/scaling_governor'.
  1291. I/cat     (  488): <6>[   10.418609] init: command 'chown' r=0
  1292. I/cat     (  488): <6>[   10.418731] init: Try to execute command 'chmod' with params '0664' '/sys/devices/system/cpu/cpu0/cpufreq/scaling_governor'.
  1293. I/cat     (  488): <6>[   10.418914] init: command 'chmod' r=0
  1294. I/cat     (  488): <6>[   10.419067] init: Try to execute command 'chown' with params 'system' 'system' '/sys/devices/system/cpu/cpu0/cpufreq/scaling_max_freq'.
  1295. I/cat     (  488): <6>[   10.419281] init: command 'chown' r=0
  1296. I/cat     (  488): <6>[   10.419403] init: Try to execute command 'chmod' with params '0664' '/sys/devices/system/cpu/cpu0/cpufreq/scaling_max_freq'.
  1297. I/cat     (  488): <6>[   10.419586] init: command 'chmod' r=0
  1298. I/cat     (  488): <6>[   10.419708] init: Try to execute command 'chown' with params 'system' 'system' '/sys/devices/system/cpu/cpu0/cpufreq/scaling_min_freq'.
  1299. I/cat     (  488): <6>[   10.419921] init: command 'chown' r=0
  1300. I/cat     (  488): <6>[   10.420043] init: Try to execute command 'chmod' with params '0664' '/sys/devices/system/cpu/cpu0/cpufreq/scaling_min_freq'.
  1301. I/cat     (  488): <6>[   10.420227] init: command 'chmod' r=0
  1302. I/cat     (  488): <6>[   10.420379] init: Try to execute command 'chown' with params 'system' 'system' '/sys/class/timed_output/vibrator/enable'.
  1303. I/cat     (  488): <6>[   10.420562] init: command 'chown' r=-2
  1304. I/cat     (  488): <6>[   10.420684] init: Try to execute command 'chown' with params 'system' 'system' '/sys/class/leds/lcd-backlight/brightness'.
  1305. I/cat     (  488): <6>[   10.420959] init: command 'chown' r=0
  1306. I/cat     (  488): <6>[   10.421081] init: Try to execute command 'chown' with params 'system' 'system' '/sys/class/leds/power/brightness'.
  1307. I/cat     (  488): <6>[   10.421386] init: command 'chown' r=0
  1308. I/cat     (  488): <6>[   10.421508] init: Try to execute command 'chown' with params 'system' 'system' '/sys/class/timed_output/vibrator/enable'.
  1309. I/cat     (  488): <6>[   10.421691] init: command 'chown' r=-2
  1310. I/cat     (  488): <6>[   10.421813] init: Try to execute command 'chown' with params 'system' 'system' '/sys/module/sco/parameters/disable_esco'.
  1311. I/cat     (  488): <6>[   10.422058] init: command 'chown' r=-2
  1312. I/cat     (  488): <6>[   10.422180] init: Try to execute command 'chown' with params 'system' 'system' '/sys/kernel/ipv4/tcp_wmem_min'.
  1313. I/cat     (  488): <6>[   10.422393] init: command 'chown' r=0
  1314. I/cat     (  488): <6>[   10.422546] init: Try to execute command 'chown' with params 'system' 'system' '/sys/kernel/ipv4/tcp_wmem_def'.
  1315. I/cat     (  488): <6>[   10.422729] init: command 'chown' r=0
  1316. I/cat     (  488): <6>[   10.422912] init: Try to execute command 'chown' with params 'system' 'system' '/sys/kernel/ipv4/tcp_wmem_max'.
  1317. I/cat     (  488): <6>[   10.423095] init: command 'chown' r=0
  1318. I/cat     (  488): <6>[   10.423217] init: Try to execute command 'chown' with params 'system' 'system' '/sys/kernel/ipv4/tcp_rmem_min'.
  1319. I/cat     (  488): <6>[   10.423400] init: command 'chown' r=0
  1320. I/cat     (  488): <6>[   10.423522] init: Try to execute command 'chown' with params 'system' 'system' '/sys/kernel/ipv4/tcp_rmem_def'.
  1321. I/cat     (  488): <6>[   10.423706] init: command 'chown' r=0
  1322. I/cat     (  488): <6>[   10.423828] init: Try to execute command 'chown' with params 'system' 'system' '/sys/kernel/ipv4/tcp_rmem_max'.
  1323. I/cat     (  488): <6>[   10.424011] init: command 'chown' r=0
  1324. I/cat     (  488): <6>[   10.424163] init: Try to execute command 'chown' with params 'root' 'radio' '/proc/cmdline'.
  1325. I/cat     (  488): <6>[   10.424346] init: command 'chown' r=0
  1326. I/cat     (  488): <6>[   10.424468] init: Try to execute command 'setprop' with params 'net.tcp.buffersize.default' '4096,87380,110208,4096,16384,110208'.
  1327. I/cat     (  488): <6>[   10.424743] init: command 'setprop' r=0
  1328. I/cat     (  488): <6>[   10.424865] init: Try to execute command 'setprop' with params 'net.tcp.buffersize.wifi' '524288,1048576,2097152,262144,524288,1048576'.
  1329. I/cat     (  488): <6>[   10.425140] init: command 'setprop' r=0
  1330. I/cat     (  488): <6>[   10.425262] init: Try to execute command 'setprop' with params 'net.tcp.buffersize.lte' '524288,1048576,2097152,262144,524288,1048576'.
  1331. I/cat     (  488): <6>[   10.425537] init: command 'setprop' r=0
  1332. I/cat     (  488): <6>[   10.425659] init: Try to execute command 'setprop' with params 'net.tcp.buffersize.umts' '4094,87380,110208,4096,16384,110208'.
  1333. I/cat     (  488): <6>[   10.425933] init: command 'setprop' r=0
  1334. I/cat     (  488): <6>[   10.426055] init: Try to execute command 'setprop' with params 'net.tcp.buffersize.hspa' '4094,87380,262144,4096,16384,262144'.
  1335. I/cat     (  488): <6>[   10.426300] init: command 'setprop' r=0
  1336. I/cat     (  488): <6>[   10.426452] init: Try to execute command 'setprop' with params 'net.tcp.buffersize.edge' '4093,26280,35040,4096,16384,35040'.
  1337. I/cat     (  488): <6>[   10.426666] init: command 'setprop' r=0
  1338. I/cat     (  488): <6>[   10.426788] init: Try to execute command 'setprop' with params 'net.tcp.buffersize.gprs' '4092,8760,11680,4096,8760,11680'.
  1339. I/cat     (  488): <6>[   10.427001] init: command 'setprop' r=0
  1340. I/cat     (  488): <6>[   10.427154] init: Try to execute command 'setprop' with params 'system_init.startsurfaceflinger' '0'.
  1341. I/cat     (  488): <6>[   10.427276] init: command 'setprop' r=0
  1342. I/cat     (  488): <6>[   10.427398] init: Try to execute command 'class_start' with params 'core'.
  1343. I/cat     (  488): <5>[   10.427581] init: starting 'battery'
  1344. I/cat     (  488): <5>[   10.428344] init: starting 'audiomixer'
  1345. I/cat     (  488): <3>[   10.428680] init: No dynamic_args: Try to execve('/system/bin/logwrapper'): args: 
  1346. I/cat     (  488): <5>[   10.428985] init: starting 'avos'
  1347. I/cat     (  488): <5>[   10.429748] init: starting 'servicemanager'
  1348. I/cat     (  488): <3>[   10.430084] init: No dynamic_args: Try to execve('/system/bin/logwrapper'): args: ·
  1349. I/cat     (  488): <5>[   10.430511] init: starting 'vold'
  1350. I/cat     (  488): <5>[   10.431762] init: starting 'powerd'
  1351. I/cat     (  488): <5>[   10.432037] init: starting 'create_SysId'
  1352. I/cat     (  488): <5>[   10.432281] init: starting 'kmsg_log'
  1353. I/cat     (  488): <3>[   10.432769] init: No dynamic_args: Try to execve('/system/bin/logwrapper'): args: X
  1354. I/cat     (  488): <5>[   10.432861] init: starting 'pvrsrvinit'
  1355. I/cat     (  488): <5>[   10.433135] init: starting 'watchdog_daemon'
  1356. I/cat     (  488): <5>[   10.433380] init: starting 'akmd'
  1357. I/cat     (  488): <5>[   10.433624] init: starting 'uim'
  1358. I/cat     (  488): <5>[   10.433868] init: starting 'hotplugd'
  1359. I/cat     (  488): <3>[   10.433898] init: No dynamic_args: Try to execve('/system/bin/servicemanager'): args: î
  1360. I/cat     (  488): <6>[   10.434112] init: command 'class_start' r=0
  1361. I/cat     (  488): <6>[   10.434143] init: Try to execute command 'class_start' with params 'main'.
  1362. I/cat     (  488): <5>[   10.434234] init: starting 'netd'
  1363. I/cat     (  488): <5>[   10.434509] init: starting 'debuggerd'
  1364. I/cat     (  488): <5>[   10.434753] init: starting 'surfaceflinger'
  1365. I/cat     (  488): <5>[   10.434997] init: starting 'zygote'
  1366. I/cat     (  488): <5>[   10.435272] init: starting 'drm'
  1367. I/cat     (  488): <5>[   10.435516] init: starting 'media'
  1368. I/cat     (  488): <5>[   10.435791] init: starting 'dbus'
  1369. I/cat     (  488): <5>[   10.436065] init: starting 'installd'
  1370. I/cat     (  488): <5>[   10.436309] init: starting 'keystore'
  1371. I/cat     (  488): <5>[   10.436553] init: starting 'nand'
  1372. I/cat     (  488): <6>[   10.436798] init: command 'class_start' r=0
  1373. I/cat     (  488): <6>[   10.437042] init: Getting for pid '505' after fork() system call when exec the command '/system/bin/logwrapper'.
  1374. I/cat     (  488): <6>[   10.437072] init: Waiting for finish the executed command '/system/bin/logwrapper'.
  1375. I/cat     (  488): <3>[   10.437316] init: No dynamic_args: Try to execve('/system/bin/logwrapper'): args:  ´
  1376. I/cat     (  488): <3>[   10.439605] init: No dynamic_args: Try to execve('/system/bin/powerd'): args: „
  1377. I/cat     (  488): <6>[   10.440032] init: Created socket '/dev/socket/vold' with mode '660', user '0', group '1009'
  1378. I/cat     (  488): <3>[   10.440124] init: No dynamic_args: Try to execve('/system/bin/vold'): args: 
  1379. I/cat     (  488): <3>[   10.440368] init: No dynamic_args: Try to execve('/system/bin/akmd8975'): args: Õ¸
  1380. I/cat     (  488): <3>[   10.440399] init: No dynamic_args: Try to execve('/system/bin/uim-sysfs'): args: û¹
  1381. I/cat     (  488): <3>[   10.440612] init: No dynamic_args: Try to execve('/system/bin/logwrapper'): args: pë
  1382. I/cat     (  488): <3>[   10.440765] init: No dynamic_args: Try to execve('/system/bin/debuggerd'): args: ì
  1383. I/cat     (  488): <6>[   10.440887] init: Created socket '/dev/socket/mdns' with mode '660', user '0', group '1000'
  1384. I/cat     (  488): <6>[   10.441009] init: Created socket '/dev/socket/dnsproxyd' with mode '660', user '0', group '3003'
  1385. I/cat     (  488): <3>[   10.441070] init: No dynamic_args: Try to execve('/system/bin/drmserver'): args: % 
  1386. I/cat     (  488): <6>[   10.441101] init: Created socket '/dev/socket/netd' with mode '660', user '0', group '1000'
  1387. I/cat     (  488): <3>[   10.441131] init: No dynamic_args: Try to execve('/system/bin/netd'): args: Ø
  1388. I/cat     (  488): <6>[   10.441436] init: Created socket '/dev/socket/zygote' with mode '666', user '0', group '0'
  1389. I/cat     (  488): <3>[   10.441497] init: No dynamic_args: Try to execve('/system/bin/app_process'): args: y
  1390. I/cat     (  488): <3>[   10.441833] init: No dynamic_args: Try to execve('/system/bin/mediaserver'): args: è 
  1391. I/cat     (  488): <6>[   10.441894] init: Created socket '/dev/socket/dbus' with mode '660', user '1002', group '1002'
  1392. I/cat     (  488): <3>[   10.441986] init: No dynamic_args: Try to execve('/system/bin/dbus-daemon'): args: ø!
  1393. I/cat     (  488): <6>[   10.442169] init: Created socket '/dev/socket/installd' with mode '600', user '1000', group '1000'
  1394. I/cat     (  488): <3>[   10.442230] init: No dynamic_args: Try to execve('/system/bin/installd'): args: $
  1395. I/cat     (  488): <3>[   10.443908] init: No dynamic_args: Try to execve('/system/bin/surfaceflinger'): args: ÿ
  1396. I/cat     (  488): <6>[   10.445037] init: Created socket '/dev/socket/keystore' with mode '666', user '0', group '0'
  1397. I/cat     (  488): <3>[   10.445098] init: No dynamic_args: Try to execve('/system/bin/keystore'): args: Á'
  1398. I/cat     (  488): <3>[   10.445251] init: No dynamic_args: Try to execve('/system/bin/logwrapper'): args: *
  1399. I/cat     (  488): <3>[   10.445281] init: No dynamic_args: Try to execve('/system/bin/watchdog_daemon'): args: ™·
  1400. I/cat     (  488): <3>[   10.446014] init: No dynamic_args: Try to execve('/system/bin/nand'): args: )
  1401. I/cat     (  488): <3>[   10.446411] init: No dynamic_args: Try to execve('/system/vendor/bin/pvrsrvinit'): args: ÷´
  1402. I/cat     (  488): <6>[   10.447509] init: Getting for pid '0' after fork() system call when exec the command '/system/bin/logwrapper'.
  1403. I/cat     (  488): <6>[   10.447631] init: Ready to go to exec the command '/system/bin/logwrapper'.
  1404. I/cat     (  488): <6>[   10.789184] charge_level set to 2
  1405. I/cat     (  488): <6>[   10.825103] (stc): st_register(4)
  1406. I/cat     (  488): <6>[   10.825103] (stc):  chnl_id list empty :4
  1407. I/cat     (  488): <6>[   10.825134] (stk) : st_kim_start
  1408. I/cat     (  488): <6>[   10.825164] plat_kim_chip_enable
  1409. --------- beginning of /dev/log/system
  1410. I/Vold    (  485): Vold 2.1 (the revenge) firing up
  1411. E/uim-sysfs(  493): uim: Inside st_uart_config
  1412. E/uim-sysfs(  493): uim:install set to 1
  1413. E/uim-sysfs(  493): uim:opening /dev/ttyO1, while already open
  1414. E/uim-sysfs(  493): uim:cleanup
  1415. E/uim-sysfs(  493): uim: Inside set_baud_rate
  1416. E/uim-sysfs(  493): uim: set_baud_rate() done
  1417. E/uim-sysfs(  493): uim: Setting speed to 3000000
  1418. E/uim-sysfs(  493): uim: Inside read_command_complete
  1419. E/uim-sysfs(  493): uim: Command complete started
  1420. E/uim-sysfs(  493): uim: Inside read_hci_event
  1421. E/uim-sysfs(  493): uim: read_hci_event
  1422. I/create_nvs(  505): create_nvs: fail, cleaning (1)
  1423. I/logwrapper(  505): /usr/bin/create_nvs terminated by exit(1)
  1424. I/cat     (  488): <6>[   10.939392] (stk) :ldisc_install = 1
  1425. I/cat     (  488): <6>[   10.964996] init: Command '/system/bin/logwrapper' finished.
  1426. I/cat     (  488): <6>[   10.965179] init: command 'exec' r=0
  1427. I/cat     (  488): <6>[   10.965606] init: Try to execute command 'setprop' with params 'archos.tetherState' 'disconnected'.
  1428. I/cat     (  488): <6>[   10.965759] init: command 'setprop' r=0
  1429. E/uim-sysfs(  493): uim: Command complete done
  1430. E/uim-sysfs(  493): uim: Speed changed to 3000000
  1431. E/uim-sysfs(  493): uim: Inside set_custom_baud_rate
  1432. E/uim-sysfs(  493): uim: Changing baud rate to 3000000, flow control to 1
  1433. E/uim-sysfs(  493): uim: set_custom_baud_rate() done
  1434. E/uim-sysfs(  493): uim: Installed N_TI_WL Line displine
  1435. D/hotplugd(  509):   { action:'add' sub:'firmware', type:'', name:'', vendor: product:
  1436. D/hotplugd(  509):                      path:'/devices/platform/kim/firmware/kim' }
  1437. I/cat     (  488): <6>[   10.965972] init: Try to execute command 'mkdir' with params '/var/etc/samba'.
  1438. I/cat     (  488): <6>[   10.992095] (stc): st_tty_open
  1439. I/cat     (  488): <6>[   10.992309] (stk) :line discipline installed
  1440. D/hotplugd(  509):  disk { action:'add' sub:'block', type:'disk', name:'ram0', vendor: product:
  1441. D/hotplugd(  509):                      path:'/devices/virtual/block/ram0' }
  1442. D/hotplugd(  509):  disk { action:'add' sub:'block', type:'disk', name:'ram1', vendor: product:
  1443. D/hotplugd(  509):                      path:'/devices/virtual/block/ram1' }
  1444. D/hotplugd(  509):  disk { action:'add' sub:'block', type:'disk', name:'ram2', vendor: product:
  1445. D/hotplugd(  509):                      path:'/devices/virtual/block/ram2' }
  1446. D/hotplugd(  509):  disk { action:'add' sub:'block', type:'disk', name:'ram3', vendor: product:
  1447. D/hotplugd(  509):                      path:'/devices/virtual/block/ram3' }
  1448. D/hotplugd(  509):  disk { action:'add' sub:'block', type:'disk', name:'ram4', vendor: product:
  1449. D/hotplugd(  509):                      path:'/devices/virtual/block/ram4' }
  1450. D/hotplugd(  509):  disk { action:'add' sub:'block', type:'disk', name:'ram5', vendor: product:
  1451. D/hotplugd(  509):                      path:'/devices/virtual/block/ram5' }
  1452. D/hotplugd(  509):  disk { action:'add' sub:'block', type:'disk', name:'ram6', vendor: product:
  1453. D/hotplugd(  509):                      path:'/devices/virtual/block/ram6' }
  1454. D/hotplugd(  509):  disk { action:'add' sub:'block', type:'disk', name:'ram7', vendor: product:
  1455. D/hotplugd(  509):                      path:'/devices/virtual/block/ram7' }
  1456. D/hotplugd(  509):  disk { action:'add' sub:'block', type:'disk', name:'ram8', vendor: product:
  1457. D/hotplugd(  509):                      path:'/devices/virtual/block/ram8' }
  1458. D/hotplugd(  509):  disk { action:'add' sub:'block', type:'disk', name:'ram9', vendor: product:
  1459. D/hotplugd(  509):                      path:'/devices/virtual/block/ram9' }
  1460. D/hotplugd(  509):  disk { action:'add' sub:'block', type:'disk', name:'ram10', vendor: product:
  1461. D/hotplugd(  509):                      path:'/devices/virtual/block/ram10' }
  1462. D/hotplugd(  509):  disk { action:'add' sub:'block', type:'disk', name:'ram11', vendor: product:
  1463. D/hotplugd(  509):                      path:'/devices/virtual/block/ram11' }
  1464. D/Vold    (  485): Volume volume_sdcard state changing -1 (Initializing) -> 0 (No-Media)
  1465. D/Vold    (  485): Volume volume_external state changing -1 (Initializing) -> 0 (No-Media)
  1466. D/hotplugd(  509):  disk { action:'add' sub:'block', type:'disk', name:'ram12', vendor: product:
  1467. D/hotplugd(  509):                      path:'/devices/virtual/block/ram12' }
  1468. D/hotplugd(  509):  disk { action:'add' sub:'block', type:'disk', name:'ram13', vendor: product:
  1469. D/hotplugd(  509):                      path:'/devices/virtual/block/ram13' }
  1470. I/cat     (  488): <6>[   10.992919] (stk) :TIInit_7.2.31.bts
  1471. D/hotplugd(  509):  disk { action:'add' sub:'block', type:'disk', name:'ram14', vendor: product:
  1472. D/hotplugd(  509):                      path:'/devices/virtual/block/ram14' }
  1473. I/cat     (  488): <6>[   11.009490] init: command 'mkdir' r=0
  1474. I/cat     (  488): <6>[   11.009552] init: Try to execute command 'mkdir' with params '/var/etc/samba/private'.
  1475. I/cat     (  488): <6>[   11.009582] init: command 'mkdir' r=0
  1476. I/cat     (  488): <6>[   11.009643] init: processing action 0x3ed10 (boot)
  1477. I/cat     (  488): <6>[   11.009674] init: processing action 0x429b8 (queue_property_triggers)
  1478. I/cat     (  488): <6>[   11.009674] init: Try to execute command 'queue_property_triggers'.
  1479. I/cat     (  488): <6>[   11.009796] init: command 'queue_property_triggers' r=0
  1480. I/cat     (  488): <6>[   11.009857] init: processing action 0x36178 (nonencrypted)
  1481. I/cat     (  488): <6>[   11.009887] init: Try to execute command 'class_start' with params 'late_start'.
  1482. I/cat     (  488): <6>[   11.009918] init: command 'class_start' r=0
  1483. I/cat     (  488): <6>[   11.009948] init: processing action 0x36760 (property:persist.sys.usb.config=*)
  1484. I/cat     (  488): <6>[   11.009979] init: Try to execute command 'setprop' with params 'sys.usb.config' '$persist.sys.usb.config'.
  1485. I/cat     (  488): <3>[   11.010009] init: using deprecated syntax for specifying property 'persist.sys.usb.config', use ${name} instead
  1486. I/cat     (  488): <6>[   11.010070] init: command 'setprop' r=0
  1487. I/cat     (  488): <6>[   11.010101] init: processing action 0x370b8 (property:service.adb.root=1)
  1488. I/cat     (  488): <6>[   11.010131] init: Try to execute command 'write' with params '/sys/class/android_usb/android0/enable' '0'.
  1489. I/cat     (  488): <3>[   11.010223] android_usb: already disabled
  1490. I/cat     (  488): <6>[   11.010284] init: command 'write' r=0
  1491. I/cat     (  488): <6>[   11.010314] init: Try to execute command 'restart' with params 'adbd'.
  1492. I/cat     (  488): <5>[   11.010406] init: starting 'adbd'
  1493. I/cat     (  488): <6>[   11.010711] init: command 'restart' r=0
  1494. I/cat     (  488): <6>[   11.010742] init: Try to execute command 'write' with params '/sys/class/android_usb/android0/enable' '1'.
  1495. I/cat     (  488): <6>[   11.010864] init: command 'write' r=0
  1496. I/cat     (  488): <6>[   11.010925] init: processing action 0x3dc80 (property:ro.board.cpu_type=OMAP4460)
  1497. I/cat     (  488): <6>[   11.010955] init: Try to execute command 'start' with params 'thermaldaemon'.
  1498. I/cat     (  488): <3>[   11.011047] init: cannot find '/system/bin/thermaldaemon', disabling 'thermaldaemon'
  1499. I/cat     (  488): <6>[   11.011077] init: command 'start' r=0
  1500. I/cat     (  488): <6>[   11.011138] init: processing action 0x3ea38 (property:ro.secure=0)
  1501. I/cat     (  488): <6>[   11.011138] init: Try to execute command 'start' with params 'console'.
  1502. I/cat     (  488): <3>[   11.011169] init: service 'console' requires console
  1503. I/cat     (  488): <6>[   11.011199] init: command 'start' r=0
  1504. I/cat     (  488): <6>[   11.011230] init: processing action 0x41a98 (property:sys.usb.config=adb)
  1505. I/cat     (  488): <6>[   11.011260] init: Try to execute command 'write' with params '/sys/class/android_usb/android0/enable' '0'.
  1506. I/cat     (  488): <6>[   11.011352] init: command 'write' r=0
  1507. I/cat     (  488): <6>[   11.011383] init: Try to execute command 'write' with params '/sys/class/android_usb/android0/idVendor' '0E79'.
  1508. I/cat     (  488): <6>[   11.011474] init: command 'write' r=0
  1509. I/cat     (  488): <6>[   11.011535] init: Try to execute command 'write' with params '/sys/class/android_usb/android0/idProduct' '1501'.
  1510. I/cat     (  488): <6>[   11.011718] init: command 'write' r=0
  1511. I/cat     (  488): <6>[   11.011749] init: Try to execute command 'write' with params '/sys/class/android_usb/android0/functions' '$sys.usb.config'.
  1512. I/cat     (  488): <3>[   11.011779] init: using deprecated syntax for specifying property 'sys.usb.config', use ${name} instead
  1513. I/cat     (  488): <6>[   11.011871] init: command 'write' r=0
  1514. I/cat     (  488): <6>[   11.011901] init: Try to execute command 'write' with params '/sys/class/android_usb/android0/enable' '1'.
  1515. I/cat     (  488): <6>[   11.011993] adb_bind_config
  1516. I/cat     (  488): <6>[   11.012054] init: command 'write' r=0
  1517. I/cat     (  488): <6>[   11.012084] init: Try to execute command 'setprop' with params 'sys.usb.state' '$sys.usb.config'.
  1518. I/cat     (  488): <3>[   11.012115] init: using deprecated syntax for specifying property 'sys.usb.config', use ${name} instead
  1519. I/cat     (  488): <6>[   11.012207] init: command 'setprop' r=0
  1520. I/cat     (  488): <6>[   11.012603] init: Created socket '/dev/socket/adbd' with mode '660', user '1000', group '1000'
  1521. I/cat     (  488): <3>[   11.012725] init: No dynamic_args: Try to execve('/sbin/adbd'): args: ¾
  1522. D/hotplugd(  509):  disk { action:'add' sub:'block', type:'disk', name:'ram15', vendor: product:
  1523. D/hotplugd(  509):                      path:'/devices/virtual/block/ram15' }
  1524. D/hotplugd(  509):  disk { action:'add' sub:'block', type:'disk', name:'loop0', vendor: product:
  1525. D/hotplugd(  509):                      path:'/devices/virtual/block/loop0' }
  1526. D/hotplugd(  509):  disk { action:'add' sub:'block', type:'disk', name:'loop1', vendor: product:
  1527. D/hotplugd(  509):                      path:'/devices/virtual/block/loop1' }
  1528. D/hotplugd(  509):  disk { action:'add' sub:'block', type:'disk', name:'loop2', vendor: product:
  1529. D/hotplugd(  509):                      path:'/devices/virtual/block/loop2' }
  1530. D/hotplugd(  509):  disk { action:'add' sub:'block', type:'disk', name:'loop3', vendor: product:
  1531. D/hotplugd(  509):                      path:'/devices/virtual/block/loop3' }
  1532. D/hotplugd(  509):  disk { action:'add' sub:'block', type:'disk', name:'loop4', vendor: product:
  1533. D/hotplugd(  509):                      path:'/devices/virtual/block/loop4' }
  1534. D/hotplugd(  509):  disk { action:'add' sub:'block', type:'disk', name:'loop5', vendor: product:
  1535. D/hotplugd(  509):                      path:'/devices/virtual/block/loop5' }
  1536. D/hotplugd(  509):  disk { action:'add' sub:'block', type:'disk', name:'loop6', vendor: product:
  1537. D/hotplugd(  509):                      path:'/devices/virtual/block/loop6' }
  1538. D/hotplugd(  509):  disk { action:'add' sub:'block', type:'disk', name:'loop7', vendor: product:
  1539. D/hotplugd(  509):                      path:'/devices/virtual/block/loop7' }
  1540. D/hotplugd(  509):  disk { action:'add' sub:'block', type:'disk', name:'mmcblk0', vendor: product:
  1541. D/hotplugd(  509):                      path:'/devices/platform/omap/omap_hsmmc.1/mmc_host/mmc0/mmc0:0001/block/mmcblk0' }
  1542. D/hotplugd(  509):  partition { action:'add' sub:'block', type:'partition', name:'mmcblk0p1', vendor: product:
  1543. D/hotplugd(  509):                      path:'/devices/platform/omap/omap_hsmmc.1/mmc_host/mmc0/mmc0:0001/block/mmcblk0/mmcblk0p1' }
  1544. D/hotplugd(  509):  partition { action:'add' sub:'block', type:'partition', name:'mmcblk0p2', vendor: product:
  1545. D/hotplugd(  509):                      path:'/devices/platform/omap/omap_hsmmc.1/mmc_host/mmc0/mmc0:0001/block/mmcblk0/mmcblk0p2' }
  1546. D/hotplugd(  509):  partition { action:'add' sub:'block', type:'partition', name:'mmcblk0p3', vendor: product:
  1547. D/hotplugd(  509):                      path:'/devices/platform/omap/omap_hsmmc.1/mmc_host/mmc0/mmc0:0001/block/mmcblk0/mmcblk0p3' }
  1548. D/hotplugd(  509):  partition { action:'add' sub:'block', type:'partition', name:'mmcblk0p4', vendor: product:
  1549. D/hotplugd(  509):                      path:'/devices/platform/omap/omap_hsmmc.1/mmc_host/mmc0/mmc0:0001/block/mmcblk0/mmcblk0p4' }
  1550. D/hotplugd(  509):  disk { action:'add' sub:'block', type:'disk', name:'mmcblk0boot1', vendor: product:
  1551. D/hotplugd(  509):                      path:'/devices/platform/omap/omap_hsmmc.1/mmc_host/mmc0/mmc0:0001/block/mmcblk0/mmcblk0boot1' }
  1552. D/hotplugd(  509):  disk { action:'add' sub:'block', type:'disk', name:'mmcblk0boot0', vendor: product:
  1553. D/hotplugd(  509):                      path:'/devices/platform/omap/omap_hsmmc.1/mmc_host/mmc0/mmc0:0001/block/mmcblk0/mmcblk0boot0' }
  1554. D/hotplugd(  509):  disk { action:'add' sub:'block', type:'disk', name:'mmcblk0boot1', vendor: product:
  1555. D/hotplugd(  509):                      path:'/devices/platform/omap/omap_hsmmc.1/mmc_host/mmc0/mmc0:0001/block/mmcblk0/mmcblk0boot1' }
  1556. D/hotplugd(  509):  disk { action:'add' sub:'block', type:'disk', name:'mmcblk0boot0', vendor: product:
  1557. D/hotplugd(  509):                      path:'/devices/platform/omap/omap_hsmmc.1/mmc_host/mmc0/mmc0:0001/block/mmcblk0/mmcblk0boot0' }
  1558. D/hotplugd(  509):  disk { action:'add' sub:'block', type:'disk', name:'mmcblk1', vendor: product:
  1559. D/hotplugd(  509):                      path:'/devices/platform/omap/omap_hsmmc.0/mmc_host/mmc1/mmc1:b368/block/mmcblk1' }
  1560. D/hotplugd(  509):  partition { action:'add' sub:'block', type:'partition', name:'mmcblk1p1', vendor: product:
  1561. D/hotplugd(  509):                      path:'/devices/platform/omap/omap_hsmmc.0/mmc_host/mmc1/mmc1:b368/block/mmcblk1/mmcblk1p1' }
  1562. D/Vold    (  485): Volume volume_sdcard state changing 0 (No-Media) -> 2 (Pending)
  1563. D/DirectVolume(  485): DirectVolume::handlePartitionAdded -> MAJOR 179, MINOR 25, PARTN 1
  1564. D/Vold    (  485): Volume volume_sdcard state changing 2 (Pending) -> 1 (Idle-Unmounted)
  1565. D/hotplugd(  509):  partition { action:'remove' sub:'block', type:'partition', name:'mmcblk1p1', vendor: product:
  1566. D/hotplugd(  509):                      path:'/devices/platform/kim/firmware/kim' }
  1567. I/cat     (  488): <4>[   11.064086] (stk) :change remote baud rate command in firmware
  1568. I/Netd    (  495): Netd 1.0 starting
  1569. W/InterfaceController(  495): Warning (Cannot load library: load_library(linker.cpp:747): library "/system/lib/libnetcmdiface.so" not found) while opening the net interface command library
  1570. I/cat     (  488): <4>[   11.064208] (stk) :skipping the wait event of change remote baud
  1571. I/cat     (  488): <6>[   11.144775] adb_open
  1572. I/cat     (  488): <6>[   11.193695] android_work: did not send uevent (0 0   (null))
  1573. D/hotplugd(  509):  partition { action:'change' sub:'block', type:'partition', name:'mmcblk1p1', vendor: product:
  1574. D/hotplugd(  509):                      path:'/devices/virtual/android_usb/android0' }
  1575. I/cat     (  488): <6>[   11.300811] android_work: sent uevent USB_STATE=CONNECTED
  1576. D/hotplugd(  509):  partition { action:'change' sub:'block', type:'partition', name:'mmcblk1p1', vendor: product:
  1577. D/hotplugd(  509):                      path:'/devices/virtual/android_usb/android0' }
  1578. I/cat     (  488): <6>[   11.310394] android_work: sent uevent USB_STATE=DISCONNECTED
  1579. D/hotplugd(  509):  partition { action:'change' sub:'block', type:'partition', name:'mmcblk1p1', vendor: product:
  1580. D/hotplugd(  509):                      path:'/devices/virtual/android_usb/android0' }
  1581. I/cat     (  488): <6>[   11.433776] android_usb gadget: high speed config #1: android
  1582. I/cat     (  488): <6>[   11.434967] android_work: sent uevent USB_STATE=CONFIGURED
  1583. D/hotplugd(  509):  partition { action:'add' sub:'block', type:'partition', name:'mmcblk1p1', vendor: product:
  1584. D/hotplugd(  509):                      path:'/module/pvrsrvkm_sgx540_120' }
  1585. I/cat     (  488): <6>[   11.569885] PVR: PVRCore_Init
  1586. D/hotplugd(  509):  partition { action:'add' sub:'block', type:'partition', name:'mmcblk1p1', vendor: product:
  1587. D/hotplugd(  509):                      path:'/kernel/slab/:t-0000072' }
  1588. I/cat     (  488): <6>[   11.571716] PVR: LinuxMMInit: Maximum page pool size: 10800
  1589. I/cat     (  488): <6>[   11.571929] PVR: PVRSRVDriverProbe(pDevice=dd4b0c00)
  1590. I/cat     (  488): <6>[   11.571990] PVR: SGX register base: 0x56000000
  1591. I/cat     (  488): <6>[   11.572021] PVR: SGX register size: 65535
  1592. I/cat     (  488): <6>[   11.572052] PVR: SGX IRQ: 53
  1593. I/cat     (  488): <6>[   11.573394] PVR: EnableSystemClocks: Enabling System Clocks
  1594. D/hotplugd(  509):  partition { action:'add' sub:'block', type:'partition', name:'mmcblk1p1', vendor: product:
  1595. D/hotplugd(  509):                      path:'/bus/platform/drivers/pvrsrvkm' }
  1596. D/hotplugd(  509):  partition { action:'add' sub:'block', type:'partition', name:'mmcblk1p1', vendor: product:
  1597. D/hotplugd(  509):                      path:'/class/pvr' }
  1598. D/hotplugd(  509):  partition { action:'add' sub:'block', type:'partition', name:'mmcblk1p1', vendor: product:
  1599. D/hotplugd(  509):                      path:'/devices/virtual/pvr/pvrsrvkm' }
  1600. V/IMGSRV  (  489): Succesfully loaded gfx modules
  1601. I/cat     (  488): <6>[   11.580627] PVR: PVRCore_Init: major device 244
  1602. I/cat     (  488): <6>[   11.602844] sr_class1p5_calib_work: core: Calibration complete: Voltage Nominal=1250000Calib=1063480 margin=13000
  1603. I/start_avos(  483): Sys_pk_build_product_key [6KF2F3U0FCS132] [6KF2-F3U0-FCS1-32]
  1604. I/start_avos(  483): media_player thread started
  1605. I/start_avos(  483): media_retriever thread started
  1606. I/SurfaceFlinger(  497): SurfaceFlinger is starting
  1607. I/SurfaceFlinger(  497): SurfaceFlinger's main thread ready to run. Initializing graphics H/W...
  1608. I/cat     (  488): <6>[   11.729797] PVR: Installing MISR with cookie bf1fbf04
  1609. I/cat     (  488): <6>[   11.730957] PVR: Installing device LISR SGX ISR on IRQ 53 with cookie dc808800
  1610. I/cat     (  488): <6>[   11.731048] PVR: SysFinalise: Version string: SGX revision = 1.2.0
  1611. I/cat     (  488): <6>[   11.731079] omaplfbOMAPLFBInit: Blitsville gc2d not present, blits disabled
  1612. I/cat     (  488): <7>[   11.731140] omaplfb: OMAPLFBInitFBVRAM: Device 0: Using 3 VRAM framebuffers
  1613. D/libEGL  (  497): loaded /vendor/lib/egl/libEGL_POWERVR_SGX540_120.so
  1614. V/IMGSRV  (  489): pvrsrvinit complete
  1615. I/cat     (  488): <6>[   11.805908] init: waitpid returned pid 489, status = 00000000
  1616. I/cat     (  488): <5>[   11.805938] init: process 'pvrsrvinit', pid 489 exited
  1617. I/cat     (  488): <6>[   11.865356] sr_class1p5_calib_work: mpu: Calibration complete: Voltage Nominal=1317000Calib=1110000 margin=0
  1618. D/libEGL  (  497): loaded /vendor/lib/egl/libGLESv1_CM_POWERVR_SGX540_120.so
  1619. D/libEGL  (  497): loaded /vendor/lib/egl/libGLESv2_POWERVR_SGX540_120.so
  1620. I/cat     (  488): <6>[   11.995330] (stc): add_channel_to_table: id 4
  1621. I/cat     (  488): <6>[   11.995391] (stc): st_register(2)
  1622. I/cat     (  488): <6>[   11.995422] (stc): add_channel_to_table: id 2
  1623. I/cat     (  488): <6>[   11.995452] (stc): st_register(3)
  1624. I/cat     (  488): <6>[   11.995483] (stc): add_channel_to_table: id 3
  1625. I/cat     (  488): <6>[   12.006164] PVR_K:(Error): PVRSRVOpenDCDeviceKM: no devnode matching index 0 [0, ]
  1626. I/ti_hwc  (  497): Expecting s/w vsync for archos
  1627. I/ti_hwc  (  497): >>vsync_loop()
  1628. I/ti_hwc  (  497): transforming FB (1024x768) => (1024x768) rot0
  1629. I/ti_hwc  (  497): clone region is set to (0,0) to (1024,768)
  1630. I/ti_hwc  (  497): external display changed (state=0, mirror={disabled tform=0deg}, dock={disabled tform=0deg}, tv=0
  1631. I/ti_hwc  (  497): omap4_hwc_device_open(rgb_order=1 nv12_only=0)
  1632. I/ti_hwc  (  497): Unable to open gc-core device (2), blits disabled
  1633. I/SurfaceFlinger(  497): Using composer version 0.3
  1634. W/SurfaceFlinger(  497): getting VSYNC period from fb HAL: 16665000
  1635. W/SurfaceFlinger(  497): no suitable EGLConfig found, trying without EGL_FRAMEBUFFER_TARGET_ANDROID
  1636. I/cat     (  488): <3>[   12.035095] tiler1d_slot_size: Returning pdata->tiler1d_slotsz: 28311552
  1637. I/cat     (  488): <3>[   12.035125] tiler_alloc_block_area: Tiler FMT: 3, Width: 28311552, Height: 1
  1638. I/cat     (  488): <3>[   12.035675] tiler1d_slot_size: Returning pdata->tiler1d_slotsz: 28311552
  1639. I/cat     (  488): <3>[   12.035736] tiler1d_slot_size: Returning pdata->tiler1d_slotsz: 28311552
  1640. I/cat     (  488): <3>[   12.035766] tiler_alloc_block_area: Tiler FMT: 3, Width: 28311552, Height: 1
  1641. E/Trace   (  497): error opening trace file: No such file or directory (2)
  1642. I/SurfaceFlinger(  497): EGL informations:
  1643. I/SurfaceFlinger(  497): vendor    : Android
  1644. I/SurfaceFlinger(  497): version   : 1.4 Android META-EGL
  1645. I/SurfaceFlinger(  497): extensions: EGL_KHR_image EGL_KHR_image_base EGL_KHR_gl_texture_2D_image EGL_KHR_gl_texture_cubemap_image EGL_KHR_gl_renderbuffer_image EGL_KHR_fence_sync EGL_ANDROID_image_native_buffer
  1646. I/SurfaceFlinger(  497): Client API: OpenGL_ES
  1647. I/SurfaceFlinger(  497): EGLSurface: 8-8-8-8, config=0x2
  1648. I/SurfaceFlinger(  497): OpenGL ES informations:
  1649. I/SurfaceFlinger(  497): vendor    : Imagination Technologies
  1650. I/SurfaceFlinger(  497): renderer  : PowerVR SGX 540
  1651. I/SurfaceFlinger(  497): version   : OpenGL ES-CM 1.1
  1652. I/SurfaceFlinger(  497): extensions: GL_EXT_debug_marker GL_OES_byte_coordinates GL_OES_fixed_point GL_OES_single_precision GL_OES_matrix_get GL_OES_read_format GL_OES_compressed_paletted_texture GL_OES_point_sprite GL_OES_point_size_array GL_OES_matrix_palette GL_OES_draw_texture GL_OES_query_matrix GL_OES_texture_env_crossbar GL_OES_texture_mirrored_repeat GL_OES_texture_cube_map GL_OES_blend_subtract GL_OES_blend_func_separate GL_OES_blend_equation_separate GL_OES_stencil_wrap GL_OES_extended_matrix_palette GL_OES_framebuffer_object GL_OES_rgb8_rgba8 GL_OES_depth24 GL_OES_stencil8 GL_OES_compressed_ETC1_RGB8_texture GL_OES_mapbuffer GL_OES_EGL_image GL_OES_EGL_image_external GL_EXT_multi_draw_arrays GL_OES_required_internalformat GL_IMG_read_format GL_IMG_texture_compression_pvrtc GL_IMG_texture_format_BGRA8888 GL_EXT_texture_format_BGRA8888 GL_OES_egl_sync GL_IMG_vertex_array_object GL_APPLE_texture_2D_limited_npot
  1653. I/SurfaceFlinger(  497): GL_MAX_TEXTURE_SIZE = 2048
  1654. I/SurfaceFlinger(  497): GL_MAX_VIEWPORT_DIMS = 2048 x 2048
  1655. D/SurfaceFlinger(  497): Screen acquired, type=0 flinger=0x411a0318
  1656. D/AndroidRuntime(  498):
  1657. D/AndroidRuntime(  498): >>>>>> AndroidRuntime START com.android.internal.os.ZygoteInit <<<<<<
  1658. D/AndroidRuntime(  498): CheckJNI is OFF
  1659. I/cat     (  488): <3>[   12.036315] tiler1d_slot_size: Returning pdata->tiler1d_slotsz: 28311552
  1660. I/cat     (  488): <3>[   12.095886] init: Service details: msg.name: 'ctl.start' msg.value: 'bootanim'
  1661. I/cat     (  488): <3>[   12.095947] init: Service details after check_control: msg.name: 'ctl.start' msg.value: 'bootanim'
  1662. I/cat     (  488): <3>[   12.096038] init: Starting service: 'bootanim'
  1663. I/cat     (  488): <3>[   12.096069] init: No arguments specified.
  1664. I/cat     (  488): <5>[   12.096191] init: starting 'bootanim'
  1665. I/cat     (  488): <3>[   12.103271] init: No dynamic_args: Try to execve('/system/bin/bootanimation'): args: ƒ!
  1666. I/mediaserver(  500): ServiceManager: 0x41e7ce30
  1667. I/AudioFlinger(  500): Using default 3000 mSec as standby time.
  1668. E/MediaPlayerFactory(  500): Failed to open FACTORY_LIB Error : Cannot load library: load_library(linker.cpp:747): library "libdashplayer.so" not found
  1669. I/CameraService(  500): CameraService started (pid=500)
  1670. I/cat     (  488): <7>[   12.159637] panel_disable [xga8]
  1671. I/cat     (  488): <4>[   12.160003] misc dsscomp: [dbcdc800] ignoring set failure -22
  1672. I/cat     (  488): <6>[   12.160034] cannot apply mgr(lcd2) on inactive device
  1673. I/cat     (  488): <3>[   12.160034] misc dsscomp: failed while applying mgr[2] r:-19
  1674. I/cat     (  488): <7>[   12.199310] panel_enable [xga8]
  1675. D/dalvikvm(  498): DexOpt: --- BEGIN 'core.jar' (bootstrap=1) ---
  1676. D/libEGL  (  647): loaded /vendor/lib/egl/libEGL_POWERVR_SGX540_120.so
  1677. D/libEGL  (  647): loaded /vendor/lib/egl/libGLESv1_CM_POWERVR_SGX540_120.so
  1678. D/libEGL  (  647): loaded /vendor/lib/egl/libGLESv2_POWERVR_SGX540_120.so
  1679. E/Trace   (  647): error opening trace file: No such file or directory (2)
  1680. I/cat     (  488): <6>[   12.406433] PVR_K:(Error): PVRSRVOpenDCDeviceKM: no devnode matching index 0 [0, ]
  1681. D/dalvikvm(  692): Ignoring duplicate verify attempt on Ljava/lang/Object;
  1682. D/MDnsDS  (  495): MDnsSdListener::Hander starting up
  1683. D/MDnsDS  (  495): MDnsSdListener starting to monitor
  1684. D/MDnsDS  (  495): Going to poll with pollCount 1
  1685. D/dalvikvm(  692): Ignoring duplicate verify attempt on Ljava/lang/Class;
  1686. D/dalvikvm(  692): Ignoring duplicate verify attempt on Ljava/lang/ref/Reference;
  1687. D/dalvikvm(  692): Ignoring duplicate verify attempt on Ljava/lang/ref/ReferenceQueue;
  1688. D/dalvikvm(  692): Ignoring duplicate verify attempt on Ljava/lang/ref/FinalizerReference;
  1689. D/dalvikvm(  692): DexOpt: load 55ms, verify+opt 693ms, 1615612 bytes
  1690. E/uim-sysfs(  493): uim: Inside st_uart_config
  1691. E/uim-sysfs(  493): uim: Un-Installed N_TI_WL Line displine
  1692. E/uim-sysfs(  493): uim:cleanup
  1693. I/cat     (  488): <6>[   14.016632] (stc): remove_channel_from_table: id 3
  1694. I/cat     (  488): <6>[   14.016723] (stc): remove_channel_from_table: id 2
  1695. I/cat     (  488): <6>[   14.016784] (stc): remove_channel_from_table: id 4
  1696. I/cat     (  488): <6>[   14.016845] (stc):  all chnl_ids unregistered
  1697. I/cat     (  488): <6>[   14.016937] (stk) :ldisc_install = 0
  1698. I/cat     (  488): <6>[   14.017364] (stc): st_tty_close
  1699. I/cat     (  488): <6>[   14.019226] plat_kim_chip_disable
  1700. D/hotplugd(  509):   { action:'change' sub:'power_supply', type:'', name:'', vendor: product:
  1701. D/hotplugd(  509):                      path:'/devices/platform/omap/omap_i2c.1/i2c-1/1-0049/twl6030_bci/power_supply/twl6030_battery' }
  1702. D/dalvikvm(  498): DexOpt: --- END 'core.jar' (success) ---
  1703. D/dalvikvm(  498): DEX prep '/system/framework/core.jar': unzip in 122ms, rewrite 4873ms
  1704. D/dalvikvm(  498): DexOpt: --- BEGIN 'core-junit.jar' (bootstrap=1) ---
  1705. D/dalvikvm(  759): DexOpt: load 7ms, verify+opt 13ms, 140460 bytes
  1706. D/dalvikvm(  498): DexOpt: --- END 'core-junit.jar' (success) ---
  1707. D/dalvikvm(  498): DEX prep '/system/framework/core-junit.jar': unzip in 0ms, rewrite 797ms
  1708. D/dalvikvm(  498): DexOpt: --- BEGIN 'bouncycastle.jar' (bootstrap=1) ---
  1709. D/dalvikvm(  760): DexOpt: load 18ms, verify+opt 236ms, 670940 bytes
  1710. D/dalvikvm(  498): DexOpt: --- END 'bouncycastle.jar' (success) ---
  1711. D/dalvikvm(  498): DEX prep '/system/framework/bouncycastle.jar': unzip in 31ms, rewrite 464ms
  1712. D/dalvikvm(  498): DexOpt: --- BEGIN 'ext.jar' (bootstrap=1) ---
  1713. D/dalvikvm(  761): DexOpt: load 29ms, verify+opt 352ms, 940516 bytes
  1714. D/dalvikvm(  498): DexOpt: --- END 'ext.jar' (success) ---
  1715. D/dalvikvm(  498): DEX prep '/system/framework/ext.jar': unzip in 41ms, rewrite 1250ms
  1716. D/dalvikvm(  498): DexOpt: --- BEGIN 'framework.jar' (bootstrap=1) ---
  1717. D/dalvikvm(  762): Note: class Landroid/app/ActivityManagerNative; has 157 unimplemented (abstract) methods
  1718. D/dalvikvm(  762): Note: class Landroid/opengl/GLWrapperBase; has 250 unimplemented (abstract) methods
  1719. D/dalvikvm(  762): DexOpt: load 246ms, verify+opt 2098ms, 5405692 bytes
  1720. D/dalvikvm(  498): DexOpt: --- END 'framework.jar' (success) ---
  1721. D/dalvikvm(  498): DEX prep '/system/framework/framework.jar': unzip in 274ms, rewrite 4360ms
  1722. D/dalvikvm(  498): DexOpt: --- BEGIN 'telephony-common.jar' (bootstrap=1) ---
  1723. D/dalvikvm(  763): Note: class Landroid/app/ActivityManagerNative; has 157 unimplemented (abstract) methods
  1724. D/dalvikvm(  763): DexOpt: load 43ms, verify+opt 321ms, 1052860 bytes
  1725. D/dalvikvm(  498): DexOpt: --- END 'telephony-common.jar' (success) ---
  1726. D/dalvikvm(  498): DEX prep '/system/framework/telephony-common.jar': unzip in 59ms, rewrite 1033ms
  1727. D/dalvikvm(  498): DexOpt: --- BEGIN 'mms-common.jar' (bootstrap=1) ---
  1728. D/dalvikvm(  764): DexOpt: load 3ms, verify+opt 37ms, 220908 bytes
  1729. I/cat     (  488): <6>[   25.672882] sr_class1p5_calib_work: mpu: Calibration complete: Voltage Nominal=1203000Calib=1000000 margin=0
  1730. D/dalvikvm(  498): DexOpt: --- END 'mms-common.jar' (success) ---
  1731. D/dalvikvm(  498): DEX prep '/system/framework/mms-common.jar': unzip in 10ms, rewrite 185ms
  1732. D/dalvikvm(  498): DexOpt: --- BEGIN 'android.policy.jar' (bootstrap=1) ---
  1733. D/dalvikvm(  765): Note: class Landroid/app/ActivityManagerNative; has 157 unimplemented (abstract) methods
  1734. D/dalvikvm(  765): DexOpt: load 57ms, verify+opt 199ms, 1324020 bytes
  1735. D/dalvikvm(  498): DexOpt: --- END 'android.policy.jar' (success) ---
  1736. D/dalvikvm(  498): DEX prep '/system/framework/android.policy.jar': unzip in 55ms, rewrite 462ms
  1737. D/dalvikvm(  498): DexOpt: --- BEGIN 'services.jar' (bootstrap=1) ---
  1738. D/dalvikvm(  766): Note: class Landroid/app/ActivityManagerNative; has 157 unimplemented (abstract) methods
  1739. D/DOMX    (  500): hardware/ti/domx/domx/omx_rpc/src/omx_rpc.c:140      RPC_InstanceInit()     
  1740. D/DOMX    (  500): ERROR: Can't open device, errorno from open = 2
  1741. D/DOMX    (  500): hardware/ti/domx/domx/omx_rpc/src/omx_rpc_stub.c:204 RPC_GetHandle()
  1742. D/DOMX    (  500): ERROR: Write failed returning status = 0xffffffff
  1743. D/DOMX    (  500): hardware/ti/domx/domx/omx_rpc/src/omx_rpc_stub.c:204 RPC_GetHandle()
  1744. D/DOMX    (  500): ERROR: failed check:0 - returning error: 0x81001 - Write failed
  1745. D/DOMX    (  500): hardware/ti/domx/domx/omx_proxy_common/src/omx_proxy_common.c:2278   OMX_ProxyCommonInit()  
  1746. D/DOMX    (  500): ERROR: RPC function returned error 0x81001
  1747. D/DOMX    (  500): hardware/ti/domx/domx/omx_proxy_common/src/omx_proxy_common.c:2278   OMX_ProxyCommonInit()  
  1748. D/DOMX    (  500): ERROR: failed check:(eError == OMX_ErrorNone) - returning error: 0x80001001 - Error returned from OMX API in ducati
  1749. D/DOMX    (  500): hardware/ti/domx/domx/omx_rpc/src/omx_rpc.c:261      RPC_InstanceDeInit()   
  1750. D/DOMX    (  500): ERROR: Close failed on omx fd
  1751. D/DOMX    (  500): hardware/ti/domx/omx_proxy_component/omx_camera/src/omx_proxy_camera.c:535   OMX_ComponentInit()    
  1752. D/DOMX    (  500): ERROR: rror in Initializing Proxy
  1753. E/CameraHal(  500): (4012c400)   hardware/ti/omap4xxx/camera/OMXCameraAdapter/OMXCameraAdapter.cpp:4280 OMXCameraGetHandle - OMX_GetHandle() failed, error: 0x80001001
  1754. D/dalvikvm(  766): DexOpt: load 42ms, verify+opt 803ms, 2205156 bytes
  1755. D/dalvikvm(  498): DexOpt: --- END 'services.jar' (success) ---
  1756. D/dalvikvm(  498): DEX prep '/system/framework/services.jar': unzip in 90ms, rewrite 1182ms
  1757. D/dalvikvm(  498): DexOpt: --- BEGIN 'apache-xml.jar' (bootstrap=1) ---
  1758. D/dalvikvm(  767): DexOpt: load 28ms, verify+opt 252ms, 836756 bytes
  1759. D/dalvikvm(  498): DexOpt: --- END 'apache-xml.jar' (success) ---
  1760. D/dalvikvm(  498): DEX prep '/system/framework/apache-xml.jar': unzip in 63ms, rewrite 595ms
  1761. D/dalvikvm(  498): Trying to load lib libjavacore.so 0x0
  1762. D/dalvikvm(  498): Added shared lib libjavacore.so 0x0
  1763. D/dalvikvm(  498): Trying to load lib libnativehelper.so 0x0
  1764. D/dalvikvm(  498): Added shared lib libnativehelper.so 0x0
  1765. I/SamplingProfilerIntegration(  498): Profiling disabled.
  1766. I/Zygote  (  498): Preloading classes...
  1767. D/dalvikvm(  498): GC_EXPLICIT freed 36K, 9% free 427K/468K, paused 0ms+0ms, total 2ms
  1768. D/dalvikvm(  498): GC_EXPLICIT freed 4K, 5% free 497K/520K, paused 0ms+0ms, total 2ms
  1769. D/dalvikvm(  498): Note: class Landroid/app/ActivityManagerNative; has 157 unimplemented (abstract) methods
  1770. D/dalvikvm(  498): GC_EXPLICIT freed 21K, 5% free 536K/564K, paused 0ms+1ms, total 2ms
  1771. D/dalvikvm(  498): GC_EXPLICIT freed 26K, 6% free 565K/596K, paused 0ms+0ms, total 3ms
  1772. W/Zygote  (  498): Class not found for preloading: android.bluetooth.BluetoothAudioGateway
  1773. W/Zygote  (  498): Class not found for preloading: android.bluetooth.HeadsetBase
  1774. W/Zygote  (  498): Class not found for preloading: undroid.content.AbstractThreadedSyncAdapter$SyncThread
  1775. D/dalvikvm(  498): GC_EXPLICIT freed 24K, 5% free 615K/644K, paused 0ms+0ms, total 3ms
  1776. D/dalvikvm(  498): GC_EXPLICIT freed 25K, 5% free 643K/672K, paused 1ms+1ms, total 7ms
  1777. D/dalvikvm(  498): GC_EXPLICIT freed 60K, 9% free 734K/800K, paused 1ms+1ms, total 8ms
  1778. D/dalvikvm(  498): GC_EXPLICIT freed 31K, 5% free 760K/800K, paused 1ms+3ms, total 10ms
  1779. D/TextLayoutCache(  498): Using debug level = 0 - Debug Enabled = 0
  1780. I/dalvikvm(  498): threadid=1: recursive native library load attempt (/system/lib/libmedia_jni.so)
  1781. D/MtpDeviceJNI(  498): register_android_mtp_MtpDevice
  1782. I/dalvikvm(  498): threadid=1: recursive native library load attempt (/system/lib/libmedia_jni.so)
  1783. I/dalvikvm(  498): threadid=1: recursive native library load attempt (/system/lib/libmedia_jni.so)
  1784. D/dalvikvm(  498): GC_EXPLICIT freed 23K, 4% free 802K/828K, paused 1ms+0ms, total 3ms
  1785. D/dalvikvm(  498): GC_EXPLICIT freed 14K, 2% free 847K/864K, paused 0ms+1ms, total 3ms
  1786. D/dalvikvm(  498): GC_FOR_ALLOC freed 223K, 17% free 1135K/1360K, paused 6ms, total 6ms
  1787. D/dalvikvm(  498): GC_EXPLICIT freed 254K, 17% free 1281K/1540K, paused 1ms+1ms, total 7ms
  1788. D/dalvikvm(  498): GC_EXPLICIT freed 29K, 16% free 1307K/1540K, paused 0ms+0ms, total 6ms
  1789. D/dalvikvm(  498): GC_EXPLICIT freed 12K, 11% free 1379K/1540K, paused 1ms+1ms, total 8ms
  1790. W/Zygote  (  498): Class not found for preloading: android.server.BluetoothA2dpService
  1791. W/Zygote  (  498): Class not found for preloading: android.server.BluetoothEventLoop
  1792. W/Zygote  (  498): Class not found for preloading: android.server.BluetoothService
  1793. D/TelephonyManager(  498): No /proc/cmdline exception=java.io.FileNotFoundException: /proc/cmdline: open failed: EACCES (Permission denied)
  1794. D/TelephonyManager(  498): /proc/cmdline=
  1795. D/dalvikvm(  498): GC_EXPLICIT freed 29K, 9% free 1441K/1572K, paused 2ms+0ms, total 13ms
  1796. D/dalvikvm(  498): GC_EXPLICIT freed 47K, 3% free 1723K/1772K, paused 1ms+1ms, total 8ms
  1797. W/Zygote  (  498): Class not found for preloading: android.util.LocaleUtil
  1798. D/dalvikvm(  498): GC_EXPLICIT freed 35K, 3% free 1757K/1804K, paused 0ms+1ms, total 8ms
  1799. D/dalvikvm(  498): GC_EXPLICIT freed 31K, 2% free 1780K/1816K, paused 1ms+0ms, total 9ms
  1800. W/Zygote  (  498): Class not found for preloading: android.view.ViewRootImpl$ResizedInfo
  1801. W/Zygote  (  498): Class not found for preloading: android.view.Window$LocalWindowManager
  1802. W/Zygote  (  498): Class not found for preloading: android.view.WindowManagerImpl$CompatModeWrapper
  1803. D/dalvikvm(  498): GC_EXPLICIT freed 30K, 2% free 1804K/1840K, paused 0ms+1ms, total 8ms
  1804. I/dalvikvm(  498): threadid=1: recursive native library load attempt (/system/lib/libwebcore.so)
  1805. D/dalvikvm(  498): No JNI_OnLoad found in /system/lib/libchromium_net.so 0x0, skipping init
  1806. D/dalvikvm(  498): GC_EXPLICIT freed 21K, 2% free 1837K/1864K, paused 1ms+1ms, total 9ms
  1807. D/dalvikvm(  498): GC_EXPLICIT freed 26K, 2% free 1864K/1896K, paused 1ms+0ms, total 10ms
  1808. D/dalvikvm(  498): GC_EXPLICIT freed 29K, 2% free 1895K/1928K, paused 1ms+1ms, total 9ms
  1809. D/dalvikvm(  498): GC_EXPLICIT freed 26K, 2% free 1922K/1952K, paused 1ms+1ms, total 9ms
  1810. D/dalvikvm(  498): GC_EXPLICIT freed 31K, 2% free 1945K/1980K, paused 0ms+0ms, total 9ms
  1811. D/dalvikvm(  498): GC_EXPLICIT freed 28K, 2% free 1972K/2004K, paused 0ms+1ms, total 8ms
  1812. D/dalvikvm(  498): GC_EXPLICIT freed 29K, 2% free 1998K/2032K, paused 1ms+0ms, total 10ms
  1813. D/dalvikvm(  498): GC_EXPLICIT freed 39K, 2% free 2015K/2056K, paused 1ms+1ms, total 10ms
  1814. W/Zygote  (  498): Class not found for preloading: java.text.DecimalFormat$1
  1815. D/dalvikvm(  498): GC_EXPLICIT freed 41K, 3% free 2029K/2072K, paused 1ms+1ms, total 11ms
  1816. W/Zygote  (  498): Class not found for preloading: java.util.concurrent.FutureTask$Sync
  1817. W/Zygote  (  498): Class not found for preloading: java.util.concurrent.atomic.UnsafeAccess
  1818. W/Zygote  (  498): Class not found for preloading: java.util.concurrent.locks.UnsafeAccess
  1819. D/dalvikvm(  498): GC_EXPLICIT freed 41K, 3% free 2043K/2088K, paused 2ms+1ms, total 11ms
  1820. W/Zygote  (  498): Class not found for preloading: libcore.icu.ErrorCode
  1821. I/System  (  498): Loaded time zone names for  in 143ms (141ms in ICU)
  1822. I/System  (  498): Loaded time zone names for en_US in 94ms (91ms in ICU)
  1823. D/dalvikvm(  498): GC_EXPLICIT freed 329K, 14% free 2127K/2460K, paused 1ms+1ms, total 13ms
  1824. D/dalvikvm(  498): GC_EXPLICIT freed 15K, 12% free 2188K/2464K, paused 0ms+1ms, total 10ms
  1825. D/dalvikvm(  498): GC_EXPLICIT freed 52K, 11% free 2220K/2468K, paused 0ms+0ms, total 11ms
  1826. D/dalvikvm(  498): GC_EXPLICIT freed 29K, 9% free 2247K/2468K, paused 1ms+1ms, total 11ms
  1827. D/dalvikvm(  498): GC_EXPLICIT freed 38K, 9% free 2263K/2468K, paused 0ms+1ms, total 11ms
  1828. D/dalvikvm(  498): GC_EXPLICIT freed 32K, 8% free 2286K/2468K, paused 1ms+1ms, total 11ms
  1829. I/Zygote  (  498): ...preloaded 2541 classes in 2764ms.
  1830. D/dalvikvm(  498): GC_EXPLICIT freed 23K, 8% free 2290K/2472K, paused 0ms+0ms, total 11ms
  1831. I/Zygote  (  498): Preload resources disabled, skipped.
  1832. D/dalvikvm(  498): GC_EXPLICIT freed <1K, 8% free 2290K/2472K, paused 1ms+1ms, total 12ms
  1833. D/dalvikvm(  498): GC_EXPLICIT freed <1K, 8% free 2290K/2472K, paused 1ms+1ms, total 12ms
  1834. D/dalvikvm(  498): GC_EXPLICIT freed <1K, 8% free 2290K/2472K, paused 1ms+1ms, total 13ms
  1835. I/dalvikvm(  498): System server process 771 has been created
  1836. I/Zygote  (  498): Accepting command socket connections
  1837. I/cat     (  488): <6>[   31.263305] warning: `zygote' uses 32-bit capabilities (legacy support in use)
  1838. E/BatteryService(  771): wirelessOnlinePath not found
  1839. E/BatteryService(  771): batteryPresentPath not found
  1840. E/BatteryService(  771): batteryTechnologyPath not found
  1841. I/sysproc (  771): Entered system_init()
  1842. I/sysproc (  771): ServiceManager: 0x5dfcf308
  1843. D/SensorService(  771): nuSensorService starting...
  1844. I/SensorService(  771): Digital Output Accelerometer
  1845. I/SensorService(  771): AK8975 3-axis Magnetic field sensor
  1846. I/SensorService(  771): AK8975 Orientation sensor
  1847. D/SensorService(  771): nuSensorService thread starting...
  1848. I/sysproc (  771): System server: starting Android runtime.
  1849. I/sysproc (  771): System server: starting Android services.
  1850. I/SystemServer(  771): Entered the Android system server!
  1851. I/sysproc (  771): System server: entering thread pool.
  1852. I/cat     (  488): <7>[   31.612396] mma8453q_ctrl_ioctl: Get mode 1
  1853. I/SystemServer(  771): Enabled StrictMode logging for UI Looper
  1854. I/SystemServer(  771): Waiting for installd to be ready.
  1855. I/SystemServer(  771): Enabled StrictMode logging for WM Looper
  1856. I/Installer(  771): connecting...
  1857. I/installd(  502): new connection
  1858. I/SystemServer(  771): Entropy Mixer
  1859. W/EntropyMixer(  771): No existing entropy file -- first boot?
  1860. I/SystemServer(  771): Power Manager
  1861. I/SystemServer(  771): Activity Manager
  1862. I/ActivityManager(  771): Memory class: 48
  1863. I/SystemServer(  771): Display Manager
  1864. I/ActivityManager(  771): Enabled StrictMode logging for AThread's Looper
  1865. I/SystemServer(  771): Telephony Registry
  1866. I/SystemServer(  771): Scheduling Policy
  1867. I/DisplayManagerService(  771): Display device added: DisplayDeviceInfo{"Built-in Screen": 1024 x 768, 60.006 fps, density 160, 160.55309 x 159.89508 dpi, touch INTERNAL, FLAG_DEFAULT_DISPLAY, FLAG_ROTATES_WITH_CONTENT, FLAG_SECURE, FLAG_SUPPORTS_PROTECTED_BUFFERS, rotation 0, type BUILT_IN, address null}
  1868. I/SystemServer(  771): Package Manager
  1869. I/PackageManager(  771): No settings file; creating initial state
  1870. W/dalvikvm(  792): method Landroid/test/InstrumentationTestRunner$StringResultPrinter;.print incorrectly overrides package-private method with same name in Ljunit/textui/ResultPrinter;
  1871. D/dalvikvm(  792): DexOpt: load 10ms, verify+opt 41ms, 519228 bytes
  1872. D/dalvikvm(  793): DexOpt: load 2ms, verify+opt 0ms, 80348 bytes
  1873. D/dalvikvm(  794): DexOpt: load 3ms, verify+opt 12ms, 134644 bytes
  1874. D/dalvikvm(  795): DexOpt: load 4ms, verify+opt 18ms, 185044 bytes
  1875. D/dalvikvm(  796): DexOpt: load 2ms, verify+opt 3ms, 116724 bytes
  1876. D/dalvikvm(  797): DexOpt: load 20ms, verify+opt 92ms, 600916 bytes
  1877. D/dalvikvm(  798): DexOpt: load 3ms, verify+opt 2ms, 124180 bytes
  1878. D/dalvikvm(  799): Note: class Landroid/app/ActivityManagerNative; has 157 unimplemented (abstract) methods
  1879. D/dalvikvm(  799): DexOpt: load 5ms, verify+opt 31ms, 362604 bytes
  1880. D/dalvikvm(  800): DexOpt: load 2ms, verify+opt 3ms, 126852 bytes
  1881. D/dalvikvm(  801): DexOpt: load 2ms, verify+opt 2ms, 106412 bytes
  1882. D/dalvikvm(  802): Note: class Landroid/app/ActivityManagerNative; has 157 unimplemented (abstract) methods
  1883. D/dalvikvm(  802): DexOpt: load 3ms, verify+opt 15ms, 211148 bytes
  1884. D/dalvikvm(  803): Note: class Landroid/app/ActivityManagerNative; has 157 unimplemented (abstract) methods
  1885. D/dalvikvm(  803): DexOpt: load 3ms, verify+opt 14ms, 213876 bytes
  1886. D/dalvikvm(  804): Note: class Landroid/app/ActivityManagerNative; has 157 unimplemented (abstract) methods
  1887. D/dalvikvm(  804): DexOpt: load 4ms, verify+opt 48ms, 478388 bytes
  1888. D/hotplugd(  509):   { action:'change' sub:'power_supply', type:'', name:'', vendor: product:
  1889. D/hotplugd(  509):                      path:'/devices/platform/omap/omap_i2c.1/i2c-1/1-0049/twl6030_bci/power_supply/twl6030_battery' }
  1890. D/dalvikvm(  805): Note: class Landroid/app/ActivityManagerNative; has 157 unimplemented (abstract) methods
  1891. D/dalvikvm(  805): DexOpt: load 2ms, verify+opt 5ms, 145204 bytes
  1892. D/dalvikvm(  806): DexOpt: load 3ms, verify+opt 3ms, 112764 bytes
  1893. D/dalvikvm(  807): DexOpt: load 2ms, verify+opt 3ms, 113140 bytes
  1894. D/dalvikvm(  808): DexOpt: load 2ms, verify+opt 2ms, 106980 bytes
  1895. D/dalvikvm(  809): Note: class Landroid/app/ActivityManagerNative; has 157 unimplemented (abstract) methods
  1896. D/dalvikvm(  809): DexOpt: load 2ms, verify+opt 4ms, 135276 bytes
  1897. D/dalvikvm(  810): DexOpt: load 2ms, verify+opt 3ms, 120636 bytes
  1898. I/PackageManager(  771): /system/framework/framework-res.apk changed; collecting certs
  1899. D/dalvikvm(  771): GC_CONCURRENT freed 3107K, 44% free 4295K/7592K, paused 1ms+2ms, total 20ms
  1900. D/dalvikvm(  771): GC_CONCURRENT freed 146K, 39% free 4645K/7592K, paused 2ms+3ms, total 22ms
  1901. D/dalvikvm(  771): GC_CONCURRENT freed 128K, 33% free 5104K/7592K, paused 2ms+2ms, total 23ms
  1902. D/dalvikvm(  771): WAIT_FOR_CONCURRENT_GC blocked 4ms
  1903. D/dalvikvm(  771): GC_CONCURRENT freed 564K, 31% free 5241K/7592K, paused 1ms+1ms, total 20ms
  1904. D/dalvikvm(  771): WAIT_FOR_CONCURRENT_GC blocked 5ms
  1905. D/dalvikvm(  771): GC_CONCURRENT freed 165K, 24% free 5812K/7592K, paused 2ms+2ms, total 42ms
  1906. D/dalvikvm(  771): WAIT_FOR_CONCURRENT_GC blocked 15ms
  1907. I/PackageManager(  771): /system/app/Calculator.apk changed; collecting certs
  1908. D/dalvikvm(  771): GC_CONCURRENT freed 770K, 23% free 5894K/7592K, paused 1ms+1ms, total 34ms
  1909. I/PackageManager(  771): /system/app/DeskClock.apk changed; collecting certs
  1910. D/dalvikvm(  771): GC_CONCURRENT freed 501K, 18% free 6252K/7592K, paused 1ms+20ms, total 33ms
  1911. I/PackageManager(  771): /system/app/GoogleBackupTransport.apk changed; collecting certs
  1912. I/PackageManager(  771): /system/app/ContactsProvider.apk changed; collecting certs
  1913. I/PackageManager(  771): New shared user android.uid.shared: id=10002
  1914. I/PackageManager(  771): /system/app/SoundRecorder.apk changed; collecting certs
  1915. I/PackageManager(  771): /system/app/SharedStorageBackup.apk changed; collecting certs
  1916. D/dalvikvm(  771): GC_CONCURRENT freed 3944K, 58% free 3243K/7592K, paused 4ms+9ms, total 53ms
  1917. I/PackageManager(  771): /system/app/ApplicationsProvider.apk changed; collecting certs
  1918. I/PackageManager(  771): /system/app/Galaxy4.apk changed; collecting certs
  1919. I/PackageManager(  771): /system/app/PicoTts.apk changed; collecting certs
  1920. D/dalvikvm(  771): GC_CONCURRENT freed 782K, 62% free 2919K/7592K, paused 5ms+2ms, total 32ms
  1921. I/PackageManager(  771): /system/app/PhotoTable.apk changed; collecting certs
  1922. I/PackageManager(  771): /system/app/ThemeManager.apk changed; collecting certs
  1923. I/PackageManager(  771): /system/app/BasicDreams.apk changed; collecting certs
  1924. D/dalvikvm(  771): GC_CONCURRENT freed 431K, 62% free 2956K/7592K, paused 1ms+2ms, total 16ms
  1925. I/PackageManager(  771): /system/app/VoiceSearchStub.apk changed; collecting certs
  1926. I/PackageManager(  771): /system/app/CertInstaller.apk changed; collecting certs
  1927. I/PackageManager(  771): /system/app/TelephonyProvider.apk changed; collecting certs
  1928. I/PackageManager(  771): /system/app/VoiceDialer.apk changed; collecting certs
  1929. D/dalvikvm(  771): GC_CONCURRENT freed 486K, 61% free 2971K/7592K, paused 1ms+2ms, total 16ms
  1930. W/PackageParser(  771): No actions in intent filter at /system/app/Bluetooth.apk Binary XML file line #207
  1931. I/PackageManager(  771): /system/app/Bluetooth.apk changed; collecting certs
  1932. W/PackageParser(  771): No actions in intent filter at /system/app/Bluetooth.apk Binary XML file line #234
  1933. W/PackageParser(  771): Unknown element under <application>: permission at /system/app/Gallery2.apk Binary XML file line #220
  1934. W/ResourceType(  771): Failure getting entry for 0x7f040018 (t=3 e=24) in package 0 (error -75)
  1935. W/ResourceType(  771): Failure getting entry for 0x7f040018 (t=3 e=24) in package 0 (error -75)
  1936. W/PackageParser(  771): Unknown element under <application>: permission at /system/app/Gallery2.apk Binary XML file line #223
  1937. I/PackageManager(  771): /system/app/Gallery2.apk changed; collecting certs
  1938. D/dalvikvm(  771): GC_CONCURRENT freed 346K, 59% free 3113K/7592K, paused 1ms+2ms, total 15ms
  1939. D/dalvikvm(  771): GC_CONCURRENT freed 371K, 58% free 3238K/7592K, paused 3ms+3ms, total 25ms
  1940. D/dalvikvm(  771): WAIT_FOR_CONCURRENT_GC blocked 21ms
  1941. D/dalvikvm(  771): GC_CONCURRENT freed 234K, 55% free 3485K/7592K, paused 1ms+1ms, total 13ms
  1942. D/dalvikvm(  771): GC_CONCURRENT freed 245K, 52% free 3716K/7592K, paused 1ms+3ms, total 18ms
  1943. I/PackageManager(  771): /system/app/VisualizationWallpapers.apk changed; collecting certs
  1944. D/dalvikvm(  771): GC_CONCURRENT freed 324K, 50% free 3856K/7592K, paused 1ms+7ms, total 22ms
  1945. I/PackageManager(  771): /system/app/Term.apk changed; collecting certs
  1946. I/PackageManager(  771): /system/app/Calendar.apk changed; collecting certs
  1947. D/dalvikvm(  771): GC_CONCURRENT freed 1194K, 59% free 3149K/7592K, paused 4ms+18ms, total 62ms
  1948. D/dalvikvm(  771): GC_CONCURRENT freed 481K, 59% free 3179K/7592K, paused 2ms+2ms, total 29ms
  1949. D/dalvikvm(  771): WAIT_FOR_CONCURRENT_GC blocked 7ms
  1950. I/PackageManager(  771): /system/app/SpareParts.apk changed; collecting certs
  1951. I/PackageManager(  771): /system/app/LockClock.apk changed; collecting certs
  1952. D/dalvikvm(  771): GC_CONCURRENT freed 316K, 56% free 3365K/7592K, paused 2ms+4ms, total 21ms
  1953. D/dalvikvm(  771): WAIT_FOR_CONCURRENT_GC blocked 8ms
  1954. D/dalvikvm(  771): GC_CONCURRENT freed 566K, 57% free 3270K/7592K, paused 1ms+2ms, total 16ms
  1955. D/dalvikvm(  771): GC_CONCURRENT freed 263K, 56% free 3404K/7592K, paused 1ms+1ms, total 16ms
  1956. I/PackageManager(  771): /system/app/PackageInstaller.apk changed; collecting certs
  1957. I/PackageManager(  771): /system/app/DSPManager.apk changed; collecting certs
  1958. I/PackageManager(  771): /system/app/Phonesky.apk changed; collecting certs
  1959. D/dalvikvm(  771): GC_CONCURRENT freed 259K, 53% free 3615K/7592K, paused 3ms+5ms, total 28ms
  1960. D/dalvikvm(  771): GC_CONCURRENT freed 781K, 57% free 3301K/7592K, paused 2ms+2ms, total 22ms
  1961. D/dalvikvm(  771): WAIT_FOR_CONCURRENT_GC blocked 16ms
  1962. D/dalvikvm(  771): GC_CONCURRENT freed 287K, 55% free 3424K/7592K, paused 2ms+2ms, total 36ms
  1963. D/dalvikvm(  771): WAIT_FOR_CONCURRENT_GC blocked 32ms
  1964. D/dalvikvm(  771): GC_CONCURRENT freed 304K, 53% free 3589K/7592K, paused 2ms+1ms, total 14ms
  1965. D/dalvikvm(  771): WAIT_FOR_CONCURRENT_GC blocked 11ms
  1966. D/dalvikvm(  771): GC_CONCURRENT freed 212K, 50% free 3870K/7592K, paused 1ms+2ms, total 16ms
  1967. D/dalvikvm(  771): GC_CONCURRENT freed 107K, 44% free 4275K/7592K, paused 1ms+2ms, total 17ms
  1968. D/dalvikvm(  771): WAIT_FOR_CONCURRENT_GC blocked 5ms
  1969. D/dalvikvm(  771): GC_CONCURRENT freed 328K, 42% free 4456K/7592K, paused 1ms+1ms, total 19ms
  1970. D/dalvikvm(  771): GC_CONCURRENT freed 375K, 41% free 4521K/7592K, paused 1ms+1ms, total 23ms
  1971. W/PackageParser(  771): No actions in intent filter at /system/app/Contacts.apk Binary XML file line #546
  1972. I/PackageManager(  771): /system/app/Contacts.apk changed; collecting certs
  1973. D/dalvikvm(  771): GC_CONCURRENT freed 258K, 38% free 4758K/7592K, paused 2ms+8ms, total 21ms
  1974. D/dalvikvm(  771): WAIT_FOR_CONCURRENT_GC blocked 17ms
  1975. D/dalvikvm(  771): GC_CONCURRENT freed 1809K, 54% free 3515K/7592K, paused 1ms+1ms, total 38ms
  1976. D/dalvikvm(  771): GC_CONCURRENT freed 217K, 51% free 3786K/7592K, paused 1ms+1ms, total 19ms
  1977. I/PackageManager(  771): /system/app/GmsCore.apk changed; collecting certs
  1978. D/dalvikvm(  771): GC_CONCURRENT freed 334K, 48% free 3958K/7592K, paused 2ms+5ms, total 30ms
  1979. D/dalvikvm(  771): WAIT_FOR_CONCURRENT_GC blocked 12ms
  1980. D/dalvikvm(  771): GC_FOR_ALLOC freed 914K, 55% free 3430K/7592K, paused 16ms, total 16ms
  1981. D/dalvikvm(  771): GC_CONCURRENT freed 304K, 53% free 3570K/7592K, paused 2ms+1ms, total 15ms
  1982. D/dalvikvm(  771): WAIT_FOR_CONCURRENT_GC blocked 12ms
  1983. D/dalvikvm(  771): GC_CONCURRENT freed 217K, 50% free 3850K/7592K, paused 1ms+2ms, total 16ms
  1984. D/dalvikvm(  771): GC_CONCURRENT freed 179K, 46% free 4167K/7592K, paused 1ms+2ms, total 17ms
  1985. D/dalvikvm(  771): GC_CONCURRENT freed 213K, 42% free 4458K/7592K, paused 1ms+1ms, total 19ms
  1986. D/dalvikvm(  771): WAIT_FOR_CONCURRENT_GC blocked 4ms
  1987. I/PackageManager(  771): New shared user com.google.uid.shared: id=10021
  1988. I/PackageManager(  771): /system/app/BackupRestoreConfirmation.apk changed; collecting certs
  1989. I/PackageManager(  771): /system/app/Mms.apk changed; collecting certs
  1990. D/dalvikvm(  771): GC_CONCURRENT freed 474K, 41% free 4508K/7592K, paused 2ms+7ms, total 21ms
  1991. D/dalvikvm(  771): WAIT_FOR_CONCURRENT_GC blocked 12ms
  1992. D/dalvikvm(  771): GC_CONCURRENT freed 1507K, 54% free 3554K/7592K, paused 1ms+2ms, total 23ms
  1993. D/dalvikvm(  771): WAIT_FOR_CONCURRENT_GC blocked 13ms
  1994. D/dalvikvm(  771): GC_CONCURRENT freed 169K, 49% free 3877K/7592K, paused 1ms+2ms, total 17ms
  1995. D/dalvikvm(  771): GC_CONCURRENT freed 257K, 46% free 4132K/7592K, paused 1ms+1ms, total 17ms
  1996. I/PackageManager(  771): /system/app/PhaseBeam.apk changed; collecting certs
  1997. I/PackageManager(  771): /system/app/InputDevices.apk changed; collecting certs
  1998. D/dalvikvm(  771): GC_CONCURRENT freed 440K, 45% free 4186K/7592K, paused 3ms+17ms, total 42ms
  1999. I/PackageManager(  771): /system/app/DownloadProviderUi.apk changed; collecting certs
  2000. I/PackageManager(  771): New shared user android.media: id=10025
  2001. I/PackageManager(  771): /system/app/GoogleContactsSyncAdapter.apk changed; collecting certs
  2002. I/PackageManager(  771): /system/app/Talk.apk changed; collecting certs
  2003. D/dalvikvm(  771): GC_CONCURRENT freed 1292K, 56% free 3406K/7592K, paused 2ms+2ms, total 20ms
  2004. D/dalvikvm(  771): WAIT_FOR_CONCURRENT_GC blocked 8ms
  2005. D/dalvikvm(  771): GC_CONCURRENT freed 452K, 55% free 3465K/7592K, paused 2ms+5ms, total 25ms
  2006. D/dalvikvm(  771): WAIT_FOR_CONCURRENT_GC blocked 13ms
  2007. D/dalvikvm(  771): GC_CONCURRENT freed 255K, 52% free 3677K/7592K, paused 2ms+1ms, total 17ms
  2008. I/PackageManager(  771): /system/app/DefaultContainerService.apk changed; collecting certs
  2009. I/PackageManager(  771): /system/app/CellBroadcastReceiver.apk changed; collecting certs
  2010. D/dalvikvm(  771): GC_CONCURRENT freed 316K, 50% free 3804K/7592K, paused 2ms+6ms, total 26ms
  2011. I/PackageManager(  771): /system/app/WAPPushManager.apk changed; collecting certs
  2012. I/PackageManager(  771): /system/app/GoogleTTS.apk changed; collecting certs
  2013. W/PackageParser(  771): No actions in intent filter at /system/app/CMFileManager.apk Binary XML file line #136
  2014. I/PackageManager(  771): /system/app/CMFileManager.apk changed; collecting certs
  2015. D/dalvikvm(  771): GC_CONCURRENT freed 857K, 55% free 3458K/7592K, paused 4ms+3ms, total 33ms
  2016. D/dalvikvm(  771): WAIT_FOR_CONCURRENT_GC blocked 7ms
  2017. D/dalvikvm(  771): GC_CONCURRENT freed 480K, 55% free 3460K/7592K, paused 2ms+2ms, total 19ms
  2018. D/dalvikvm(  771): WAIT_FOR_CONCURRENT_GC blocked 10ms
  2019. D/dalvikvm(  771): GC_CONCURRENT freed 232K, 51% free 3739K/7592K, paused 1ms+1ms, total 16ms
  2020. D/dalvikvm(  771): WAIT_FOR_CONCURRENT_GC blocked 7ms
  2021. I/PackageManager(  771): /system/app/Browser.apk changed; collecting certs
  2022. D/dalvikvm(  771): GC_CONCURRENT freed 297K, 49% free 3931K/7592K, paused 4ms+4ms, total 32ms
  2023. D/dalvikvm(  771): WAIT_FOR_CONCURRENT_GC blocked 9ms
  2024. D/dalvikvm(  771): GC_CONCURRENT freed 905K, 54% free 3532K/7592K, paused 2ms+1ms, total 19ms
  2025. I/PackageManager(  771): /system/app/SettingsProvider.apk changed; collecting certs
  2026. I/PackageManager(  771): /system/app/GooglePartnerSetup.apk changed; collecting certs
  2027. I/PackageManager(  771): /system/app/KeyChain.apk changed; collecting certs
  2028. D/dalvikvm(  771): GC_CONCURRENT freed 322K, 52% free 3708K/7592K, paused 2ms+4ms, total 35ms
  2029. I/PackageManager(  771): /system/app/Exchange2.apk changed; collecting certs
  2030. I/PackageManager(  771): /system/app/QuickSearchBox.apk changed; collecting certs
  2031. D/dalvikvm(  771): GC_CONCURRENT freed 643K, 54% free 3547K/7592K, paused 2ms+2ms, total 19ms
  2032. D/dalvikvm(  771): GC_CONCURRENT freed 334K, 52% free 3717K/7592K, paused 3ms+2ms, total 24ms
  2033. D/dalvikvm(  771): WAIT_FOR_CONCURRENT_GC blocked 19ms
  2034. D/dalvikvm(  771): GC_CONCURRENT freed 413K, 52% free 3706K/7592K, paused 2ms+1ms, total 16ms
  2035. D/dalvikvm(  771): WAIT_FOR_CONCURRENT_GC blocked 3ms
  2036. D/dalvikvm(  771): GC_CONCURRENT freed 250K, 48% free 3968K/7592K, paused 2ms+7ms, total 24ms
  2037. D/dalvikvm(  771): WAIT_FOR_CONCURRENT_GC blocked 1ms
  2038. D/dalvikvm(  771): GC_CONCURRENT freed 178K, 44% free 4286K/7592K, paused 2ms+1ms, total 19ms
  2039. D/dalvikvm(  771): GC_CONCURRENT freed 208K, 41% free 4555K/7592K, paused 2ms+1ms, total 24ms
  2040. I/PackageManager(  771): /system/app/Email2.apk changed; collecting certs
  2041. D/dalvikvm(  771): GC_CONCURRENT freed 461K, 39% free 4655K/7592K, paused 2ms+7ms, total 23ms
  2042. D/dalvikvm(  771): WAIT_FOR_CONCURRENT_GC blocked 18ms
  2043. D/dalvikvm(  771): GC_CONCURRENT freed 1414K, 50% free 3831K/7592K, paused 2ms+11ms, total 40ms
  2044. D/dalvikvm(  771): WAIT_FOR_CONCURRENT_GC blocked 6ms
  2045. I/PackageManager(  771): /system/app/Settings.apk changed; collecting certs
  2046. D/dalvikvm(  771): GC_CONCURRENT freed 230K, 46% free 4112K/7592K, paused 2ms+5ms, total 21ms
  2047. D/dalvikvm(  771): WAIT_FOR_CONCURRENT_GC blocked 8ms
  2048. D/dalvikvm(  771): GC_CONCURRENT freed 761K, 50% free 3853K/7592K, paused 2ms+1ms, total 23ms
  2049. D/dalvikvm(  771): WAIT_FOR_CONCURRENT_GC blocked 14ms
  2050. D/dalvikvm(  771): GC_CONCURRENT freed 268K, 47% free 4069K/7592K, paused 4ms+2ms, total 21ms
  2051. D/dalvikvm(  771): WAIT_FOR_CONCURRENT_GC blocked 17ms
  2052. D/dalvikvm(  771): GC_CONCURRENT freed 392K, 46% free 4172K/7592K, paused 2ms+4ms, total 23ms
  2053. D/dalvikvm(  771): GC_CONCURRENT freed 114K, 40% free 4570K/7592K, paused 2ms+2ms, total 20ms
  2054. D/dalvikvm(  771): WAIT_FOR_CONCURRENT_GC blocked 4ms
  2055. D/DOMX    (  500): hardware/ti/domx/domx/omx_rpc/src/omx_rpc.c:140      RPC_InstanceInit()     
  2056. D/DOMX    (  500): ERROR: Can't open device, errorno from open = 2
  2057. D/DOMX    (  500): hardware/ti/domx/domx/omx_rpc/src/omx_rpc_stub.c:204 RPC_GetHandle()
  2058. D/DOMX    (  500): ERROR: Write failed returning status = 0xffffffff
  2059. D/DOMX    (  500): hardware/ti/domx/domx/omx_rpc/src/omx_rpc_stub.c:204 RPC_GetHandle()
  2060. D/DOMX    (  500): ERROR: failed check:0 - returning error: 0x81001 - Write failed
  2061. D/DOMX    (  500): hardware/ti/domx/domx/omx_proxy_common/src/omx_proxy_common.c:2278   OMX_ProxyCommonInit()  
  2062. D/DOMX    (  500): ERROR: RPC function returned error 0x81001
  2063. D/DOMX    (  500): hardware/ti/domx/domx/omx_proxy_common/src/omx_proxy_common.c:2278   OMX_ProxyCommonInit()  
  2064. D/DOMX    (  500): ERROR: failed check:(eError == OMX_ErrorNone) - returning error: 0x80001001 - Error returned from OMX API in ducati
  2065. D/DOMX    (  500): hardware/ti/domx/domx/omx_rpc/src/omx_rpc.c:261      RPC_InstanceDeInit()   
  2066. D/DOMX    (  500): ERROR: Close failed on omx fd
  2067. D/DOMX    (  500): hardware/ti/domx/omx_proxy_component/omx_camera/src/omx_proxy_camera.c:535   OMX_ComponentInit()    
  2068. D/DOMX    (  500): ERROR: rror in Initializing Proxy
  2069. E/CameraHal(  500): (4012c400)   hardware/ti/omap4xxx/camera/OMXCameraAdapter/OMXCameraAdapter.cpp:4280 OMXCameraGetHandle - OMX_GetHandle() failed, error: 0x80001001
  2070. D/dalvikvm(  771): GC_CONCURRENT freed 323K, 37% free 4816K/7592K, paused 1ms+2ms, total 23ms
  2071. D/dalvikvm(  771): WAIT_FOR_CONCURRENT_GC blocked 7ms
  2072. I/PackageManager(  771): /system/app/Talkback.apk changed; collecting certs
  2073. D/dalvikvm(  771): GC_CONCURRENT freed 443K, 35% free 4999K/7592K, paused 1ms+8ms, total 34ms
  2074. D/dalvikvm(  771): WAIT_FOR_CONCURRENT_GC blocked 13ms
  2075. I/PackageManager(  771): New shared user com.google.android.marvin.feedback: id=10037
  2076. I/PackageManager(  771): /system/app/VideoEditor.apk changed; collecting certs
  2077. D/dalvikvm(  771): GC_CONCURRENT freed 1838K, 50% free 3837K/7592K, paused 1ms+1ms, total 25ms
  2078. D/dalvikvm(  771): WAIT_FOR_CONCURRENT_GC blocked 14ms
  2079. I/PackageManager(  771): /system/app/DrmProvider.apk changed; collecting certs
  2080. I/PackageManager(  771): /system/app/BasicSmsReceiver.apk changed; collecting certs
  2081. I/PackageManager(  771): /system/app/ConfigUpdater.apk changed; collecting certs
  2082. D/dalvikvm(  771): GC_CONCURRENT freed 448K, 50% free 3854K/7592K, paused 2ms+4ms, total 25ms
  2083. I/PackageManager(  771): /system/app/DownloadProvider.apk changed; collecting certs
  2084. I/PackageManager(  771): /system/app/GoogleCalendarSyncAdapter.apk changed; collecting certs
  2085. I/PackageManager(  771): New shared user com.google.android.calendar.uid.shared: id=10041
  2086. I/PackageManager(  771): /system/app/Apollo.apk changed; collecting certs
  2087. D/dalvikvm(  771): GC_CONCURRENT freed 613K, 51% free 3753K/7592K, paused 4ms+2ms, total 33ms
  2088. D/dalvikvm(  771): WAIT_FOR_CONCURRENT_GC blocked 7ms
  2089. I/PackageManager(  771): /system/app/MediaUploader.apk changed; collecting certs
  2090. I/PackageManager(  771): /system/app/NetworkLocation.apk changed; collecting certs
  2091. D/dalvikvm(  771): GC_CONCURRENT freed 434K, 50% free 3815K/7592K, paused 3ms+3ms, total 39ms
  2092. I/PackageManager(  771): /system/app/LiveWallpapersPicker.apk changed; collecting certs
  2093. I/PackageManager(  771): /system/app/SetupWizard.apk changed; collecting certs
  2094. I/PackageManager(  771): /system/app/FusedLocation.apk changed; collecting certs
  2095. D/dalvikvm(  771): GC_CONCURRENT freed 516K, 50% free 3797K/7592K, paused 2ms+3ms, total 22ms
  2096. I/PackageManager(  771): /system/app/MagicSmokeWallpapers.apk changed; collecting certs
  2097. I/PackageManager(  771): /system/app/LatinIME.apk changed; collecting certs
  2098. D/dalvikvm(  771): GC_CONCURRENT freed 392K, 49% free 3916K/7592K, paused 3ms+3ms, total 32ms
  2099. D/dalvikvm(  771): WAIT_FOR_CONCURRENT_GC blocked 8ms
  2100. D/dalvikvm(  771): GC_CONCURRENT freed 444K, 49% free 3944K/7592K, paused 2ms+3ms, total 41ms
  2101. D/dalvikvm(  771): WAIT_FOR_CONCURRENT_GC blocked 38ms
  2102. D/dalvikvm(  771): GC_CONCURRENT freed 160K, 44% free 4296K/7592K, paused 2ms+3ms, total 29ms
  2103. D/dalvikvm(  771): GC_CONCURRENT freed 254K, 41% free 4553K/7592K, paused 1ms+2ms, total 21ms
  2104. D/dalvikvm(  771): WAIT_FOR_CONCURRENT_GC blocked 6ms
  2105. I/PackageManager(  771): /system/app/OneTimeInitializer.apk changed; collecting certs
  2106. I/PackageManager(  771): /system/app/LatinImeDictionaryPack.apk changed; collecting certs
  2107. I/PackageManager(  771): /system/app/ThemeChooser.apk changed; collecting certs
  2108. D/dalvikvm(  771): GC_CONCURRENT freed 510K, 40% free 4608K/7592K, paused 3ms+6ms, total 42ms
  2109. D/dalvikvm(  771): WAIT_FOR_CONCURRENT_GC blocked 12ms
  2110. I/PackageManager(  771): /system/app/UserDictionaryProvider.apk changed; collecting certs
  2111. I/PackageManager(  771): /system/app/CMWallpapers.apk changed; collecting certs
  2112. D/dalvikvm(  771): GC_CONCURRENT freed 1300K, 49% free 3875K/7592K, paused 1ms+2ms, total 26ms
  2113. I/PackageManager(  771): /system/app/Phone.apk changed; collecting certs
  2114. D/dalvikvm(  771): GC_CONCURRENT freed 329K, 47% free 4057K/7592K, paused 2ms+3ms, total 30ms
  2115. D/dalvikvm(  771): WAIT_FOR_CONCURRENT_GC blocked 6ms
  2116. I/PackageManager(  771): /system/app/SystemUI.apk changed; collecting certs
  2117. D/dalvikvm(  771): GC_CONCURRENT freed 437K, 46% free 4129K/7592K, paused 1ms+5ms, total 22ms
  2118. D/dalvikvm(  771): WAIT_FOR_CONCURRENT_GC blocked 13ms
  2119. D/dalvikvm(  771): GC_CONCURRENT freed 549K, 48% free 4003K/7592K, paused 3ms+1ms, total 30ms
  2120. D/dalvikvm(  771): WAIT_FOR_CONCURRENT_GC blocked 22ms
  2121. D/dalvikvm(  771): GC_FOR_ALLOC freed 432K, 47% free 4082K/7592K, paused 18ms, total 18ms
  2122. D/dalvikvm(  771): GC_CONCURRENT freed 108K, 41% free 4485K/7592K, paused 2ms+3ms, total 40ms
  2123. D/dalvikvm(  771): WAIT_FOR_CONCURRENT_GC blocked 7ms
  2124. D/dalvikvm(  771): GC_CONCURRENT freed 277K, 38% free 4755K/7592K, paused 1ms+2ms, total 21ms
  2125. D/dalvikvm(  771): WAIT_FOR_CONCURRENT_GC blocked 5ms
  2126. I/PackageManager(  771): /system/app/Trebuchet.apk changed; collecting certs
  2127. D/dalvikvm(  771): GC_CONCURRENT freed 446K, 36% free 4923K/7592K, paused 2ms+9ms, total 30ms
  2128. D/dalvikvm(  771): WAIT_FOR_CONCURRENT_GC blocked 24ms
  2129. I/PackageManager(  771): /system/app/CalendarProvider.apk changed; collecting certs
  2130. I/PackageManager(  771): New shared user android.uid.calendar: id=10054
  2131. D/dalvikvm(  771): GC_CONCURRENT freed 1436K, 46% free 4115K/7592K, paused 2ms+4ms, total 30ms
  2132. I/PackageManager(  771): /system/app/GenieWidget.apk changed; collecting certs
  2133. D/dalvikvm(  771): GC_CONCURRENT freed 634K, 48% free 3981K/7592K, paused 1ms+3ms, total 22ms
  2134. I/PackageManager(  771): /system/app/Development.apk changed; collecting certs
  2135. D/dalvikvm(  771): GC_CONCURRENT freed 350K, 46% free 4142K/7592K, paused 2ms+3ms, total 22ms
  2136. D/dalvikvm(  771): WAIT_FOR_CONCURRENT_GC blocked 6ms
  2137. I/PackageManager(  771): /system/app/GoogleServicesFramework.apk changed; collecting certs
  2138. I/PackageManager(  771): /system/app/NoiseField.apk changed; collecting certs
  2139. D/dalvikvm(  771): GC_CONCURRENT freed 569K, 48% free 4002K/7592K, paused 2ms+3ms, total 27ms
  2140. I/PackageManager(  771): /system/app/GoogleLoginService.apk changed; collecting certs
  2141. I/PackageManager(  771): /system/app/Provision.apk changed; collecting certs
  2142. D/dalvikvm(  771): GC_CONCURRENT freed 495K, 48% free 4015K/7592K, paused 3ms+5ms, total 29ms
  2143. I/PackageManager(  771): /system/app/GoogleFeedback.apk changed; collecting certs
  2144. I/PackageManager(  771): /system/app/ChromeBookmarksSyncAdapter.apk changed; collecting certs
  2145. I/PackageManager(  771): /system/app/VpnDialogs.apk changed; collecting certs
  2146. I/PackageManager(  771): /system/app/HTMLViewer.apk changed; collecting certs
  2147. D/dalvikvm(  771): GC_CONCURRENT freed 511K, 48% free 4010K/7592K, paused 2ms+3ms, total 27ms
  2148. I/PackageManager(  771): /system/app/HoloSpiralWallpaper.apk changed; collecting certs
  2149. I/PackageManager(  771): /system/app/LiveWallpapers.apk changed; collecting certs
  2150. D/dalvikvm(  771): GC_CONCURRENT freed 416K, 47% free 4058K/7592K, paused 2ms+4ms, total 31ms
  2151. I/PackageManager(  771): /system/app/MediaProvider.apk changed; collecting certs
  2152. D/PackageManager(  771): No files in app dir /vendor/app
  2153. I/PackageManager(  771): Time to scan packages: 12.846 seconds
  2154. W/PackageManager(  771): Unknown permission android.permission.ADD_SYSTEM_SERVICE in package com.android.phone
  2155. W/PackageManager(  771): Unknown permission com.android.vending.billing.IBillingAccountService.BIND2 in package com.google.android.gsf.login
  2156. W/PackageManager(  771): Unknown permission com.android.chrome.TOS_ACKED in package com.google.android.gsf.login
  2157. W/PackageManager(  771): Unknown permission com.google.android.gallery3d.permission.GALLERY_PROVIDER in package com.android.bluetooth
  2158. W/PackageManager(  771): Unknown permission android.permission.MMS_PUSH in package com.android.bluetooth
  2159. W/PackageManager(  771): Not granting permission android.permission.SEND_DOWNLOAD_COMPLETED_INTENTS to package com.android.browser (protectionLevel=2 flags=0x9be45)
  2160. W/PackageManager(  771): Unknown permission com.google.android.gm.permission.READ_GMAIL in package com.google.android.talk
  2161. W/PackageManager(  771): Unknown permission com.cyanogenmod.filemanager.permissions.READ_THEME in package com.cyanogenmod.filemanager
  2162. W/PackageManager(  771): Unknown permission com.google.android.gallery3d.permission.PICASA_STORE in package com.android.dreams.phototable
  2163. W/PackageManager(  771): Unknown permission android.permission.READ_OWNER_DATA in package com.google.android.setupwizard
  2164. W/PackageManager(  771): Unknown permission android.permission.WRITE_OWNER_DATA in package com.google.android.setupwizard
  2165. W/PackageManager(  771): Unknown permission com.google.android.voicesearch.SHORTCUTS_ACCESS in package com.google.android.googlequicksearchbox
  2166. W/PackageManager(  771): Unknown permission com.google.googlenav.friend.permission.OPT_IN in package com.google.android.googlequicksearchbox
  2167. W/PackageManager(  771): Unknown permission com.google.android.apps.maps.permission.PREFETCH in package com.google.android.googlequicksearchbox
  2168. W/PackageManager(  771): Unknown permission com.google.android.apps.googlevoice.permission.AUTO_SEND in package com.google.android.googlequicksearchbox
  2169. W/PackageManager(  771): Unknown permission com.google.android.gm.permission.AUTO_SEND in package com.google.android.googlequicksearchbox
  2170. W/PackageManager(  771): Not granting permission android.permission.SEND_DOWNLOAD_COMPLETED_INTENTS to package com.android.vending (protectionLevel=2 flags=0xabe45)
  2171. W/PackageManager(  771): Unknown permission android.permission.ACCESS_4G_RADIO_DISABLE in package com.android.systemui
  2172. W/PackageManager(  771): Unknown permission android.permission.ACCESS_4G_STATE in package com.android.systemui
  2173. W/PackageManager(  771): Unknown permission android.permission.CHANGE_4G_STATE in package com.android.systemui
  2174. W/PackageManager(  771): Unknown permission com.google.android.gallery3d.permission.GALLERY_PROVIDER in package com.android.exchange
  2175. W/PackageManager(  771): Unknown permission com.google.android.gallery3d.permission.GALLERY_PROVIDER in package com.android.email
  2176. W/PackageManager(  771): Not granting permission android.permission.DEVICE_POWER to package com.android.deskclock (protectionLevel=2 flags=0x8be45)
  2177. W/PackageManager(  771): Not granting permission android.permission.READ_DREAM_STATE to package com.google.android.gsf (protectionLevel=2 flags=0x83e45)
  2178. D/dalvikvm(  771): GC_CONCURRENT freed 451K, 47% free 4043K/7592K, paused 2ms+2ms, total 25ms
  2179. D/dalvikvm(  771): GC_EXPLICIT freed 266K, 49% free 3890K/7592K, paused 3ms+1ms, total 38ms
  2180. I/SystemServer(  771): User Service
  2181. I/SystemServer(  771): Account Manager
  2182. I/SystemServer(  771): Content Manager
  2183. I/SystemServer(  771): System Content Providers
  2184. D/dalvikvm(  771): DexOpt: --- BEGIN 'SettingsProvider.apk' (bootstrap=0) ---
  2185. D/dalvikvm(  813): Note: class Landroid/app/ActivityManagerNative; has 157 unimplemented (abstract) methods
  2186. D/dalvikvm(  813): DexOpt: load 5ms, verify+opt 28ms, 381756 bytes
  2187. D/dalvikvm(  771): DexOpt: --- END 'SettingsProvider.apk' (success) ---
  2188. D/dalvikvm(  771): DEX prep '/system/app/SettingsProvider.apk': unzip in 1ms, rewrite 113ms
  2189. E/SQLiteLog(  771): (1) no such table: secure
  2190. I/SyncManager(  771): No initial accounts
  2191. I/SyncManager(  771): No initial status
  2192. I/SyncManager(  771): No initial pending operations
  2193. I/SyncManager(  771): No initial statistics
  2194. D/SettingsProvider(  771): Generated and saved new ANDROID_ID [794ab99deb6e3269] for user 0
  2195. I/DeviceHandlerService(  771): No device specific handler lib was defined.
  2196. I/SystemServer(  771): Device Handler Service
  2197. I/SystemServer(  771): Lights Service
  2198. I/SystemServer(  771): Battery Service
  2199. D/dalvikvm(  771): GC_CONCURRENT freed 166K, 46% free 4144K/7592K, paused 1ms+2ms, total 23ms
  2200. I/libsuspend(  771): Selected early suspend
  2201. I/libsuspend(  771): Starting early suspend unblocker thread
  2202. D/PermissionCache(  497): checking android.permission.ACCESS_SURFACE_FLINGER for uid=1000 => granted (396 us)
  2203. D/SurfaceFlinger(  497): Screen acquired, type=0 flinger=0x411a0318
  2204. D/SurfaceFlinger(  497):  screen was previously acquired
  2205. I/SystemServer(  771): Vibrator Service
  2206. I/SystemServer(  771): Alarm Manager
  2207. I/SystemServer(  771): Init Watchdog
  2208. I/SystemServer(  771): Input Manager
  2209. I/InputManager(  771): Initializing input manager, mUseDevInputEventForAudioJack=false
  2210. I/cat     (  488): <6>[   45.511993] request_suspend_state: wakeup (3->0) at 45503295901 (2013-04-13 21:53:14.886444093 UTC)
  2211. I/SystemServer(  771): Window Manager
  2212. I/InputManager(  771): Starting input manager
  2213. I/cat     (  488): <7>[   45.579040] mma8453q_ctrl_ioctl: Set polling delay 0
  2214. I/cat     (  488): <7>[   45.579162] mma8453q_ctrl_ioctl: Set polling delay 200
  2215. I/cat     (  488): <7>[   45.581695] mma8453q_ctrl_ioctl: Set polling delay 66
  2216. I/EventHub(  771): New device: id=1, fd=98, path='/dev/input/event5', name='cypress-tma340', classes=0x14, configuration='/system/usr/idc/cypress-tma340.idc', keyLayout='', keyCharacterMap='', builtinKeyboard=false, usingSuspendBlockIoctl=true, usingClockIoctl=false
  2217. D/EventHub(  771): No input device configuration file found for device 'compass'.
  2218. D/BluetoothManagerService(  771): Loading stored name and address
  2219. D/BluetoothManagerService(  771): Stored bluetooth Name=null,Address=null
  2220. I/SystemServer(  771): Bluetooth Manager Service
  2221. I/SystemServer(  771): Input Method Service
  2222. D/EventHub(  771): No input device configuration file found for device 'MMA8453Q Accelerometer'.
  2223. E/EventHub(  771): could not get driver version for /dev/input/mice, Not a typewriter
  2224. D/dalvikvm(  771): GC_CONCURRENT freed 389K, 46% free 4139K/7592K, paused 4ms+1ms, total 45ms
  2225. D/EventHub(  771): No input device configuration file found for device 'ARCHOS-TWL6040 Headset Jack'.
  2226. I/EventHub(  771): New device: id=4, fd=104, path='/dev/input/event4', name='ARCHOS-TWL6040 Headset Jack', classes=0x80, configuration='', keyLayout='', keyCharacterMap='', builtinKeyboard=false, usingSuspendBlockIoctl=true, usingClockIoctl=false
  2227. D/EventHub(  771): No input device configuration file found for device 'gpio-keys'.
  2228. W/InputMethodManagerService(  771): No IME selected. Choose the most applicable IME.
  2229. I/InputMethodManagerService(  771): No default found, using com.android.inputmethod.latin/.LatinIME
  2230. I/EventHub(  771): New device: id=5, fd=105, path='/dev/input/event0', name='gpio-keys', classes=0x1, configuration='', keyLayout='/system/usr/keylayout/Generic.kl', keyCharacterMap='/system/usr/keychars/Generic.kcm', builtinKeyboard=false, usingSuspendBlockIoctl=true, usingClockIoctl=false
  2231. D/EventHub(  771): No input device configuration file found for device 'twl6030_pwrbutton'.
  2232. I/EventHub(  771): New device: id=6, fd=106, path='/dev/input/event1', name='twl6030_pwrbutton', classes=0x1, configuration='', keyLayout='/system/usr/keylayout/Generic.kl', keyCharacterMap='/system/usr/keychars/Generic.kcm', builtinKeyboard=false, usingSuspendBlockIoctl=true, usingClockIoctl=false
  2233. I/InputReader(  771): Device added: id=-1, name='Virtual', sources=0x00000301
  2234. I/InputReader(  771): Device added: id=6, name='twl6030_pwrbutton', sources=0x00000101
  2235. I/InputReader(  771): Device added: id=5, name='gpio-keys', sources=0x00000101
  2236. I/InputReader(  771): Device added: id=4, name='ARCHOS-TWL6040 Headset Jack', sources=0x80000000
  2237. I/InputReader(  771):   Touch device 'cypress-tma340' could not query the properties of its associated display.  The device will be inoperable until the display size becomes available.
  2238. I/InputReader(  771): Device added: id=1, name='cypress-tma340', sources=0x00001002
  2239. E/Trace   (  771): error opening trace file: No such file or directory (2)
  2240. I/SystemServer(  771): Accessibility Manager
  2241. I/ActivityManager(  771): Config changes=15f8 {1.0 ?mcc?mnc en_US ldltr sw768dp w1024dp h695dp 160dpi xlrg land ?uimode ?night finger -keyb/h/h -nav/h s.2 themeResource=null}
  2242. I/InputReader(  771): Reconfiguring input devices.  changes=0x00000004
  2243. I/InputReader(  771): Device reconfigured: id=1, name='cypress-tma340', size 1024x768, orientation 0, mode 1, display id 0
  2244. I/PackageManager(  771): Running dexopt on: com.android.calculator2
  2245. D/dalvikvm(  832): DexOpt: load 41ms, verify+opt 116ms, 886708 bytes
  2246. I/PackageManager(  771): Running dexopt on: com.android.deskclock
  2247. D/dalvikvm(  833): DexOpt: load 48ms, verify+opt 109ms, 937036 bytes
  2248. I/PackageManager(  771): Running dexopt on: com.google.android.backup
  2249. D/dalvikvm(  834): DexOpt: load 11ms, verify+opt 74ms, 598756 bytes
  2250. I/PackageManager(  771): Running dexopt on: com.android.providers.contacts
  2251. D/dalvikvm(  835): Note: class Landroid/app/ActivityManagerNative; has 157 unimplemented (abstract) methods
  2252. D/dalvikvm(  835): DexOpt: load 14ms, verify+opt 164ms, 743868 bytes
  2253. I/PackageManager(  771): Running dexopt on: com.android.soundrecorder
  2254. D/dalvikvm(  836): DexOpt: load 7ms, verify+opt 27ms, 361100 bytes
  2255. I/PackageManager(  771): Running dexopt on: com.android.sharedstoragebackup
  2256. D/dalvikvm(  837): DexOpt: load 3ms, verify+opt 2ms, 120484 bytes
  2257. I/PackageManager(  771): Running dexopt on: com.android.providers.applications
  2258. D/dalvikvm(  838): DexOpt: load 6ms, verify+opt 32ms, 356372 bytes
  2259. I/PackageManager(  771): Running dexopt on: com.android.galaxy4
  2260. D/dalvikvm(  839): DexOpt: load 8ms, verify+opt 5ms, 241556 bytes
  2261. I/PackageManager(  771): Running dexopt on: com.svox.pico
  2262. D/dalvikvm(  840): DexOpt: load 7ms, verify+opt 5ms, 219276 bytes
  2263. I/PackageManager(  771): Running dexopt on: com.android.dreams.phototable
  2264. D/dalvikvm(  841): DexOpt: load 25ms, verify+opt 23ms, 403756 bytes
  2265. I/PackageManager(  771): Running dexopt on: com.tmobile.thememanager
  2266. D/dalvikvm(  842): DexOpt: load 3ms, verify+opt 13ms, 252092 bytes
  2267. I/PackageManager(  771): Running dexopt on: com.android.dreams.basic
  2268. D/dalvikvm(  843): DexOpt: load 4ms, verify+opt 5ms, 188452 bytes
  2269. I/PackageManager(  771): Running dexopt on: com.google.android.voicesearch
  2270. D/dalvikvm(  844): DexOpt: load 3ms, verify+opt 1ms, 110652 bytes
  2271. I/PackageManager(  771): Running dexopt on: com.android.certinstaller
  2272. D/dalvikvm(  845): DexOpt: load 7ms, verify+opt 25ms, 359180 bytes
  2273. I/PackageManager(  771): Running dexopt on: com.android.providers.telephony
  2274. D/dalvikvm(  846): DexOpt: load 3ms, verify+opt 27ms, 222444 bytes
  2275. I/PackageManager(  771): Running dexopt on: com.android.voicedialer
  2276. D/dalvikvm(  847): DexOpt: load 7ms, verify+opt 32ms, 367564 bytes
  2277. I/PackageManager(  771): Running dexopt on: com.android.bluetooth
  2278. D/dalvikvm(  848): DexOpt: load 17ms, verify+opt 201ms, 855092 bytes
  2279. I/PackageManager(  771): Running dexopt on: com.android.gallery3d
  2280. D/dalvikvm(  849): DexOpt: load 87ms, verify+opt 417ms, 1912236 bytes
  2281. I/PackageManager(  771): Running dexopt on: com.android.musicvis
  2282. D/dalvikvm(  850): DexOpt: load 4ms, verify+opt 9ms, 188084 bytes
  2283. I/PackageManager(  771): Running dexopt on: jackpal.androidterm
  2284. D/dalvikvm(  851): DexOpt: 'Landroid/annotation/SuppressLint;' has an earlier definition; blocking out
  2285. D/dalvikvm(  851): DexOpt: 'Landroid/annotation/TargetApi;' has an earlier definition; blocking out
  2286. D/dalvikvm(  851): DexOpt: not verifying/optimizing 'Landroid/annotation/SuppressLint;': multiple definitions
  2287. D/dalvikvm(  851): DexOpt: not verifying/optimizing 'Landroid/annotation/TargetApi;': multiple definitions
  2288. D/dalvikvm(  851): DexOpt: load 21ms, verify+opt 55ms, 580020 bytes
  2289. I/PackageManager(  771): Running dexopt on: com.android.calendar
  2290. D/dalvikvm(  852): DexOpt: load 55ms, verify+opt 198ms, 1135820 bytes
  2291. I/PackageManager(  771): Running dexopt on: com.android.spare_parts
  2292. D/dalvikvm(  853): Note: class Landroid/app/ActivityManagerNative; has 157 unimplemented (abstract) methods
  2293. D/dalvikvm(  853): DexOpt: load 6ms, verify+opt 6ms, 230868 bytes
  2294. I/PackageManager(  771): Running dexopt on: com.cyanogenmod.lockclock
  2295. D/dalvikvm(  854): DexOpt: load 7ms, verify+opt 33ms, 453964 bytes
  2296. I/PackageManager(  771): Running dexopt on: com.android.packageinstaller
  2297. D/dalvikvm(  855): Note: class Landroid/app/ActivityManagerNative; has 157 unimplemented (abstract) methods
  2298. D/dalvikvm(  855): DexOpt: load 17ms, verify+opt 46ms, 530412 bytes
  2299. I/PackageManager(  771): Running dexopt on: com.bel.android.dspmanager
  2300. D/dalvikvm(  856): DexOpt: load 32ms, verify+opt 127ms, 908468 bytes
  2301. I/PackageManager(  771): Running dexopt on: com.android.vending
  2302. D/dalvikvm(  857): DexOpt: 'Lcom/android/internal/os/PkgUsageStats$1;' has an earlier definition; blocking out
  2303. D/dalvikvm(  857): DexOpt: 'Lcom/android/internal/os/PkgUsageStats;' has an earlier definition; blocking out
  2304. D/dalvikvm(  857): DexOpt: not verifying/optimizing 'Lcom/android/internal/os/PkgUsageStats$1;': multiple definitions
  2305. D/dalvikvm(  857): DexOpt: not verifying/optimizing 'Lcom/android/internal/os/PkgUsageStats;': multiple definitions
  2306. I/dalvikvm(  857): DexOpt: not resolving ambiguous class 'Lcom/android/internal/os/PkgUsageStats;'
  2307. D/dalvikvm(  857): DexOpt: load 148ms, verify+opt 1099ms, 3729548 bytes
  2308. D/DOMX    (  500): hardware/ti/domx/domx/omx_rpc/src/omx_rpc.c:140      RPC_InstanceInit()     
  2309. D/DOMX    (  500): ERROR: Can't open device, errorno from open = 2
  2310. D/DOMX    (  500): hardware/ti/domx/domx/omx_rpc/src/omx_rpc_stub.c:204 RPC_GetHandle()
  2311. D/DOMX    (  500): ERROR: Write failed returning status = 0xffffffff
  2312. D/DOMX    (  500): hardware/ti/domx/domx/omx_rpc/src/omx_rpc_stub.c:204 RPC_GetHandle()
  2313. D/DOMX    (  500): ERROR: failed check:0 - returning error: 0x81001 - Write failed
  2314. D/DOMX    (  500): hardware/ti/domx/domx/omx_proxy_common/src/omx_proxy_common.c:2278   OMX_ProxyCommonInit()  
  2315. D/DOMX    (  500): ERROR: RPC function returned error 0x81001
  2316. D/DOMX    (  500): hardware/ti/domx/domx/omx_proxy_common/src/omx_proxy_common.c:2278   OMX_ProxyCommonInit()  
  2317. D/DOMX    (  500): ERROR: failed check:(eError == OMX_ErrorNone) - returning error: 0x80001001 - Error returned from OMX API in ducati
  2318. D/DOMX    (  500): hardware/ti/domx/domx/omx_rpc/src/omx_rpc.c:261      RPC_InstanceDeInit()   
  2319. D/DOMX    (  500): ERROR: Close failed on omx fd
  2320. D/DOMX    (  500): hardware/ti/domx/omx_proxy_component/omx_camera/src/omx_proxy_camera.c:535   OMX_ComponentInit()    
  2321. D/DOMX    (  500): ERROR: rror in Initializing Proxy
  2322. E/CameraHal(  500): (4012c400)   hardware/ti/omap4xxx/camera/OMXCameraAdapter/OMXCameraAdapter.cpp:4280 OMXCameraGetHandle - OMX_GetHandle() failed, error: 0x80001001
  2323. I/PackageManager(  771): Running dexopt on: com.android.contacts
  2324. D/dalvikvm(  858): DexOpt: load 89ms, verify+opt 390ms, 1918812 bytes
  2325. I/PackageManager(  771): Running dexopt on: com.google.android.gms
  2326. D/dalvikvm(  859): DexOpt: load 144ms, verify+opt 994ms, 3222716 bytes
  2327. I/PackageManager(  771): Running dexopt on: com.android.backupconfirm
  2328. D/dalvikvm(  860): DexOpt: load 5ms, verify+opt 12ms, 225916 bytes
  2329. I/PackageManager(  771): Running dexopt on: com.android.mms
  2330. D/dalvikvm(  861): DexOpt: load 72ms, verify+opt 243ms, 1448588 bytes
  2331. I/PackageManager(  771): Running dexopt on: com.android.phasebeam
  2332. D/dalvikvm(  862): DexOpt: load 7ms, verify+opt 6ms, 249412 bytes
  2333. I/PackageManager(  771): Running dexopt on: com.android.inputdevices
  2334. D/dalvikvm(  863): DexOpt: load 2ms, verify+opt 1ms, 97444 bytes
  2335. I/PackageManager(  771): Running dexopt on: com.android.providers.downloads.ui
  2336. D/dalvikvm(  864): DexOpt: load 13ms, verify+opt 35ms, 429516 bytes
  2337. I/PackageManager(  771): Running dexopt on: com.google.android.syncadapters.contacts
  2338. D/dalvikvm(  865): DexOpt: load 11ms, verify+opt 103ms, 540908 bytes
  2339. I/PackageManager(  771): Running dexopt on: com.google.android.talk
  2340. D/dalvikvm(  866): DexOpt: load 60ms, verify+opt 280ms, 1599620 bytes
  2341. I/PackageManager(  771): Running dexopt on: com.android.defcontainer
  2342. D/dalvikvm(  867): DexOpt: load 4ms, verify+opt 7ms, 203244 bytes
  2343. I/PackageManager(  771): Running dexopt on: com.android.cellbroadcastreceiver
  2344. D/dalvikvm(  868): DexOpt: load 15ms, verify+opt 39ms, 531700 bytes
  2345. I/PackageManager(  771): Running dexopt on: com.android.smspush
  2346. D/dalvikvm(  869): DexOpt: load 4ms, verify+opt 3ms, 140348 bytes
  2347. I/PackageManager(  771): Running dexopt on: com.google.android.tts
  2348. D/dalvikvm(  870): DexOpt: load 57ms, verify+opt 288ms, 1649652 bytes
  2349. D/hotplugd(  509):   { action:'change' sub:'power_supply', type:'', name:'', vendor: product:
  2350. D/hotplugd(  509):                      path:'/devices/platform/omap/omap_i2c.1/i2c-1/1-0049/twl6030_bci/power_supply/twl6030_battery' }
  2351. I/PackageManager(  771): Running dexopt on: com.cyanogenmod.filemanager
  2352. D/dalvikvm(  871): DexOpt: load 55ms, verify+opt 153ms, 1010884 bytes
  2353. I/PackageManager(  771): Running dexopt on: com.android.browser
  2354. D/dalvikvm(  872): DexOpt: load 85ms, verify+opt 216ms, 1561300 bytes
  2355. I/PackageManager(  771): Running dexopt on: com.google.android.partnersetup
  2356. D/dalvikvm(  873): Note: class Landroid/app/ActivityManagerNative; has 157 unimplemented (abstract) methods
  2357. D/dalvikvm(  873): DexOpt: load 12ms, verify+opt 79ms, 665780 bytes
  2358. I/PackageManager(  771): Running dexopt on: com.android.keychain
  2359. D/dalvikvm(  874): DexOpt: load 6ms, verify+opt 33ms, 379908 bytes
  2360. I/PackageManager(  771): Running dexopt on: com.android.exchange
  2361. D/dalvikvm(  875): DexOpt: load 64ms, verify+opt 410ms, 1709388 bytes
  2362. I/PackageManager(  771): Running dexopt on: com.google.android.googlequicksearchbox
  2363. D/dalvikvm(  876): DexOpt: load 145ms, verify+opt 755ms, 3317620 bytes
  2364. I/PackageManager(  771): Running dexopt on: com.android.email
  2365. D/dalvikvm(  877): DexOpt: load 99ms, verify+opt 515ms, 2354452 bytes
  2366. D/DOMX    (  500): hardware/ti/domx/domx/omx_rpc/src/omx_rpc.c:140      RPC_InstanceInit()     
  2367. D/DOMX    (  500): ERROR: Can't open device, errorno from open = 2
  2368. D/DOMX    (  500): hardware/ti/domx/domx/omx_rpc/src/omx_rpc_stub.c:204 RPC_GetHandle()
  2369. D/DOMX    (  500): ERROR: Write failed returning status = 0xffffffff
  2370. D/DOMX    (  500): hardware/ti/domx/domx/omx_rpc/src/omx_rpc_stub.c:204 RPC_GetHandle()
  2371. D/DOMX    (  500): ERROR: failed check:0 - returning error: 0x81001 - Write failed
  2372. D/DOMX    (  500): hardware/ti/domx/domx/omx_proxy_common/src/omx_proxy_common.c:2278   OMX_ProxyCommonInit()  
  2373. D/DOMX    (  500): ERROR: RPC function returned error 0x81001
  2374. D/DOMX    (  500): hardware/ti/domx/domx/omx_proxy_common/src/omx_proxy_common.c:2278   OMX_ProxyCommonInit()  
  2375. D/DOMX    (  500): ERROR: failed check:(eError == OMX_ErrorNone) - returning error: 0x80001001 - Error returned from OMX API in ducati
  2376. D/DOMX    (  500): hardware/ti/domx/domx/omx_rpc/src/omx_rpc.c:261      RPC_InstanceDeInit()   
  2377. D/DOMX    (  500): ERROR: Close failed on omx fd
  2378. D/DOMX    (  500): hardware/ti/domx/omx_proxy_component/omx_camera/src/omx_proxy_camera.c:535   OMX_ComponentInit()    
  2379. D/DOMX    (  500): ERROR: rror in Initializing Proxy
  2380. E/CameraHal(  500): (4012c400)   hardware/ti/omap4xxx/camera/OMXCameraAdapter/OMXCameraAdapter.cpp:4280 OMXCameraGetHandle - OMX_GetHandle() failed, error: 0x80001001
  2381. I/PackageManager(  771): Running dexopt on: com.android.settings
  2382. D/dalvikvm(  878): Note: class Landroid/app/ActivityManagerNative; has 157 unimplemented (abstract) methods
  2383. D/dalvikvm(  878): DexOpt: load 93ms, verify+opt 505ms, 2593788 bytes
  2384. I/PackageManager(  771): Running dexopt on: com.google.android.marvin.talkback
  2385. D/dalvikvm(  879): DexOpt: load 45ms, verify+opt 177ms, 1174148 bytes
  2386. I/PackageManager(  771): Running dexopt on: com.android.videoeditor
  2387. D/dalvikvm(  880): DexOpt: load 29ms, verify+opt 135ms, 766700 bytes
  2388. I/PackageManager(  771): Running dexopt on: com.android.providers.drm
  2389. D/dalvikvm(  881): DexOpt: load 3ms, verify+opt 4ms, 149204 bytes
  2390. I/PackageManager(  771): Running dexopt on: com.android.basicsmsreceiver
  2391. D/dalvikvm(  882): DexOpt: load 5ms, verify+opt 3ms, 168628 bytes
  2392. I/PackageManager(  771): Running dexopt on: com.google.android.configupdater
  2393. D/dalvikvm(  883): DexOpt: load 62ms, verify+opt 389ms, 1897100 bytes
  2394. I/PackageManager(  771): Running dexopt on: com.android.providers.downloads
  2395. D/dalvikvm(  884): DexOpt: load 11ms, verify+opt 65ms, 515052 bytes
  2396. I/PackageManager(  771): Running dexopt on: com.google.android.syncadapters.calendar
  2397. D/dalvikvm(  885): DexOpt: load 8ms, verify+opt 69ms, 402772 bytes
  2398. I/PackageManager(  771): Running dexopt on: com.andrew.apollo
  2399. D/dalvikvm(  886): DexOpt: load 54ms, verify+opt 155ms, 1124532 bytes
  2400. I/PackageManager(  771): Running dexopt on: com.google.android.apps.uploader
  2401. D/dalvikvm(  887): DexOpt: load 26ms, verify+opt 141ms, 897652 bytes
  2402. I/PackageManager(  771): Running dexopt on: com.google.android.location
  2403. D/dalvikvm(  888): DexOpt: load 17ms, verify+opt 136ms, 751972 bytes
  2404. I/PackageManager(  771): Running dexopt on: com.android.wallpaper.livepicker
  2405. D/dalvikvm(  889): DexOpt: load 7ms, verify+opt 25ms, 356276 bytes
  2406. I/PackageManager(  771): Running dexopt on: com.google.android.setupwizard
  2407. D/dalvikvm(  890): DexOpt: load 24ms, verify+opt 103ms, 855404 bytes
  2408. I/PackageManager(  771): Running dexopt on: com.android.location.fused
  2409. D/dalvikvm(  891): DexOpt: load 4ms, verify+opt 2ms, 142772 bytes
  2410. I/PackageManager(  771): Running dexopt on: com.android.magicsmoke
  2411. D/dalvikvm(  892): DexOpt: load 6ms, verify+opt 9ms, 274324 bytes
  2412. I/PackageManager(  771): Running dexopt on: com.android.inputmethod.latin
  2413. D/dalvikvm(  893): DexOpt: load 30ms, verify+opt 153ms, 933900 bytes
  2414. I/PackageManager(  771): Running dexopt on: com.google.android.onetimeinitializer
  2415. D/dalvikvm(  894): DexOpt: load 4ms, verify+opt 4ms, 156244 bytes
  2416. I/PackageManager(  771): Running dexopt on: com.google.android.inputmethod.latin.dictionarypack
  2417. D/dalvikvm(  895): DexOpt: load 28ms, verify+opt 51ms, 625852 bytes
  2418. I/PackageManager(  771): Running dexopt on: com.tmobile.themechooser
  2419. D/dalvikvm(  896): DexOpt: load 12ms, verify+opt 13ms, 335900 bytes
  2420. I/PackageManager(  771): Running dexopt on: com.android.providers.userdictionary
  2421. D/dalvikvm(  897): DexOpt: load 4ms, verify+opt 6ms, 165396 bytes
  2422. I/PackageManager(  771): Running dexopt on: com.cyanogenmod.CMWallpapers
  2423. D/dalvikvm(  898): DexOpt: load 6ms, verify+opt 23ms, 276764 bytes
  2424. I/PackageManager(  771): Running dexopt on: com.android.phone
  2425. D/dalvikvm(  899): Note: class Landroid/app/ActivityManagerNative; has 157 unimplemented (abstract) methods
  2426. D/dalvikvm(  899): DexOpt: load 30ms, verify+opt 190ms, 1105540 bytes
  2427. I/PackageManager(  771): Running dexopt on: com.android.systemui
  2428. D/dalvikvm(  900): Note: class Landroid/app/ActivityManagerNative; has 157 unimplemented (abstract) methods
  2429. D/dalvikvm(  900): DexOpt: load 56ms, verify+opt 185ms, 1353404 bytes
  2430. I/PackageManager(  771): Running dexopt on: com.cyanogenmod.trebuchet
  2431. D/dalvikvm(  901): DexOpt: load 75ms, verify+opt 217ms, 1111156 bytes
  2432. I/PackageManager(  771): Running dexopt on: com.android.providers.calendar
  2433. D/dalvikvm(  902): Note: class Landroid/app/ActivityManagerNative; has 157 unimplemented (abstract) methods
  2434. D/dalvikvm(  902): DexOpt: load 11ms, verify+opt 99ms, 603044 bytes
  2435. I/PackageManager(  771): Running dexopt on: com.google.android.apps.genie.geniewidget
  2436. D/dalvikvm(  903): DexOpt: load 40ms, verify+opt 128ms, 932604 bytes
  2437. I/PackageManager(  771): Running dexopt on: com.android.development
  2438. D/dalvikvm(  904): Note: class Landroid/app/ActivityManagerNative; has 157 unimplemented (abstract) methods
  2439. D/dalvikvm(  904): DexOpt: load 20ms, verify+opt 62ms, 698220 bytes
  2440. I/PackageManager(  771): Running dexopt on: com.google.android.gsf
  2441. D/dalvikvm(  905): DexOpt: load 36ms, verify+opt 330ms, 1394364 bytes
  2442. I/PackageManager(  771): Running dexopt on: com.android.noisefield
  2443. D/dalvikvm(  906): DexOpt: load 8ms, verify+opt 7ms, 261164 bytes
  2444. I/PackageManager(  771): Running dexopt on: com.google.android.gsf.login
  2445. D/dalvikvm(  907): DexOpt: load 36ms, verify+opt 142ms, 1021932 bytes
  2446. I/PackageManager(  771): Running dexopt on: com.android.provision
  2447. D/dalvikvm(  908): DexOpt: load 5ms, verify+opt 1ms, 133572 bytes
  2448. I/PackageManager(  771): Running dexopt on: com.google.android.feedback
  2449. D/dalvikvm(  909): DexOpt: load 12ms, verify+opt 89ms, 739052 bytes
  2450. D/DOMX    (  500): hardware/ti/domx/domx/omx_rpc/src/omx_rpc.c:140      RPC_InstanceInit()     
  2451. D/DOMX    (  500): ERROR: Can't open device, errorno from open = 2
  2452. D/DOMX    (  500): hardware/ti/domx/domx/omx_rpc/src/omx_rpc_stub.c:204 RPC_GetHandle()
  2453. D/DOMX    (  500): ERROR: Write failed returning status = 0xffffffff
  2454. D/DOMX    (  500): hardware/ti/domx/domx/omx_rpc/src/omx_rpc_stub.c:204 RPC_GetHandle()
  2455. D/DOMX    (  500): ERROR: failed check:0 - returning error: 0x81001 - Write failed
  2456. D/DOMX    (  500): hardware/ti/domx/domx/omx_proxy_common/src/omx_proxy_common.c:2278   OMX_ProxyCommonInit()  
  2457. D/DOMX    (  500): ERROR: RPC function returned error 0x81001
  2458. D/DOMX    (  500): hardware/ti/domx/domx/omx_proxy_common/src/omx_proxy_common.c:2278   OMX_ProxyCommonInit()  
  2459. D/DOMX    (  500): ERROR: failed check:(eError == OMX_ErrorNone) - returning error: 0x80001001 - Error returned from OMX API in ducati
  2460. D/DOMX    (  500): hardware/ti/domx/domx/omx_rpc/src/omx_rpc.c:261      RPC_InstanceDeInit()   
  2461. D/DOMX    (  500): ERROR: Close failed on omx fd
  2462. D/DOMX    (  500): hardware/ti/domx/omx_proxy_component/omx_camera/src/omx_proxy_camera.c:535   OMX_ComponentInit()    
  2463. D/DOMX    (  500): ERROR: rror in Initializing Proxy
  2464. E/CameraHal(  500): (4012c400)   hardware/ti/omap4xxx/camera/OMXCameraAdapter/OMXCameraAdapter.cpp:4280 OMXCameraGetHandle - OMX_GetHandle() failed, error: 0x80001001
  2465. E/CameraHal(  500): (4012c400)   hardware/ti/omap4xxx/camera/OMXCameraAdapter/OMXCameraAdapter.cpp:4460 OMXCameraAdapter_Capabilities - OMX_GetHandle -0x80001001
  2466. E/CameraHal(  500): (4012c400)   hardware/ti/omap4xxx/camera/OMXCameraAdapter/OMXCameraAdapter.cpp:4498 OMXCameraAdapter_Capabilities - Error: 0x80001001
  2467. E/CameraHal(  500): (4012c400)   hardware/ti/omap4xxx/camera/BaseCameraAdapter.cpp:2666 CameraAdapter_Capabilities - error while getting OMXCameraAdapter capabilities
  2468. E/CameraHal(  500): (4012c400)   hardware/ti/omap4xxx/camera/BaseCameraAdapter.cpp:2681 CameraAdapter_Capabilities - supportedCameras= 0
  2469. E/CameraHal(  500): (4012c400)   hardware/ti/omap4xxx/camera/CameraProperties.cpp:105 loadProperties - error while getting capabilities
  2470. E/CameraHal(  500): (4012c400)   hardware/ti/omap4xxx/camera/CameraHal_Module.cpp:770 camera_get_number_of_cameras - Unable to create or initialize CameraProperties
  2471. W/AudioFlinger(  500): findSuitableHwDev_l() loading well know audio hw modules
  2472. I/PackageManager(  771): Running dexopt on: com.google.android.syncadapters.bookmarks
  2473. D/audio_hw_primary(  500): Setting output devices (0x40002): headset 0, headphone 0, speaker 1, earpiece 0, hdmi 0, usb 0
  2474. D/audio_hw_primary(  500): Set output volume: 0.000000, gain -Inf
  2475. I/AudioFlinger(  500): loadHwModule() Loaded primary audio interface from Archos audio HW HAL (audio) handle 1
  2476. I/audio_a2dp_hw(  500): adev_open:  adev_open in A2dp_hw module
  2477. I/AudioFlinger(  500): loadHwModule() Loaded a2dp audio interface from A2DP Audio HW HAL (audio) handle 2
  2478. E/AudioFlinger(  500): int android::load_audio_interface(const char*, audio_hw_device_t**) couldn't load audio hw module audio.usb (No such file or directory)
  2479. I/AudioFlinger(  500): loadHwModule() error -2 loading module usb
  2480. I/AudioFlinger(  500): HAL output buffer size 1920 frames, normal mix buffer size 1920 frames
  2481. I/AudioMixer(  500): found effect "Multichannel Downmix To Stereo" from The Android Open Source Project
  2482. I/AudioFlinger(  500): Using module 0 has the primary audio interface
  2483. I/AudioFlinger(  500): AudioFlinger's thread 0x41e85a58 ready to run
  2484. D/audio_hw_primary(  500): Set output volume: 1.000000, gain 0.000000
  2485. I/AudioPolicyService(  500): Loaded audio policy from LEGACY Audio Policy HAL (audio_policy)
  2486. E/WVMExtractor(  500): IsWidevineMedia not found in libwvm.so
  2487. E/Trace   (  500): error opening trace file: No such file or directory (2)
  2488. D/dalvikvm(  912): DexOpt: load 15ms, verify+opt 106ms, 539156 bytes
  2489. E/WVMExtractor(  500): IsWidevineMedia not found in libwvm.so
  2490. I/PackageManager(  771): Running dexopt on: com.android.vpndialogs
  2491. D/dalvikvm(  925): DexOpt: load 5ms, verify+opt 21ms, 278068 bytes
  2492. I/PackageManager(  771): Running dexopt on: com.android.htmlviewer
  2493. D/dalvikvm(  926): DexOpt: load 6ms, verify+opt 14ms, 247340 bytes
  2494. I/PackageManager(  771): Running dexopt on: com.android.wallpaper.holospiral
  2495. D/dalvikvm(  927): DexOpt: load 8ms, verify+opt 5ms, 256500 bytes
  2496. I/PackageManager(  771): Running dexopt on: com.android.wallpaper
  2497. D/dalvikvm(  928): DexOpt: load 10ms, verify+opt 18ms, 399732 bytes
  2498. I/PackageManager(  771): Running dexopt on: com.android.providers.media
  2499. D/dalvikvm(  929): Note: class Landroid/app/ActivityManagerNative; has 157 unimplemented (abstract) methods
  2500. D/dalvikvm(  929): DexOpt: load 7ms, verify+opt 64ms, 505860 bytes
  2501. I/SystemServer(  771): Mount Service
  2502. D/MountService(  771): got storage path: /mnt/sdcard description: Internal storage primary: true removable: false emulated: true mtpReserve: 100 allowMassStorage: false maxFileSize: 0
  2503. D/MountService(  771): addVolumeLocked() StorageVolume [mStorageId=65537 mPath=/storage/emulated/0 mDescriptionId=17040656 mPrimary=true mRemovable=false mEmulated=true mMtpReserveSpace=100 mAllowMassStorage=false mMaxFileSize=0 mOwner=UserHandle{0}]
  2504. D/MountService(  771): got storage path: /storage/sdcard1 description: SD card primary: false removable: true emulated: false mtpReserve: 0 allowMassStorage: false maxFileSize: 0
  2505. D/MountService(  771): addVolumeLocked() StorageVolume [mStorageId=0 mPath=/storage/sdcard1 mDescriptionId=17040657 mPrimary=false mRemovable=true mEmulated=false mMtpReserveSpace=0 mAllowMassStorage=false mMaxFileSize=0 mOwner=null]
  2506. D/MountService(  771): got storage path: /storage/usbdisk0 description: USB storage primary: false removable: true emulated: false mtpReserve: 0 allowMassStorage: false maxFileSize: 0
  2507. D/MountService(  771): addVolumeLocked() StorageVolume [mStorageId=0 mPath=/storage/usbdisk0 mDescriptionId=17040658 mPrimary=false mRemovable=true mEmulated=false mMtpReserveSpace=0 mAllowMassStorage=false mMaxFileSize=0 mOwner=null]
  2508. I/SystemServer(  771): LockSettingsService
  2509. I/SystemServer(  771): Device Policy
  2510. I/SystemServer(  771): Status Bar
  2511. I/SystemServer(  771): Clipboard Service
  2512. D/MountService(  771): volume state changed for /storage/sdcard1 (null -> unmounted)
  2513. D/MountService(  771): volume state changed for /storage/usbdisk0 (null -> removed)
  2514. I/PackageManager(  771): No secure containers on sdcard
  2515. I/SystemServer(  771): NetworkManagement Service
  2516. W/PackageManager(  771): Unknown permission android.permission.ADD_SYSTEM_SERVICE in package com.android.phone
  2517. I/SystemServer(  771): Text Service Manager Service
  2518. W/PackageManager(  771): Unknown permission com.android.vending.billing.IBillingAccountService.BIND2 in package com.google.android.gsf.login
  2519. W/PackageManager(  771): Unknown permission com.android.chrome.TOS_ACKED in package com.google.android.gsf.login
  2520. W/PackageManager(  771): Unknown permission com.google.android.gallery3d.permission.GALLERY_PROVIDER in package com.android.bluetooth
  2521. W/PackageManager(  771): Unknown permission android.permission.MMS_PUSH in package com.android.bluetooth
  2522. W/PackageManager(  771): Not granting permission android.permission.SEND_DOWNLOAD_COMPLETED_INTENTS to package com.android.browser (protectionLevel=2 flags=0x89be45)
  2523. W/PackageManager(  771): Unknown permission com.google.android.gm.permission.READ_GMAIL in package com.google.android.talk
  2524. W/PackageManager(  771): Unknown permission com.cyanogenmod.filemanager.permissions.READ_THEME in package com.cyanogenmod.filemanager
  2525. W/PackageManager(  771): Unknown permission com.google.android.gallery3d.permission.PICASA_STORE in package com.android.dreams.phototable
  2526. W/PackageManager(  771): Unknown permission android.permission.READ_OWNER_DATA in package com.google.android.setupwizard
  2527. W/PackageManager(  771): Unknown permission android.permission.WRITE_OWNER_DATA in package com.google.android.setupwizard
  2528. W/PackageManager(  771): Unknown permission com.google.android.voicesearch.SHORTCUTS_ACCESS in package com.google.android.googlequicksearchbox
  2529. W/PackageManager(  771): Unknown permission com.google.googlenav.friend.permission.OPT_IN in package com.google.android.googlequicksearchbox
  2530. W/PackageManager(  771): Unknown permission com.google.android.apps.maps.permission.PREFETCH in package com.google.android.googlequicksearchbox
  2531. W/PackageManager(  771): Unknown permission com.google.android.apps.googlevoice.permission.AUTO_SEND in package com.google.android.googlequicksearchbox
  2532. W/PackageManager(  771): Unknown permission com.google.android.gm.permission.AUTO_SEND in package com.google.android.googlequicksearchbox
  2533. W/PackageManager(  771): Not granting permission android.permission.SEND_DOWNLOAD_COMPLETED_INTENTS to package com.android.vending (protectionLevel=2 flags=0x8abe45)
  2534. W/PackageManager(  771): Unknown permission android.permission.ACCESS_4G_RADIO_DISABLE in package com.android.systemui
  2535. W/PackageManager(  771): Unknown permission android.permission.ACCESS_4G_STATE in package com.android.systemui
  2536. W/PackageManager(  771): Unknown permission android.permission.CHANGE_4G_STATE in package com.android.systemui
  2537. W/PackageManager(  771): Unknown permission com.google.android.gallery3d.permission.GALLERY_PROVIDER in package com.android.exchange
  2538. W/PackageManager(  771): Unknown permission com.google.android.gallery3d.permission.GALLERY_PROVIDER in package com.android.email
  2539. W/PackageManager(  771): Not granting permission android.permission.DEVICE_POWER to package com.android.deskclock (protectionLevel=2 flags=0x88be45)
  2540. W/PackageManager(  771): Not granting permission android.permission.READ_DREAM_STATE to package com.google.android.gsf (protectionLevel=2 flags=0x883e45)
  2541. D/dalvikvm(  771): GC_CONCURRENT freed 294K, 43% free 4337K/7592K, paused 2ms+4ms, total 32ms
  2542. I/SystemServer(  771): NetworkStats Service
  2543. I/SystemServer(  771): NetworkPolicy Service
  2544. I/SystemServer(  771): Wi-Fi P2pService
  2545. I/SystemServer(  771): Wi-Fi Service
  2546. E/CommandListener(  495): Failed to open /proc/sys/net/ipv6/conf/wlan0/disable_ipv6: No such file or directory
  2547. E/WifiStateMachine(  771): Failed to disable IPv6: java.lang.IllegalStateException: command '1 interface ipv6 wlan0 disable' failed with '400 1 Failed to change IPv6 state (No such file or directory)'
  2548. I/SystemServer(  771): Connectivity Service
  2549. D/ConnectivityService(  771): ConnectivityService starting up
  2550. E/MobileDataStateTracker(  771): default: Ignoring feature request because could not acquire PhoneService
  2551. D/BluetoothTethering(  771): startMonitoring: target: Handler (com.android.server.ConnectivityService$NetworkStateTrackerHandler) {4150d920}
  2552. D/BluetoothManagerService(  771): Message: 20
  2553. D/BluetoothManagerService(  771): Added callback: android.bluetooth.BluetoothAdapter$1@4150b878:true
  2554. E/MobileDataStateTracker(  771): default: Could not enable APN type "default"
  2555. D/BluetoothPan(  771): BluetoothPan() call bindService
  2556. D/BluetoothManagerService(  771): Message: 30
  2557. W/ContextImpl(  771): Calling a method in the system process without a qualified user: android.app.ContextImpl.bindService:1458 android.bluetooth.BluetoothPan.<init>:141 android.bluetooth.BluetoothAdapter.getProfileProxy:1164 android.bluetooth.BluetoothTetheringDataTracker.startMonitoring:110 com.android.server.ConnectivityService.<init>:528
  2558. D/BluetoothPan(  771): BluetoothPan(), bindService called
  2559. I/WifiService(  771): WifiService starting up with Wi-Fi disabled
  2560. D/dalvikvm(  771): GC_CONCURRENT freed 277K, 41% free 4480K/7592K, paused 7ms+2ms, total 50ms
  2561. I/SystemServer(  771): Network Service Discovery Service
  2562. D/NsdService(  771): Network service discovery enabled true
  2563. I/SystemServer(  771): Throttle Service
  2564. I/SystemServer(  771): FM receiver Service
  2565. I/        (  771): registerAndroidFmRadioReceiver
  2566. I/        (  771): registerAndroidFmRadioTransmitter
  2567. I/FmReceiverService(  771): FmReceiverService created
  2568. I/FmTransmitterService(  771): FmTransmitterService created
  2569. I/SystemServer(  771): FM transmitter Service
  2570. I/SystemServer(  771): UpdateLock Service
  2571. I/SystemServer(  771): Profile Manager
  2572. W/Profile (  771): Null Pointer - UUID not found for Default.  New UUID generated: f69ce3f0-817f-4d0b-bb32-c0fe629f6e34
  2573. W/Profile (  771): Null Pointer - UUID not found for Work.  New UUID generated: 70f4ec27-3343-4ea3-8ab7-821f5e78d53a
  2574. W/Profile (  771): Null Pointer - UUID not found for Home.  New UUID generated: b0b317d5-790f-4001-87b1-77bfea353a51
  2575. W/Profile (  771): Null Pointer - UUID not found for Silent.  New UUID generated: 1ef915e1-cc30-4c17-b1a3-3ed15ea174bb
  2576. W/Profile (  771): Null Pointer - UUID not found for Night.  New UUID generated: d582023f-8ed4-42c8-be72-d234db5360d9
  2577. D/ProfileService(  771): Set active profile to: f69ce3f0-817f-4d0b-bb32-c0fe629f6e34 - Default
  2578. D/ProfileService(  771): Saving profile data...
  2579. D/ProfileService(  771): Save completed.
  2580. I/SystemServer(  771): Notification Manager
  2581. I/SystemServer(  771): Device Storage Monitor
  2582. I/SystemServer(  771): Location Manager
  2583. I/SystemServer(  771): Country Detector
  2584. I/SystemServer(  771): Search Service
  2585. W/AudioPolicyManagerBase(  500): setForceUse() invalid usage 4
  2586. E/AudioPolicyManagerBase(  500): getDeviceForStrategy() earpiece device not found
  2587. E/AudioPolicyManagerBase(  500): getDeviceForStrategy() earpiece device not found
  2588. I/SystemServer(  771): DropBox Service
  2589. I/SystemServer(  771): Wallpaper Service
  2590. W/WallpaperService(  771): no current wallpaper -- first boot?
  2591. I/SystemServer(  771): Audio Service
  2592. D/audio_hw_primary(  500): Set output volume: 0.000000, gain -Inf
  2593. E/AudioPolicyManagerBase(  500): getDeviceForStrategy() earpiece device not found
  2594. E/AudioPolicyManagerBase(  500): getDeviceForStrategy() earpiece device not found
  2595. D/audio_hw_primary(  500): Set output volume: 0.000000, gain -Inf
  2596. I/SystemServer(  771): Dock Observer
  2597. W/DockObserver(  771): This kernel does not have dock station support
  2598. I/SystemServer(  771): Wired Accessory Observer
  2599. W/WiredAccessoryManager(  771): This kernel does not have samsung usb dock audio support
  2600. I/SystemServer(  771): USB Service
  2601. D/dalvikvm(  771): GC_CONCURRENT freed 413K, 40% free 4590K/7592K, paused 3ms+2ms, total 45ms
  2602. I/SystemServer(  771): Serial Service
  2603. I/SystemServer(  771): Twilight Service
  2604. I/SystemServer(  771): UI Mode Manager Service
  2605. I/SystemServer(  771): Backup Service
  2606. V/BackupManagerService(  771): No ancestral data
  2607. I/cat     (  488): <6>[   91.915802] acc_open
  2608. I/cat     (  488): <6>[   91.915832] acc_release
  2609. I/BackupManagerService(  771): Backup enabled => false
  2610. I/SystemServer(  771): AppWidget Service
  2611. I/SystemServer(  771): Recognition Service
  2612. I/SystemServer(  771): DiskStats Service
  2613. I/SystemServer(  771): SamplingProfiler Service
  2614. I/SystemServer(  771): NetworkTimeUpdateService
  2615. I/SystemServer(  771): CommonTimeManagementService
  2616. I/SystemServer(  771): CertBlacklister
  2617. I/SystemServer(  771): Dreams Service
  2618. I/SystemServer(  771): AssetRedirectionManager Service
clone this paste RAW Paste Data