Guest User

Untitled

a guest
Jun 30th, 2010
164
0
Never
Not a member of Pastebin yet? Sign Up, it unlocks many cool features!
text 103.17 KB | None | 0 0
  1. ==> Starting build()...
  2. patching file configure.ac
  3. patching file doc/coreutils.texi
  4. Hunk #1 succeeded at 15107 (offset 26 lines).
  5. Hunk #2 succeeded at 15153 (offset 26 lines).
  6. Hunk #3 succeeded at 15194 (offset 26 lines).
  7. patching file src/Makefile.am
  8. Hunk #1 succeeded at 364 (offset 3 lines).
  9. patching file src/su.c
  10. Hunk #3 succeeded at 130 (offset -9 lines).
  11. Hunk #4 succeeded at 226 (offset -9 lines).
  12. Hunk #5 succeeded at 253 (offset -9 lines).
  13. Hunk #6 succeeded at 315 (offset -9 lines).
  14. Hunk #7 succeeded at 329 (offset -9 lines).
  15. Hunk #8 succeeded at 373 (offset -9 lines).
  16. Hunk #9 succeeded at 388 (offset -9 lines).
  17. Hunk #10 succeeded at 420 (offset -9 lines).
  18. Hunk #11 succeeded at 487 (offset -9 lines).
  19. Hunk #12 succeeded at 715 (offset -9 lines).
  20. Hunk #13 succeeded at 727 (offset -9 lines).
  21. patching file src/uname.c
  22. Hunk #2 succeeded at 160 (offset 17 lines).
  23. Hunk #3 succeeded at 418 (offset 52 lines).
  24. Hunk #4 succeeded at 478 (offset 52 lines).
  25. autoreconf: Entering directory `.'
  26. autoreconf: configure.ac: not running autopoint: --install not given
  27. autoreconf: running: aclocal -I m4
  28. autoreconf: configure.ac: tracing
  29. autoreconf: configure.ac: not using Libtool
  30. autoreconf: running: /usr/bin/autoconf
  31. autoreconf: running: /usr/bin/autoheader
  32. autoreconf: running: automake --no-force
  33. autoreconf: Leaving directory `.'
  34. checking for a BSD-compatible install... /bin/install -c
  35. checking whether build environment is sane... yes
  36. checking for a thread-safe mkdir -p... /bin/mkdir -p
  37. checking for gawk... gawk
  38. checking whether make sets $(MAKE)... yes
  39. checking for style of include used by make... GNU
  40. checking for gcc... gcc
  41. checking whether the C compiler works... yes
  42. checking for C compiler default output file name... a.out
  43. checking for suffix of executables...
  44. checking whether we are cross compiling... no
  45. checking for suffix of object files... o
  46. checking whether we are using the GNU C compiler... yes
  47. checking whether gcc accepts -g... yes
  48. checking for gcc option to accept ISO C89... none needed
  49. checking dependency style of gcc... gcc3
  50. checking for gcc option to accept ISO C99... -std=gnu99
  51. checking for gcc -std=gnu99 option to accept ISO Standard C... (cached) -std=gnu99
  52. checking whether gcc -std=gnu99 and cc understand -c and -o together... yes
  53. checking how to run the C preprocessor... gcc -std=gnu99 -E
  54. checking for grep that handles long lines and -e... /bin/grep
  55. checking for egrep... /bin/grep -E
  56. checking whether gcc -std=gnu99 needs -traditional... no
  57. checking for ranlib... ranlib
  58. checking whether ln -s works... yes
  59. checking build system type... i686-pc-linux-gnu
  60. checking host system type... i686-pc-linux-gnu
  61. checking for ANSI C header files... yes
  62. checking for sys/types.h... yes
  63. checking for sys/stat.h... yes
  64. checking for stdlib.h... yes
  65. checking for string.h... yes
  66. checking for memory.h... yes
  67. checking for strings.h... yes
  68. checking for inttypes.h... yes
  69. checking for stdint.h... yes
  70. checking for unistd.h... yes
  71. checking minix/config.h usability... no
  72. checking minix/config.h presence... no
  73. checking for minix/config.h... no
  74. checking whether it is safe to define __EXTENSIONS__... yes
  75. checking for _LARGEFILE_SOURCE value needed for large files... no
  76. configure: autobuild project... GNU coreutils
  77. configure: autobuild revision... 8.5
  78. configure: autobuild hostname... yomomma
  79. configure: autobuild timestamp... 20100701T003424Z
  80. checking for inline... inline
  81. checking for working alloca.h... yes
  82. checking for alloca... yes
  83. checking for arpa/inet.h... yes
  84. checking for sys/socket.h... yes
  85. checking for ctype.h... yes
  86. checking for dirent.h... yes
  87. checking for errno.h... yes
  88. checking for libgen.h... yes
  89. checking for fcntl.h... yes
  90. checking for sys/param.h... yes
  91. checking for float.h... yes
  92. checking for wctype.h... yes
  93. checking for stdio_ext.h... yes
  94. checking for sys/vfs.h... yes
  95. checking for sys/fs_types.h... no
  96. checking for netdb.h... yes
  97. checking for netinet/in.h... yes
  98. checking for getopt.h... yes
  99. checking for termios.h... yes
  100. checking for sys/time.h... yes
  101. checking for grp.h... yes
  102. checking for iconv.h... yes
  103. checking for stdint.h... (cached) yes
  104. checking for wchar.h... yes
  105. checking for inttypes.h... (cached) yes
  106. checking for langinfo.h... yes
  107. checking for stddef.h... yes
  108. checking for xlocale.h... yes
  109. checking for locale.h... yes
  110. checking for math.h... yes
  111. checking for sys/mman.h... yes
  112. checking for unistd.h... (cached) yes
  113. checking for sys/statvfs.h... yes
  114. checking for sys/select.h... yes
  115. checking for utmp.h... yes
  116. checking for utmpx.h... yes
  117. checking for selinux/selinux.h... no
  118. checking for signal.h... yes
  119. checking for stdarg.h... yes
  120. checking for stdio.h... yes
  121. checking for stdlib.h... (cached) yes
  122. checking for string.h... (cached) yes
  123. checking for sys/stat.h... (cached) yes
  124. checking for sys/utsname.h... yes
  125. checking for time.h... yes
  126. checking for utime.h... yes
  127. checking for priv.h... no
  128. checking for sys/wait.h... yes
  129. checking for sys/ioctl.h... yes
  130. checking for hurd.h... no
  131. checking for paths.h... yes
  132. checking for stropts.h... yes
  133. checking for sys/resource.h... yes
  134. checking for sys/systeminfo.h... no
  135. checking for syslog.h... yes
  136. checking for pwd.h... yes
  137. checking for OS.h... no
  138. checking whether the preprocessor supports include_next... yes
  139. checking for d_ino member in directory struct... yes
  140. checking whether system is Windows or MSDOS... no
  141. checking for long file names... yes
  142. checking for pathconf... yes
  143. checking for btowc... yes
  144. checking for canonicalize_file_name... yes
  145. checking for realpath... yes
  146. checking for chown... yes
  147. checking for fchown... yes
  148. checking for fdopendir... yes
  149. checking for dup2... yes
  150. checking for faccessat... yes
  151. checking for lchmod... no
  152. checking for access... yes
  153. checking for fchdir... yes
  154. checking for fcntl... yes
  155. checking for mempcpy... yes
  156. checking for isblank... yes
  157. checking for iswctype... yes
  158. checking for mbsrtowcs... yes
  159. checking for wmemchr... yes
  160. checking for wmemcpy... yes
  161. checking for wmempcpy... yes
  162. checking for __fpending... yes
  163. checking for fpurge... no
  164. checking for __fpurge... yes
  165. checking for __freading... yes
  166. checking for fsync... yes
  167. checking for fstatfs... yes
  168. checking for getdelim... yes
  169. checking for getdtablesize... yes
  170. checking for microuptime... no
  171. checking for nanouptime... no
  172. checking for flockfile... yes
  173. checking for funlockfile... yes
  174. checking for __fsetlocking... yes
  175. checking for tcgetattr... yes
  176. checking for tcsetattr... yes
  177. checking for gettimeofday... yes
  178. checking for nanotime... no
  179. checking for getusershell... yes
  180. checking for link... yes
  181. checking for readlink... yes
  182. checking for linkat... yes
  183. checking for symlink... yes
  184. checking for lstat... yes
  185. checking for mbsinit... yes
  186. checking for mbrtowc... yes
  187. checking for mbrlen... yes
  188. checking for mbslen... no
  189. checking for isascii... yes
  190. checking for mprotect... yes
  191. checking for memchr... yes
  192. checking for getgrouplist... yes
  193. checking for fchmod... yes
  194. checking for mkstemp... yes
  195. checking for alarm... yes
  196. checking for nl_langinfo... yes
  197. checking for utmpname... yes
  198. checking for utmpxname... yes
  199. checking for wcscoll... yes
  200. checking for setenv... yes
  201. checking for settimeofday... yes
  202. checking for stime... yes
  203. checking for sigaction... yes
  204. checking for sigaltstack... yes
  205. checking for siginterrupt... yes
  206. checking for stpncpy... yes
  207. checking for strdup... yes
  208. checking for tzset... yes
  209. checking for strndup... yes
  210. checking for symlinkat... yes
  211. checking for readlinkat... yes
  212. checking for localtime_r... yes
  213. checking for pipe... yes
  214. checking for futimes... yes
  215. checking for futimesat... yes
  216. checking for futimens... yes
  217. checking for utimensat... yes
  218. checking for lutimes... yes
  219. checking for vasnprintf... no
  220. checking for wcrtomb... yes
  221. checking for iswcntrl... yes
  222. checking for iswblank... yes
  223. checking for wcwidth... yes
  224. checking for getegid... yes
  225. checking for newlocale... yes
  226. checking for sleep... yes
  227. checking for shutdown... yes
  228. checking for usleep... yes
  229. checking for wctob... yes
  230. checking for strxfrm... yes
  231. checking for directio... no
  232. checking for posix_fadvise... yes
  233. checking for endgrent... yes
  234. checking for endpwent... yes
  235. checking for ftruncate... yes
  236. checking for iswspace... yes
  237. checking for mkfifo... yes
  238. checking for setgroups... yes
  239. checking for sethostname... yes
  240. checking for sync... yes
  241. checking for sysctl... yes
  242. checking for sysinfo... yes
  243. checking for tcgetpgrp... yes
  244. checking for C/C++ restrict keyword... __restrict
  245. checking whether <wchar.h> uses 'inline' correctly... yes
  246. checking for nl_langinfo and CODESET... yes
  247. checking for a traditional french locale... none
  248. checking whether strtold conforms to C99... yes
  249. checking for size_t... yes
  250. checking whether malloc, realloc, calloc are POSIX compliant... yes
  251. checking whether // is distinct from /... no
  252. checking whether realpath works... yes
  253. checking for uid_t in sys/types.h... yes
  254. checking for unistd.h... (cached) yes
  255. checking for working chown... yes
  256. checking whether chown dereferences symlinks... yes
  257. checking whether chown honors trailing slash... yes
  258. checking whether chown always updates ctime... yes
  259. checking whether byte ordering is bigendian... no
  260. checking if environ is properly declared... yes
  261. checking for complete errno.h... yes
  262. checking whether strerror_r is declared... yes
  263. checking for strerror_r... yes
  264. checking whether strerror_r returns char *... yes
  265. checking whether setregid is declared... yes
  266. checking type of array argument to getgroups... gid_t
  267. checking for getgroups... yes
  268. checking for working getgroups... yes
  269. checking whether lstat correctly handles trailing slash... yes
  270. checking whether unlink honors trailing slashes... yes
  271. checking whether unlink of a parent directory fails is it should... guessing yes
  272. checking for mode_t... yes
  273. checking for promoted mode_t type... mode_t
  274. checking for fchmodat... yes
  275. checking for fstatat... yes
  276. checking for mkdirat... yes
  277. checking for openat... (cached) no
  278. checking for unlinkat... yes
  279. checking for fchownat... yes
  280. checking whether fchownat works with AT_SYMLINK_NOFOLLOW... yes
  281. checking for working fcntl.h... yes
  282. checking for fseeko... yes
  283. checking for st_dm_mode in struct stat... no
  284. checking whether strmode is declared... no
  285. checking for mbstate_t... yes
  286. checking whether stdin defaults to large file offsets... yes
  287. checking whether <sys/socket.h> is self-contained... yes
  288. checking for shutdown... (cached) yes
  289. checking whether <sys/socket.h> defines the SHUT_* macros... yes
  290. checking for struct sockaddr_storage... yes
  291. checking for sa_family_t... yes
  292. checking whether socket is declared without a macro... no
  293. checking whether connect is declared without a macro... no
  294. checking whether accept is declared without a macro... no
  295. checking whether bind is declared without a macro... no
  296. checking whether getpeername is declared without a macro... no
  297. checking whether getsockname is declared without a macro... no
  298. checking whether getsockopt is declared without a macro... no
  299. checking whether listen is declared without a macro... no
  300. checking whether recv is declared without a macro... no
  301. checking whether send is declared without a macro... no
  302. checking whether recvfrom is declared without a macro... no
  303. checking whether sendto is declared without a macro... no
  304. checking whether setsockopt is declared without a macro... no
  305. checking whether shutdown is declared without a macro... no
  306. checking whether accept4 is declared without a macro... no
  307. checking for library containing gethostbyname... none required
  308. checking for gethostbyname... yes
  309. checking for library containing getservbyname... none required
  310. checking for getservbyname... yes
  311. checking for IPv4 sockets... yes
  312. checking for IPv6 sockets... yes
  313. checking for library containing inet_ntop... none required
  314. checking whether inet_ntop is declared... yes
  315. checking whether getcwd (NULL, 0) allocates memory for result... yes
  316. checking whether getcwd is declared... yes
  317. checking for stdbool.h that conforms to C99... yes
  318. checking for _Bool... yes
  319. checking for compound literals... yes
  320. checking whether struct tm is in sys/time.h or time.h... time.h
  321. checking for struct tm.tm_gmtoff... yes
  322. checking whether getdelim is declared... yes
  323. checking for arithmetic hrtime_t... no
  324. checking for long long int... yes
  325. checking whether getline is declared... yes
  326. checking for ssize_t... yes
  327. checking for getopt.h... (cached) yes
  328. checking for getopt_long_only... yes
  329. checking whether optreset is declared... no
  330. checking whether getopt_clip is declared... no
  331. checking whether getopt is POSIX compatible... yes
  332. checking for working GNU getopt function... yes
  333. checking whether getenv is declared... yes
  334. checking whether getpass is declared... yes
  335. checking whether fflush_unlocked is declared... yes
  336. checking whether flockfile is declared... yes
  337. checking whether fputs_unlocked is declared... yes
  338. checking whether funlockfile is declared... yes
  339. checking whether putc_unlocked is declared... yes
  340. checking for struct timeval... yes
  341. checking whether gettimeofday is declared without a macro... yes
  342. checking for ld used by GCC... /usr/bin/ld
  343. checking if the linker (/usr/bin/ld) is GNU ld... yes
  344. checking for shared library run path origin... done
  345. checking for off_t... yes
  346. checking for unsigned long long int... yes
  347. checking whether stdint.h conforms to C99... yes
  348. checking for inttypes.h... (cached) yes
  349. checking whether the inttypes.h PRIxNN macros are broken... no
  350. checking whether imaxabs is declared... yes
  351. checking whether imaxdiv is declared... yes
  352. checking whether strtoimax is declared... yes
  353. checking whether strtoumax is declared... yes
  354. checking where to find the exponent in a 'float'... word 0 bit 23
  355. checking whether getc_unlocked is declared... yes
  356. checking whether we are using the GNU C Library 2.1 or newer... yes
  357. checking for wchar_t... yes
  358. checking whether NULL can be used in arbitrary expressions... yes
  359. checking whether imported symbols can be declared weak... yes
  360. checking pthread.h usability... yes
  361. checking pthread.h presence... yes
  362. checking for pthread.h... yes
  363. checking for pthread_kill in -lpthread... yes
  364. checking for multithread API to use... posix
  365. checking for stdlib.h... (cached) yes
  366. checking for GNU libc compatible malloc... yes
  367. checking whether mbrtowc and mbstate_t are properly declared... (cached) yes
  368. checking for a traditional japanese locale... none
  369. checking for a transitional chinese locale... none
  370. checking for a french Unicode locale... none
  371. checking whether mbrtowc handles incomplete characters... guessing yes
  372. checking whether mbrtowc works as well as mbtowc... guessing yes
  373. checking whether mbrtowc handles a NULL string argument... guessing yes
  374. checking whether mbrtowc has a correct return value... guessing yes
  375. checking whether mbrtowc returns 0 when parsing a NUL character... guessing yes
  376. checking for mmap... yes
  377. checking for MAP_ANONYMOUS... yes
  378. checking whether memchr works... yes
  379. checking whether memrchr is declared... yes
  380. checking for special C compiler options needed for large files... no
  381. checking for _FILE_OFFSET_BITS value needed for large files... 64
  382. checking whether <sys/select.h> is self-contained... yes
  383. checking whether select is declared without a macro... yes
  384. checking for library containing setsockopt... none needed
  385. checking whether select supports a 0 argument... yes
  386. checking for external symbol _system_configuration... no
  387. checking for desired default level of POSIX conformance... none-specified
  388. checking whether rmdir works... yes
  389. checking whether lstat accepts an empty string... no
  390. checking for library containing setfilecon... no
  391. checking whether setenv validates arguments... yes
  392. checking search.h usability... yes
  393. checking search.h presence... yes
  394. checking for search.h... yes
  395. checking for tsearch... yes
  396. checking whether snprintf is declared... yes
  397. checking whether strdup is declared... yes
  398. checking for working strerror function... yes
  399. checking whether memmem is declared without a macro... yes
  400. checking whether mempcpy is declared without a macro... yes
  401. checking whether memrchr is declared without a macro... yes
  402. checking whether rawmemchr is declared without a macro... yes
  403. checking whether stpcpy is declared without a macro... yes
  404. checking whether stpncpy is declared without a macro... yes
  405. checking whether strchrnul is declared without a macro... yes
  406. checking whether strdup is declared without a macro... yes
  407. checking whether strncat is declared without a macro... yes
  408. checking whether strndup is declared without a macro... yes
  409. checking whether strnlen is declared without a macro... yes
  410. checking whether strpbrk is declared without a macro... yes
  411. checking whether strsep is declared without a macro... yes
  412. checking whether strcasestr is declared without a macro... yes
  413. checking whether strtok_r is declared without a macro... yes
  414. checking whether strsignal is declared without a macro... yes
  415. checking whether strverscmp is declared without a macro... yes
  416. checking whether strndup is declared... (cached) yes
  417. checking whether strnlen is declared... (cached) yes
  418. checking whether strsignal is declared... (cached) yes
  419. checking whether sys_siglist is declared... yes
  420. checking whether stat file-mode macros are broken... no
  421. checking for struct timespec in <time.h>... yes
  422. checking whether clearerr_unlocked is declared... yes
  423. checking whether feof_unlocked is declared... yes
  424. checking whether ferror_unlocked is declared... yes
  425. checking whether fgets_unlocked is declared... yes
  426. checking whether fputc_unlocked is declared... yes
  427. checking whether fread_unlocked is declared... yes
  428. checking whether fwrite_unlocked is declared... yes
  429. checking whether getchar_unlocked is declared... yes
  430. checking whether putchar_unlocked is declared... yes
  431. checking whether the utimes function works... yes
  432. checking for struct utimbuf... yes
  433. checking for wint_t... yes
  434. checking for inttypes.h... yes
  435. checking for stdint.h... yes
  436. checking for intmax_t... yes
  437. checking whether snprintf returns a byte count as in C99... yes
  438. checking for snprintf... yes
  439. checking for strnlen... yes
  440. checking for wcslen... yes
  441. checking for wcsnlen... yes
  442. checking for mbrtowc... (cached) yes
  443. checking for wcrtomb... (cached) yes
  444. checking whether _snprintf is declared... no
  445. checking whether printf supports size specifiers as in C99... yes
  446. checking whether printf supports 'long double' arguments... yes
  447. checking whether printf supports infinite 'double' arguments... yes
  448. checking whether printf supports infinite 'long double' arguments... no
  449. checking whether printf supports the 'a' and 'A' directives... yes
  450. checking whether printf supports the 'F' directive... yes
  451. checking whether printf supports the 'n' directive... yes
  452. checking whether printf supports the 'ls' directive... yes
  453. checking whether printf supports POSIX/XSI format strings with positions... yes
  454. checking whether printf supports the grouping flag... yes
  455. checking whether printf supports the left-adjust flag correctly... yes
  456. checking whether printf supports the zero flag correctly... yes
  457. checking whether printf supports large precisions... yes
  458. checking whether printf survives out-of-memory conditions... yes
  459. checking POSIX termios... yes
  460. checking whether use of TIOCGWINSZ requires termios.h... no
  461. checking whether alarm is declared... yes
  462. checking whether ungetc works on arbitrary bytes... yes
  463. checking sys/acl.h usability... yes
  464. checking sys/acl.h presence... yes
  465. checking for sys/acl.h... yes
  466. checking for library containing acl_get_file... -lacl
  467. checking for acl_get_file... yes
  468. checking for acl_get_fd... yes
  469. checking for acl_set_file... yes
  470. checking for acl_set_fd... yes
  471. checking for acl_free... yes
  472. checking for acl_from_mode... yes
  473. checking for acl_from_text... yes
  474. checking for acl_delete_def_file... yes
  475. checking for acl_extended_file... yes
  476. checking for acl_delete_fd_np... no
  477. checking for acl_delete_file_np... no
  478. checking for acl_copy_ext_native... no
  479. checking for acl_create_entry_np... no
  480. checking for acl_to_short_text... no
  481. checking for acl_free_text... no
  482. checking for working acl_get_file... yes
  483. checking acl/libacl.h usability... yes
  484. checking acl/libacl.h presence... yes
  485. checking for acl/libacl.h... yes
  486. checking for acl_entries... yes
  487. checking for ACL_FIRST_ENTRY... yes
  488. checking for ACL_TYPE_EXTENDED... no
  489. checking for alloca as a compiler built-in... yes
  490. checking whether inet_ntop is declared without a macro... yes
  491. checking whether inet_pton is declared without a macro... yes
  492. checking whether to enable assertions... yes
  493. checking for atexit... yes
  494. checking whether btowc(0) is correct... yes
  495. checking whether btowc(EOF) is correct... guessing yes
  496. checking for GNU libc compatible calloc... yes
  497. checking whether this system has an arbitrary file name length limit... yes
  498. checking for library containing clock_gettime... -lrt
  499. checking for clock_gettime... yes
  500. checking for clock_settime... yes
  501. checking whether isblank is declared without a macro... yes
  502. checking for d_ino member in directory struct... (cached) yes
  503. checking for d_type member in directory struct... yes
  504. checking whether alphasort is declared without a macro... yes
  505. checking whether dirfd is declared without a macro... yes
  506. checking whether fdopendir is declared without a macro... yes
  507. checking whether scandir is declared without a macro... yes
  508. checking for dirfd... yes
  509. checking whether dirfd is declared... (cached) yes
  510. checking whether dirfd is a macro... no
  511. checking whether // is distinct from /... (cached) no
  512. checking whether dup2 works... yes
  513. checking for error_at_line... yes
  514. checking for euidaccess... yes
  515. checking whether fcntl handles F_DUPFD correctly... yes
  516. checking whether fcntl understands F_DUPFD_CLOEXEC... needs runtime check
  517. checking whether fcntl is declared without a macro... yes
  518. checking whether openat is declared without a macro... yes
  519. checking whether fdopendir is declared... (cached) yes
  520. checking whether fdopendir works... yes
  521. checking whether fflush works on input streams... no
  522. checking for struct stat.st_blocks... yes
  523. checking for flexible array member... yes
  524. checking for working GNU fnmatch... yes
  525. checking whether fopen recognizes a trailing slash... yes
  526. checking whether __fpending is declared... yes
  527. checking whether fpurge is declared... no
  528. checking whether frexp() can be used without linking with libm... yes
  529. checking whether frexp works... yes
  530. checking whether frexpl is declared... yes
  531. checking whether frexpl() can be used without linking with libm... yes
  532. checking whether frexpl works... yes
  533. checking for sys/mount.h... yes
  534. configure: checking how to get file system space usage
  535. checking for statvfs function (SVR4)... no
  536. checking for 3-argument statfs function (DEC OSF/1)... no
  537. checking for two-argument statfs with statfs.bsize member (AIX, 4.3BSD)... yes
  538. checking dustat.h usability... no
  539. checking dustat.h presence... no
  540. checking for dustat.h... no
  541. checking sys/fs/s5param.h usability... no
  542. checking sys/fs/s5param.h presence... no
  543. checking for sys/fs/s5param.h... no
  544. checking sys/filsys.h usability... no
  545. checking sys/filsys.h presence... no
  546. checking for sys/filsys.h... no
  547. checking sys/statfs.h usability... yes
  548. checking sys/statfs.h presence... yes
  549. checking for sys/statfs.h... yes
  550. checking for statfs that truncates block counts... no
  551. checking for ftello... yes
  552. checking for fchmodat... (cached) yes
  553. checking for fstatat... (cached) yes
  554. checking for mkdirat... (cached) yes
  555. checking for openat... (cached) no
  556. checking for unlinkat... (cached) yes
  557. checking for fchownat... (cached) yes
  558. checking whether fchownat works with AT_SYMLINK_NOFOLLOW... (cached) yes
  559. checking for struct statfs.f_type... yes
  560. configure: checking how to do getaddrinfo, freeaddrinfo and getnameinfo
  561. checking for library containing getaddrinfo... none required
  562. checking for getaddrinfo... yes
  563. checking for gai_strerror (possibly via ws2tcpip.h)... yes
  564. checking for struct sockaddr.sa_len... no
  565. checking whether getaddrinfo is declared... yes
  566. checking whether freeaddrinfo is declared... yes
  567. checking whether gai_strerror is declared... yes
  568. checking whether getnameinfo is declared... yes
  569. checking for struct addrinfo... yes
  570. checking whether getcwd handles long file names properly... no, but it is partly working
  571. checking for getpagesize... yes
  572. checking whether getcwd aborts when 4k < cwd_length < 16k... no
  573. checking for struct tm.tm_zone... yes
  574. checking for working getdelim function... yes
  575. checking whether getgroups handles negative values... yes
  576. checking for gethostname... yes
  577. checking for HOST_NAME_MAX... yes
  578. checking whether gethrtime is declared... no
  579. checking whether CLOCK_MONOTONIC or CLOCK_REALTIME is defined... yes
  580. checking for getline... yes
  581. checking for working getline function... yes
  582. checking for getloadavg... yes
  583. checking for pstat_getdynamic... no
  584. checking for kstat_open in -lkstat... no
  585. checking for perfstat_cpu_total in -lperfstat... no
  586. checking for getloadavg... yes
  587. checking whether getloadavg requires setgid... no
  588. checking sys/loadavg.h usability... no
  589. checking sys/loadavg.h presence... no
  590. checking for sys/loadavg.h... no
  591. checking whether getloadavg is declared... yes
  592. checking for getpagesize... (cached) yes
  593. checking whether getpagesize is declared... yes
  594. checking whether __fsetlocking is declared... yes
  595. checking whether gettimeofday clobbers localtime buffer... no
  596. checking for gettimeofday with POSIX signature... almost
  597. checking whether getusershell is declared... yes
  598. checking for group_member... yes
  599. checking host operating system... GNU/Linux
  600. checking for library containing gethostbyname... (cached) none required
  601. checking for gethostbyname... (cached) yes
  602. checking for iconv... yes
  603. checking for working iconv... yes
  604. checking for iconv declaration...
  605. extern size_t iconv (iconv_t cd, char * *inbuf, size_t *inbytesleft, char * *outbuf, size_t *outbytesleft);
  606. checking for library containing inet_ntop... (cached) none required
  607. checking whether inet_ntop is declared... (cached) yes
  608. checking whether the compiler generally respects inline... yes
  609. checking whether inttypes.h conforms to C99... yes
  610. checking whether INT32_MAX < INTMAX_MAX... yes
  611. checking whether INT64_MAX == LONG_MAX... no
  612. checking whether UINT32_MAX < UINTMAX_MAX... yes
  613. checking whether UINT64_MAX == ULONG_MAX... no
  614. checking whether imaxabs is declared without a macro... yes
  615. checking whether imaxdiv is declared without a macro... yes
  616. checking whether strtoimax is declared without a macro... yes
  617. checking whether strtoumax is declared without a macro... yes
  618. checking for isapipe... no
  619. checking whether pipes are FIFOs (and for their link count)... yes (1)
  620. checking whether isnan(double) can be used without linking with libm... yes
  621. checking whether isnan(float) can be used without linking with libm... yes
  622. checking whether isnan(float) works... yes
  623. checking whether isnan(long double) can be used without linking with libm... yes
  624. checking whether isnanl works... no
  625. checking where to find the exponent in a 'long double'... word 2 bit 0
  626. checking whether langinfo.h defines CODESET... yes
  627. checking whether langinfo.h defines ERA... yes
  628. checking whether nl_langinfo is declared without a macro... yes
  629. checking for lchown... yes
  630. checking for C compiler flag to ignore unused libraries... -Wl,--as-needed
  631. checking whether link handles trailing slash correctly... yes
  632. checking whether link(2) dereferences a symlink... no
  633. checking whether linkat(,AT_SYMLINK_FOLLOW) works... need runtime check
  634. checking whether locale.h conforms to POSIX:2001... yes
  635. checking whether locale.h defines locale_t... yes
  636. checking whether duplocale is declared without a macro... yes
  637. checking for pthread_rwlock_t... yes
  638. checking whether lseek detects pipes... yes
  639. checking for stdlib.h... (cached) yes
  640. checking for GNU libc compatible malloc... (cached) yes
  641. checking whether NAN macro works... yes
  642. checking whether HUGE_VAL works... yes
  643. checking whether acosl is declared without a macro... yes
  644. checking whether asinl is declared without a macro... yes
  645. checking whether atanl is declared without a macro... yes
  646. checking whether ceilf is declared without a macro... yes
  647. checking whether ceill is declared without a macro... yes
  648. checking whether cosl is declared without a macro... yes
  649. checking whether expl is declared without a macro... yes
  650. checking whether floorf is declared without a macro... yes
  651. checking whether floorl is declared without a macro... yes
  652. checking whether frexpl is declared without a macro... yes
  653. checking whether ldexpl is declared without a macro... yes
  654. checking whether logb is declared without a macro... yes
  655. checking whether logl is declared without a macro... yes
  656. checking whether round is declared without a macro... yes
  657. checking whether roundf is declared without a macro... yes
  658. checking whether roundl is declared without a macro... yes
  659. checking whether sinl is declared without a macro... yes
  660. checking whether sqrtl is declared without a macro... yes
  661. checking whether tanl is declared without a macro... yes
  662. checking whether trunc is declared without a macro... yes
  663. checking whether truncf is declared without a macro... yes
  664. checking whether truncl is declared without a macro... yes
  665. checking whether mbrtowc handles incomplete characters... (cached) guessing yes
  666. checking whether mbrtowc works as well as mbtowc... (cached) guessing yes
  667. checking whether mbrtowc handles a NULL string argument... (cached) guessing yes
  668. checking whether mbrtowc has a correct return value... (cached) guessing yes
  669. checking whether mbrtowc returns 0 when parsing a NUL character... (cached) guessing yes
  670. checking whether mbrtowc handles incomplete characters... (cached) guessing yes
  671. checking whether mbrtowc works as well as mbtowc... (cached) guessing yes
  672. checking whether mbrtowc handles incomplete characters... (cached) guessing yes
  673. checking whether mbrtowc works as well as mbtowc... (cached) guessing yes
  674. checking whether mbsrtowcs works... guessing yes
  675. checking whether mbswidth is declared in <wchar.h>... no
  676. checking for mbstate_t... (cached) yes
  677. checking for working memcmp... yes
  678. checking for working strcoll... yes
  679. checking for memcpy... yes
  680. checking for memmove... yes
  681. checking for mempcpy... (cached) yes
  682. checking for memrchr... yes
  683. checking for memset... yes
  684. checking whether mkdir handles trailing slash... yes
  685. checking whether mkdir handles trailing dot... yes
  686. checking for working mkstemp... yes
  687. checking for working mktime... yes
  688. checking for listmntent... no
  689. checking for getmntinfo... no
  690. checking for sys/ucred.h... no
  691. checking for sys/mount.h... (cached) yes
  692. checking mntent.h usability... yes
  693. checking mntent.h presence... yes
  694. checking for mntent.h... yes
  695. checking for sys/fs_types.h... (cached) no
  696. checking for struct fsstat.f_fstypename... no
  697. checking for library containing getmntent... none required
  698. checking for getmntent... yes
  699. checking for listmntent of Cray/Unicos-9... no
  700. checking for mntctl function and struct vmount... no
  701. checking for one-argument getmntent function... yes
  702. checking sys/mntent.h usability... no
  703. checking sys/mntent.h presence... no
  704. checking for sys/mntent.h... no
  705. checking for struct statfs.f_fstypename... no
  706. checking for library containing nanosleep... none required
  707. checking for working nanosleep... yes
  708. checking whether <netinet/in.h> is self-contained... yes
  709. checking for sys/pstat.h... no
  710. checking for sys/sysmp.h... no
  711. checking for sys/param.h... (cached) yes
  712. checking for sys/sysctl.h... yes
  713. checking for sched_getaffinity... yes
  714. checking for sched_getaffinity_np... no
  715. checking for pstat_getdynamic... (cached) no
  716. checking for sysmp... no
  717. checking for sysctl... (cached) yes
  718. checking for glibc compatible sched_getaffinity... yes
  719. checking for obstacks... yes
  720. checking whether open recognizes a trailing slash... yes
  721. checking for fchmodat... (cached) yes
  722. checking for fstatat... (cached) yes
  723. checking for mkdirat... (cached) yes
  724. checking for openat... (cached) no
  725. checking for unlinkat... (cached) yes
  726. checking for fchownat... (cached) yes
  727. checking whether fchownat works with AT_SYMLINK_NOFOLLOW... (cached) yes
  728. checking for perl5.005 or newer... yes
  729. checking for sys/pstat.h... (cached) no
  730. checking for sys/sysmp.h... (cached) no
  731. checking for sys/sysinfo.h... yes
  732. checking for machine/hal_sysinfo.h... no
  733. checking for sys/table.h... no
  734. checking for sys/param.h... (cached) yes
  735. checking for sys/systemcfg.h... no
  736. checking for sys/sysctl.h... (cached) yes
  737. checking for pstat_getstatic... no
  738. checking for pstat_getdynamic... (cached) no
  739. checking for sysmp... (cached) no
  740. checking for getsysinfo... no
  741. checking for sysctl... (cached) yes
  742. checking for table... no
  743. checking for a shell that conforms to POSIX... /bin/sh
  744. checking whether frexp can be used without linking with libm... (cached) yes
  745. checking whether frexp works... (cached) yes
  746. checking whether ldexp can be used without linking with libm... yes
  747. checking whether frexpl can be used without linking with libm... (cached) yes
  748. checking whether frexpl works... (cached) yes
  749. checking whether frexpl is declared... (cached) yes
  750. checking whether ldexpl can be used without linking with libm... yes
  751. checking whether ldexpl works... yes
  752. checking whether ldexpl is declared... (cached) yes
  753. checking for getppriv... no
  754. checking whether program_invocation_name is declared... yes
  755. checking whether program_invocation_short_name is declared... yes
  756. checking for putenv compatible with GNU and SVID... yes
  757. checking for raise... yes
  758. checking whether readlink signature is correct... yes
  759. checking whether readlink handles trailing slash correctly... yes
  760. checking whether getutent is declared... yes
  761. checking for struct utmpx.ut_user... yes
  762. checking for struct utmp.ut_user... yes
  763. checking for struct utmpx.ut_name... yes
  764. checking for struct utmp.ut_name... yes
  765. checking for struct utmpx.ut_type... yes
  766. checking for struct utmp.ut_type... yes
  767. checking for struct utmpx.ut_pid... yes
  768. checking for struct utmp.ut_pid... yes
  769. checking for struct utmpx.ut_id... yes
  770. checking for struct utmp.ut_id... yes
  771. checking for struct utmpx.ut_exit... yes
  772. checking for struct utmp.ut_exit... yes
  773. checking for struct utmpx.ut_exit.ut_exit... no
  774. checking for struct utmp.ut_exit.ut_exit... no
  775. checking for struct utmpx.ut_exit.e_exit... yes
  776. checking for struct utmp.ut_exit.e_exit... yes
  777. checking for struct utmpx.ut_exit.ut_termination... no
  778. checking for struct utmp.ut_exit.ut_termination... no
  779. checking for struct utmpx.ut_exit.e_termination... yes
  780. checking for struct utmp.ut_exit.e_termination... yes
  781. checking for stdlib.h... (cached) yes
  782. checking for GNU libc compatible realloc... yes
  783. checking for working re_compile_pattern... yes
  784. checking whether rename honors trailing slash on destination... yes
  785. checking whether rename honors trailing slash on source... yes
  786. checking whether rename manages hard links correctly... yes
  787. checking whether rename manages existing destinations correctly... yes
  788. checking whether rmdir works... (cached) yes
  789. checking for rpmatch... yes
  790. checking whether select supports a 0 argument... (cached) yes
  791. checking selinux/flask.h usability... no
  792. checking selinux/flask.h presence... no
  793. checking for selinux/flask.h... no
  794. checking for selinux/selinux.h... (cached) no
  795. checking selinux/context.h usability... no
  796. checking selinux/context.h presence... no
  797. checking for selinux/context.h... no
  798. checking for library containing getservbyname... (cached) none required
  799. checking for getservbyname... (cached) yes
  800. checking for sig2str... no
  801. checking for struct sigaction.sa_sigaction... yes
  802. checking for volatile sig_atomic_t... yes
  803. checking whether sigaction is declared without a macro... yes
  804. checking whether sigaddset is declared without a macro... yes
  805. checking whether sigdelset is declared without a macro... yes
  806. checking whether sigemptyset is declared without a macro... yes
  807. checking whether sigfillset is declared without a macro... yes
  808. checking whether sigismember is declared without a macro... yes
  809. checking whether sigpending is declared without a macro... yes
  810. checking whether sigprocmask is declared without a macro... yes
  811. checking for signbit macro... yes
  812. checking for signbit compiler built-ins... yes
  813. checking for sigprocmask... yes
  814. checking for stdint.h... (cached) yes
  815. checking for SIZE_MAX... yes
  816. checking for snprintf... (cached) yes
  817. checking whether snprintf respects a size of 1... yes
  818. checking for library containing setsockopt... (cached) none needed
  819. checking for socklen_t... yes
  820. checking for ssize_t... (cached) yes
  821. checking whether stat handles trailing slashes on directories... yes
  822. checking whether stat handles trailing slashes on files... yes
  823. checking for struct stat.st_atim.tv_nsec... yes
  824. checking whether struct stat.st_atim is of type struct timespec... yes
  825. checking for struct stat.st_birthtimespec.tv_nsec... no
  826. checking for struct stat.st_birthtimensec... no
  827. checking for struct stat.st_birthtim.tv_nsec... no
  828. checking for va_copy... yes
  829. checking whether NULL can be used in arbitrary expressions... (cached) yes
  830. checking whether stdint.h conforms to C99... (cached) yes
  831. checking whether dprintf is declared without a macro... yes
  832. checking whether fpurge is declared without a macro... no
  833. checking whether fseeko is declared without a macro... yes
  834. checking whether ftello is declared without a macro... yes
  835. checking whether getdelim is declared without a macro... yes
  836. checking whether getline is declared without a macro... yes
  837. checking whether popen is declared without a macro... yes
  838. checking whether renameat is declared without a macro... yes
  839. checking whether snprintf is declared without a macro... yes
  840. checking whether tmpfile is declared without a macro... yes
  841. checking whether vdprintf is declared without a macro... yes
  842. checking whether vsnprintf is declared without a macro... yes
  843. checking for random.h... no
  844. checking for struct random_data... yes
  845. checking whether atoll is declared without a macro... yes
  846. checking whether canonicalize_file_name is declared without a macro... yes
  847. checking whether getloadavg is declared without a macro... yes
  848. checking whether getsubopt is declared without a macro... yes
  849. checking whether grantpt is declared without a macro... yes
  850. checking whether mkdtemp is declared without a macro... yes
  851. checking whether mkostemp is declared without a macro... yes
  852. checking whether mkostemps is declared without a macro... yes
  853. checking whether mkstemp is declared without a macro... yes
  854. checking whether mkstemps is declared without a macro... yes
  855. checking whether ptsname is declared without a macro... yes
  856. checking whether random_r is declared without a macro... yes
  857. checking whether initstat_r is declared without a macro... no
  858. checking whether srandom_r is declared without a macro... yes
  859. checking whether setstate_r is declared without a macro... yes
  860. checking whether realpath is declared without a macro... yes
  861. checking whether rpmatch is declared without a macro... yes
  862. checking whether setenv is declared without a macro... yes
  863. checking whether strtod is declared without a macro... yes
  864. checking whether strtoll is declared without a macro... yes
  865. checking whether strtoull is declared without a macro... yes
  866. checking whether unlockpt is declared without a macro... yes
  867. checking whether unsetenv is declared without a macro... yes
  868. checking for stpcpy... yes
  869. checking for working stpncpy... yes
  870. checking for strcspn... yes
  871. checking for working strndup... yes
  872. checking for working strnlen... yes
  873. checking for strpbrk... yes
  874. checking for strsignal... yes
  875. checking whether strsignal always returns a string... yes
  876. checking for working strtod... yes
  877. checking whether strtod obeys C99... yes
  878. checking whether <inttypes.h> defines strtoimax as a macro... no
  879. checking for strtoimax... yes
  880. checking for strtol... yes
  881. checking for strtoll... yes
  882. checking for strtoul... yes
  883. checking for strtoull... yes
  884. checking whether <inttypes.h> defines strtoumax as a macro... no
  885. checking for strtoumax... yes
  886. checking whether symlink handles trailing slash correctly... yes
  887. checking whether <sys/select.h> is self-contained... (cached) yes
  888. checking whether select is declared without a macro... (cached) yes
  889. checking whether <sys/socket.h> is self-contained... (cached) yes
  890. checking for shutdown... (cached) yes
  891. checking whether <sys/socket.h> defines the SHUT_* macros... (cached) yes
  892. checking for struct sockaddr_storage... (cached) yes
  893. checking for sa_family_t... (cached) yes
  894. checking whether socket is declared without a macro... (cached) no
  895. checking whether connect is declared without a macro... (cached) no
  896. checking whether accept is declared without a macro... (cached) no
  897. checking whether bind is declared without a macro... (cached) no
  898. checking whether getpeername is declared without a macro... (cached) no
  899. checking whether getsockname is declared without a macro... (cached) no
  900. checking whether getsockopt is declared without a macro... (cached) no
  901. checking whether listen is declared without a macro... (cached) no
  902. checking whether recv is declared without a macro... (cached) no
  903. checking whether send is declared without a macro... (cached) no
  904. checking whether recvfrom is declared without a macro... (cached) no
  905. checking whether sendto is declared without a macro... (cached) no
  906. checking whether setsockopt is declared without a macro... (cached) no
  907. checking whether shutdown is declared without a macro... (cached) no
  908. checking whether accept4 is declared without a macro... (cached) no
  909. checking for nlink_t... yes
  910. checking whether fchmodat is declared without a macro... yes
  911. checking whether fstatat is declared without a macro... yes
  912. checking whether futimens is declared without a macro... yes
  913. checking whether lchmod is declared without a macro... yes
  914. checking whether lstat is declared without a macro... yes
  915. checking whether mkdirat is declared without a macro... yes
  916. checking whether mkfifo is declared without a macro... yes
  917. checking whether mkfifoat is declared without a macro... yes
  918. checking whether mknod is declared without a macro... yes
  919. checking whether mknodat is declared without a macro... yes
  920. checking whether stat is declared without a macro... yes
  921. checking whether utimensat is declared without a macro... yes
  922. checking for struct utsname... yes
  923. checking whether uname is declared without a macro... yes
  924. checking whether localtime_r is compatible with its POSIX signature... yes
  925. checking whether tzset clobbers localtime buffer... no
  926. checking for uname... yes
  927. checking whether chown is declared without a macro... yes
  928. checking whether dup2 is declared without a macro... yes
  929. checking whether dup3 is declared without a macro... yes
  930. checking whether environ is declared without a macro... yes
  931. checking whether euidaccess is declared without a macro... yes
  932. checking whether faccessat is declared without a macro... yes
  933. checking whether fchdir is declared without a macro... yes
  934. checking whether fchownat is declared without a macro... yes
  935. checking whether fsync is declared without a macro... yes
  936. checking whether ftruncate is declared without a macro... yes
  937. checking whether getcwd is declared without a macro... yes
  938. checking whether getdomainname is declared without a macro... yes
  939. checking whether getdtablesize is declared without a macro... yes
  940. checking whether getgroups is declared without a macro... yes
  941. checking whether gethostname is declared without a macro... yes
  942. checking whether getlogin is declared without a macro... yes
  943. checking whether getlogin_r is declared without a macro... yes
  944. checking whether getpagesize is declared without a macro... yes
  945. checking whether getusershell is declared without a macro... yes
  946. checking whether setusershell is declared without a macro... yes
  947. checking whether endusershell is declared without a macro... yes
  948. checking whether lchown is declared without a macro... yes
  949. checking whether link is declared without a macro... yes
  950. checking whether linkat is declared without a macro... yes
  951. checking whether lseek is declared without a macro... yes
  952. checking whether pipe2 is declared without a macro... yes
  953. checking whether pread is declared without a macro... yes
  954. checking whether readlink is declared without a macro... yes
  955. checking whether readlinkat is declared without a macro... yes
  956. checking whether rmdir is declared without a macro... yes
  957. checking whether sleep is declared without a macro... yes
  958. checking whether symlink is declared without a macro... yes
  959. checking whether symlinkat is declared without a macro... yes
  960. checking whether ttyname_r is declared without a macro... yes
  961. checking whether unlink is declared without a macro... yes
  962. checking whether unlinkat is declared without a macro... yes
  963. checking whether usleep is declared without a macro... yes
  964. checking whether unlink honors trailing slashes... (cached) yes
  965. checking whether unlink of a parent directory fails is it should... (cached) guessing yes
  966. checking whether a running program can be unlinked... yes
  967. checking for unsetenv... yes
  968. checking for unsetenv() return type... int
  969. checking whether unsetenv works on duplicates... yes
  970. checking for /proc/uptime... yes
  971. checking for ptrdiff_t... yes
  972. checking for vasprintf... yes
  973. checking for vasprintf... (cached) yes
  974. checking for ptrdiff_t... (cached) yes
  975. checking for ptrdiff_t... (cached) yes
  976. checking whether btowc is declared without a macro... yes
  977. checking whether wctob is declared without a macro... yes
  978. checking whether mbsinit is declared without a macro... yes
  979. checking whether mbrtowc is declared without a macro... yes
  980. checking whether mbrlen is declared without a macro... yes
  981. checking whether mbsrtowcs is declared without a macro... yes
  982. checking whether mbsnrtowcs is declared without a macro... yes
  983. checking whether wcrtomb is declared without a macro... yes
  984. checking whether wcsrtombs is declared without a macro... yes
  985. checking whether wcsnrtombs is declared without a macro... yes
  986. checking whether wcwidth is declared without a macro... yes
  987. checking whether mbrtowc handles incomplete characters... (cached) guessing yes
  988. checking whether mbrtowc works as well as mbtowc... (cached) guessing yes
  989. checking whether wcrtomb return value is correct... guessing yes
  990. checking whether iswcntrl works... yes
  991. checking whether wcwidth is declared... (cached) yes
  992. checking whether wcwidth works reasonably in UTF-8 locales... yes
  993. checking whether use of TIOCGWINSZ requires sys/ioctl.h... yes
  994. checking whether use of TIOCGWINSZ requires termios.h... (cached) no
  995. checking whether use of struct winsize requires sys/ptem.h... no
  996. checking for stdint.h... (cached) yes
  997. checking for a traditional french locale... (cached) none
  998. checking for a french Unicode locale... (cached) none
  999. checking for a traditional french locale... (cached) none
  1000. checking for a turkish Unicode locale... none
  1001. checking whether byte ordering is bigendian... (cached) no
  1002. checking for library containing inet_pton... none required
  1003. checking whether inet_pton is declared... (cached) yes
  1004. checking whether byte ordering is bigendian... (cached) no
  1005. checking for ioctl... yes
  1006. checking for ioctl with POSIX signature... no
  1007. checking where to find the exponent in a 'double'... word 1 bit 20
  1008. checking where to find the exponent in a 'float'... (cached) word 0 bit 23
  1009. checking where to find the exponent in a 'long double'... (cached) word 2 bit 0
  1010. checking for a traditional french locale... (cached) none
  1011. checking for a french Unicode locale... (cached) none
  1012. checking for a traditional japanese locale... (cached) none
  1013. checking for a transitional chinese locale... (cached) none
  1014. checking for a turkish Unicode locale... (cached) none
  1015. checking for a french Unicode locale... (cached) none
  1016. checking for a traditional french locale... (cached) none
  1017. checking for a french Unicode locale... (cached) none
  1018. checking for a traditional japanese locale... (cached) none
  1019. checking for a transitional chinese locale... (cached) none
  1020. checking for a french Unicode locale... (cached) none
  1021. checking for a transitional chinese locale... (cached) none
  1022. checking for mmap... (cached) yes
  1023. checking for MAP_ANONYMOUS... yes
  1024. checking for mmap... (cached) yes
  1025. checking for MAP_ANONYMOUS... yes
  1026. checking for mmap... (cached) yes
  1027. checking for MAP_ANONYMOUS... yes
  1028. checking for a traditional french locale... (cached) none
  1029. checking for a french Unicode locale... (cached) none
  1030. checking for a traditional french locale... (cached) none
  1031. checking for a french Unicode locale... (cached) none
  1032. checking whether sleep is declared... (cached) yes
  1033. checking for working sleep... yes
  1034. checking for wchar_t... (cached) yes
  1035. checking for wint_t... (cached) yes
  1036. checking whether <sys/ioctl.h> declares ioctl... yes
  1037. checking whether ioctl is declared without a macro... yes
  1038. checking for pthread_atfork... yes
  1039. checking for useconds_t... yes
  1040. checking whether usleep allows large arguments... yes
  1041. checking for a traditional french locale... (cached) none
  1042. checking for a french Unicode locale... (cached) none
  1043. checking for a traditional japanese locale... (cached) none
  1044. checking for a transitional chinese locale... (cached) none
  1045. checking whether wctob works... guessing yes
  1046. checking whether wctob is declared... (cached) yes
  1047. checking for sched_yield in -lrt... yes
  1048. checking for library containing strerror... none required
  1049. checking for function prototypes... yes
  1050. checking for string.h... (cached) yes
  1051. checking for working volatile... yes
  1052. checking for sys/sysctl.h... (cached) yes
  1053. checking for pid_t... yes
  1054. checking whether sys/types.h defines makedev... yes
  1055. checking whether time.h and sys/time.h may both be included... yes
  1056. checking whether geteuid is declared... yes
  1057. checking whether getlogin is declared... (cached) yes
  1058. checking whether getuid is declared... yes
  1059. checking whether getgrgid is declared... yes
  1060. checking whether getpwuid is declared... yes
  1061. checking whether ttyname is declared... yes
  1062. checking attr/error_context.h usability... yes
  1063. checking attr/error_context.h presence... yes
  1064. checking for attr/error_context.h... yes
  1065. checking attr/libattr.h usability... yes
  1066. checking attr/libattr.h presence... yes
  1067. checking for attr/libattr.h... yes
  1068. checking for library containing attr_copy_file... -lattr
  1069. checking for attr_copy_file... yes
  1070. checking for inline... (cached) inline
  1071. checking for struct stat.st_author... no
  1072. checking for ino_t... yes
  1073. checking for major_t... no
  1074. checking for minor_t... no
  1075. checking for matchpathcon_init_prefix... no
  1076. checking for inotify_init... yes
  1077. checking nfs/vfs.h usability... no
  1078. checking nfs/vfs.h presence... no
  1079. checking for nfs/vfs.h... no
  1080. checking for struct statfs.f_namelen... yes
  1081. checking for struct statfs.f_type... (cached) yes
  1082. checking for library containing fdatasync... none required
  1083. checking for fdatasync... yes
  1084. checking for cap_get_file in -lcap... yes
  1085. checking sys/capability.h usability... yes
  1086. checking sys/capability.h presence... yes
  1087. checking for sys/capability.h... yes
  1088. checking vfork.h usability... no
  1089. checking vfork.h presence... no
  1090. checking for vfork.h... no
  1091. checking for fork... yes
  1092. checking for vfork... yes
  1093. checking for working fork... yes
  1094. checking for working vfork... (cached) yes
  1095. checking for chroot... yes
  1096. checking for gethostid... yes
  1097. checking whether use of struct winsize requires sys/ptem.h... (cached) no
  1098. checking whether localtime caches TZ... no
  1099. checking for initgroups... yes
  1100. checking for syslog... yes
  1101. checking for 3-argument setpriority function... yes
  1102. checking ut_host in struct utmp... yes
  1103. checking for sysctl... (cached) yes
  1104. checking for sys/sysctl.h... (cached) yes
  1105. checking whether we can get the system boot time... yes
  1106. checking POSIX termios... (cached) yes
  1107. checking whether use of TIOCGWINSZ requires sys/ioctl.h... (cached) yes
  1108. checking whether termios.h needs _XOPEN_SOURCE... no
  1109. checking c_line in struct termios... yes
  1110. checking whether use of struct winsize requires sys/ptem.h... (cached) no
  1111. checking whether use of TIOCGWINSZ requires termios.h... (cached) no
  1112. checking whether strsignal is declared... (cached) yes
  1113. checking whether sys_siglist is declared... (cached) yes
  1114. checking whether _sys_siglist is declared... yes
  1115. checking whether __sys_siglist is declared... no
  1116. checking for main in -lypsec... no
  1117. checking for main in -lldgc... no
  1118. checking for library containing yp_match... no
  1119. checking for library containing getspnam... none required
  1120. checking shadow.h usability... yes
  1121. checking shadow.h presence... yes
  1122. checking for shadow.h... yes
  1123. checking for struct spwd.sp_pwdp... yes
  1124. checking for getspnam... yes
  1125. checking for library containing crypt... -lcrypt
  1126. checking for library containing __gmpz_init... -lgmp
  1127. checking whether this is an ELF system... yes
  1128. configure: WARNING: 'hostname' is already not being installed
  1129. checking whether NLS is requested... yes
  1130. checking for msgfmt... /usr/bin/msgfmt
  1131. checking for gmsgfmt... /usr/bin/msgfmt
  1132. checking for xgettext... /usr/bin/xgettext
  1133. checking for msgmerge... /usr/bin/msgmerge
  1134. checking for CFPreferencesCopyAppValue... no
  1135. checking for CFLocaleCopyCurrent... no
  1136. checking for GNU gettext in libc... yes
  1137. checking whether to use NLS... yes
  1138. checking where the gettext function comes from... libc
  1139. checking for a traditional french locale... (cached) none
  1140. configure: creating ./config.status
  1141. config.status: creating Makefile
  1142. config.status: creating doc/Makefile
  1143. config.status: creating lib/Makefile
  1144. config.status: creating man/Makefile
  1145. config.status: creating po/Makefile.in
  1146. config.status: creating src/Makefile
  1147. config.status: creating tests/Makefile
  1148. config.status: creating gnulib-tests/Makefile
  1149. config.status: creating lib/config.h
  1150. config.status: executing depfiles commands
  1151. config.status: executing po-directories commands
  1152. config.status: creating po/POTFILES
  1153. config.status: creating po/Makefile
  1154. make all-recursive
  1155. make[1]: Entering directory `/media/storage/.build/build/core/coreutils/src/coreutils-8.5'
  1156. Making all in lib
  1157. make[2]: Entering directory `/media/storage/.build/build/core/coreutils/src/coreutils-8.5/lib'
  1158. GEN alloca.h
  1159. GEN arg-nonnull.h
  1160. GEN warn-on-use.h
  1161. GEN c++defs.h
  1162. GEN configmake.h
  1163. GEN unused-parameter.h
  1164. GEN netdb.h
  1165. GEN selinux/selinux.h
  1166. GEN selinux/context.h
  1167. GEN stdlib.h
  1168. GEN signal.h
  1169. GEN stdio.h
  1170. GEN string.h
  1171. GEN sys/select.h
  1172. GEN sys/socket.h
  1173. GEN sys/stat.h
  1174. GEN sys/time.h
  1175. GEN sys/utsname.h
  1176. GEN time.h
  1177. GEN wchar.h
  1178. GEN unistd.h
  1179. GEN wctype.h
  1180. GEN arpa/inet.h
  1181. GEN ctype.h
  1182. GEN dirent.h
  1183. GEN fcntl.h
  1184. GEN iconv.h
  1185. GEN inttypes.h
  1186. GEN langinfo.h
  1187. GEN locale.h
  1188. GEN math.h
  1189. make all-recursive
  1190. make[3]: Entering directory `/media/storage/.build/build/core/coreutils/src/coreutils-8.5/lib'
  1191. make[4]: Entering directory `/media/storage/.build/build/core/coreutils/src/coreutils-8.5/lib'
  1192. CC set-mode-acl.o
  1193. CC copy-acl.o
  1194. CC file-has-acl.o
  1195. CC areadlink.o
  1196. CC areadlink-with-size.o
  1197. CC areadlinkat.o
  1198. CC argv-iter.o
  1199. CC base64.o
  1200. CC c-ctype.o
  1201. CC c-strcasecmp.o
  1202. CC c-strncasecmp.o
  1203. CC close-hook.o
  1204. CC diacrit.o
  1205. CC exitfail.o
  1206. CC fd-safer-flag.o
  1207. CC dup-safer-flag.o
  1208. CC file-set.o
  1209. CC filevercmp.o
  1210. CC freadahead.o
  1211. CC freading.o
  1212. CC freadptr.o
  1213. CC freadseek.o
  1214. CC fseterr.o
  1215. CC full-read.o
  1216. CC full-write.o
  1217. CC getdate.o
  1218. CC hash-pjw.o
  1219. CC hash-triple.o
  1220. CC linebuffer.o
  1221. CC localcharset.o
  1222. CC malloca.o
  1223. CC mbsalign.o
  1224. CC mbchar.o
  1225. CC mbscasecmp.o
  1226. CC mbslen.o
  1227. CC mbsstr.o
  1228. CC mbswidth.o
  1229. CC memchr2.o
  1230. CC memcmp2.o
  1231. CC nproc.o
  1232. CC openat-die.o
  1233. CC printf-frexp.o
  1234. CC printf-frexpl.o
  1235. CC priv-set.o
  1236. CC progname.o
  1237. CC propername.o
  1238. CC randint.o
  1239. CC randperm.o
  1240. CC randread.o
  1241. CC rand-isaac.o
  1242. CC readtokens0.o
  1243. CC savewd.o
  1244. CC sockets.o
  1245. CC striconv.o
  1246. CC strnlen1.o
  1247. CC glthread/threadlib.o
  1248. CC glthread/tls.o
  1249. CC trim.o
  1250. CC unicodeio.o
  1251. CC verror.o
  1252. CC version-etc.o
  1253. CC version-etc-fsf.o
  1254. CC xalloc-die.o
  1255. CC xfreopen.o
  1256. CC xgethostname.o
  1257. CC xmemcoll.o
  1258. CC xprintf.o
  1259. CC xreadlink.o
  1260. CC xstriconv.o
  1261. CC xstrndup.o
  1262. CC xstrtoimax.o
  1263. CC xstrtoumax.o
  1264. CC xvasprintf.o
  1265. CC xasprintf.o
  1266. CC buffer-lcm.o
  1267. CC xmemxfrm.o
  1268. CC argmatch.o
  1269. CC asnprintf.o
  1270. CC asprintf.o
  1271. CC backupfile.o
  1272. CC basename.o
  1273. CC basename-lgpl.o
  1274. CC c-strtold.o
  1275. CC c-strtod.o
  1276. CC canon-host.o
  1277. CC canonicalize.o
  1278. CC chdir-long.o
  1279. CC cloexec.o
  1280. CC close-stream.o
  1281. CC closein.o
  1282. CC closeout.o
  1283. CC creat-safer.o
  1284. CC cycle-check.o
  1285. CC dirchownmod.o
  1286. CC dirname.o
  1287. CC dirname-lgpl.o
  1288. CC dup-safer.o
  1289. CC exclude.o
  1290. CC fcntl.o
  1291. CC fd-safer.o
  1292. CC fflush.o
  1293. CC file-type.o
  1294. CC filemode.o
  1295. CC filenamecat.o
  1296. CC filenamecat-lgpl.o
  1297. CC fopen-safer.o
  1298. CC fprintftime.o
  1299. CC fpurge.o
  1300. CC freopen-safer.o
  1301. CC fseeko.o
  1302. CC fsusage.o
  1303. CC fts.o
  1304. CC getcwd.o
  1305. CC gethrxtime.o
  1306. CC getndelim2.o
  1307. CC getpass.o
  1308. CC gettime.o
  1309. CC getugroups.o
  1310. CC hard-locale.o
  1311. CC hash.o
  1312. CC human.o
  1313. CC i-ring.o
  1314. CC idcache.o
  1315. CC imaxtostr.o
  1316. CC isapipe.o
  1317. CC isnanl.o
  1318. CC linkat.o
  1319. CC long-options.o
  1320. CC md5.o
  1321. CC memcasecmp.o
  1322. CC memcoll.o
  1323. CC mgetgroups.o
  1324. CC mkancesdirs.o
  1325. CC mkdir-p.o
  1326. CC mkstemp-safer.o
  1327. CC modechange.o
  1328. CC mountlist.o
  1329. CC mpsort.o
  1330. CC offtostr.o
  1331. CC open-safer.o
  1332. CC openat.o
  1333. CC openat-proc.o
  1334. CC openat-safer.o
  1335. CC opendir-safer.o
  1336. CC physmem.o
  1337. CC pipe-safer.o
  1338. CC posixtm.o
  1339. CC posixver.o
  1340. CC printf-args.o
  1341. CC printf-parse.o
  1342. CC quote.o
  1343. CC quotearg.o
  1344. CC readtokens.o
  1345. CC readutmp.o
  1346. CC remove.o
  1347. CC root-dev-ino.o
  1348. CC safe-write.o
  1349. CC safe-read.o
  1350. CC same.o
  1351. CC save-cwd.o
  1352. CC savedir.o
  1353. CC selinux-at.o
  1354. CC settime.o
  1355. CC sha1.o
  1356. CC sha256.o
  1357. CC sha512.o
  1358. CC sig2str.o
  1359. CC strftime.o
  1360. CC stripslash.o
  1361. CC tempname.o
  1362. CC uinttostr.o
  1363. CC umaxtostr.o
  1364. CC userspec.o
  1365. CC utimecmp.o
  1366. CC utimens.o
  1367. CC vasnprintf.o
  1368. CC vasprintf.o
  1369. CC vfprintf.o
  1370. CC vprintf.o
  1371. CC write-any-file.o
  1372. CC xgetcwd.o
  1373. CC xmalloc.o
  1374. CC xnanosleep.o
  1375. CC xstrtod.o
  1376. CC xstrtol.o
  1377. CC xstrtol-error.o
  1378. CC xstrtold.o
  1379. CC xstrtoul.o
  1380. CC yesno.o
  1381. CC euidaccess-stat.o
  1382. CC fd-reopen.o
  1383. CC xfts.o
  1384. CC memxfrm.o
  1385. CC strintcmp.o
  1386. CC strnumcmp.o
  1387. GEN ref-add.sed
  1388. GEN charset.alias
  1389. GEN ref-del.sed
  1390. CC glthread/lock.o
  1391. CC unistr/u8-uctomb.o
  1392. CC unistr/u8-uctomb-aux.o
  1393. CC uniwidth/width.o
  1394. AR libcoreutils.a
  1395. make[4]: Leaving directory `/media/storage/.build/build/core/coreutils/src/coreutils-8.5/lib'
  1396. make[3]: Leaving directory `/media/storage/.build/build/core/coreutils/src/coreutils-8.5/lib'
  1397. make[2]: Leaving directory `/media/storage/.build/build/core/coreutils/src/coreutils-8.5/lib'
  1398. Making all in src
  1399. make[2]: Entering directory `/media/storage/.build/build/core/coreutils/src/coreutils-8.5/src'
  1400. GEN wheel-size.h
  1401. GEN wheel.h
  1402. GEN version.c
  1403. GEN version.h
  1404. make all-am
  1405. make[3]: Entering directory `/media/storage/.build/build/core/coreutils/src/coreutils-8.5/src'
  1406. CC version.o
  1407. CC chroot.o
  1408. CC hostid.o
  1409. CC nice.o
  1410. CC users.o
  1411. CC who.o
  1412. CC pinky.o
  1413. CC stty.o
  1414. CC df.o
  1415. CC stdbuf.o
  1416. CC lbracket.o
  1417. CC base64.o
  1418. CC basename.o
  1419. CC cat.o
  1420. CC chcon.o
  1421. CC chgrp.o
  1422. CC chown-core.o
  1423. CC chmod.o
  1424. CC chown.o
  1425. CC cksum.o
  1426. CC comm.o
  1427. CC cp.o
  1428. CC copy.o
  1429. CC cp-hash.o
  1430. CC csplit.o
  1431. CC cut.o
  1432. CC date.o
  1433. CC dd.o
  1434. CC ls.o
  1435. CC ls-dir.o
  1436. CC dircolors.o
  1437. CC dirname.o
  1438. CC du.o
  1439. CC echo.o
  1440. CC env.o
  1441. CC expand.o
  1442. CC expr.o
  1443. CC factor.o
  1444. CC false.o
  1445. CC fmt.o
  1446. CC fold.o
  1447. CC ginstall-install.o
  1448. CC ginstall-prog-fprintf.o
  1449. CC ginstall-copy.o
  1450. CC ginstall-cp-hash.o
  1451. CC head.o
  1452. CC id.o
  1453. CC group-list.o
  1454. CC join.o
  1455. CC link.o
  1456. CC ln.o
  1457. CC logname.o
  1458. CC ls-ls.o
  1459. CC md5sum-md5sum.o
  1460. CC mkdir.o
  1461. CC prog-fprintf.o
  1462. CC mkfifo.o
  1463. CC mknod.o
  1464. CC mktemp.o
  1465. CC mv.o
  1466. CC remove.o
  1467. CC nl.o
  1468. CC nproc.o
  1469. CC nohup.o
  1470. CC od.o
  1471. CC paste.o
  1472. CC pathchk.o
  1473. CC pr.o
  1474. CC printenv.o
  1475. CC printf.o
  1476. CC ptx.o
  1477. CC pwd.o
  1478. CC readlink.o
  1479. CC rm.o
  1480. CC rmdir.o
  1481. CC runcon.o
  1482. CC seq.o
  1483. CC sha1sum-md5sum.o
  1484. CC sha224sum-md5sum.o
  1485. CC sha256sum-md5sum.o
  1486. CC sha384sum-md5sum.o
  1487. CC sha512sum-md5sum.o
  1488. CC shred.o
  1489. CC shuf.o
  1490. CC sleep.o
  1491. CC sort.o
  1492. CC split.o
  1493. CC stat.o
  1494. CC sum.o
  1495. CC sync.o
  1496. CC tac.o
  1497. CC tail.o
  1498. CC tee.o
  1499. CC test.o
  1500. CC timeout.o
  1501. CC operand2sig.o
  1502. CC touch.o
  1503. CC tr.o
  1504. CC true.o
  1505. CC truncate.o
  1506. CC tsort.o
  1507. CC tty.o
  1508. CC uname.o
  1509. CC uname-uname.o
  1510. CC unexpand.o
  1511. CC uniq.o
  1512. CC unlink.o
  1513. CC ls-vdir.o
  1514. CC wc.o
  1515. CC whoami.o
  1516. CC yes.o
  1517. CC su.o
  1518. CC setuidgid.o
  1519. CC getlimits.o
  1520. CC libstdbuf_so-libstdbuf.o
  1521. AR libver.a
  1522. CCLD chroot
  1523. CCLD hostid
  1524. CCLD nice
  1525. CCLD who
  1526. CCLD users
  1527. CCLD pinky
  1528. CCLD stty
  1529. CCLD df
  1530. CCLD stdbuf
  1531. CCLD [
  1532. CCLD base64
  1533. CCLD basename
  1534. CCLD cat
  1535. CCLD chcon
  1536. CCLD chgrp
  1537. CCLD chmod
  1538. CCLD chown
  1539. CCLD cksum
  1540. CCLD comm
  1541. CCLD cp
  1542. CCLD csplit
  1543. CCLD cut
  1544. CCLD date
  1545. CCLD dd
  1546. CCLD dir
  1547. CCLD dircolors
  1548. CCLD dirname
  1549. CCLD du
  1550. CCLD echo
  1551. CCLD env
  1552. CCLD expand
  1553. CCLD expr
  1554. CCLD factor
  1555. CCLD false
  1556. CCLD fmt
  1557. CCLD fold
  1558. CCLD ginstall
  1559. CCLD head
  1560. CCLD id
  1561. CCLD join
  1562. CCLD link
  1563. CCLD ln
  1564. CCLD logname
  1565. CCLD ls
  1566. CCLD md5sum
  1567. CCLD mkdir
  1568. CCLD mkfifo
  1569. CCLD mknod
  1570. CCLD mktemp
  1571. CCLD mv
  1572. CCLD nl
  1573. CCLD nproc
  1574. CCLD nohup
  1575. CCLD od
  1576. CCLD paste
  1577. CCLD pathchk
  1578. CCLD pr
  1579. CCLD printenv
  1580. CCLD printf
  1581. CCLD ptx
  1582. CCLD pwd
  1583. CCLD readlink
  1584. CCLD rm
  1585. CCLD rmdir
  1586. CCLD runcon
  1587. CCLD seq
  1588. CCLD sha1sum
  1589. CCLD sha224sum
  1590. CCLD sha256sum
  1591. CCLD sha384sum
  1592. CCLD sha512sum
  1593. CCLD shred
  1594. CCLD shuf
  1595. CCLD sleep
  1596. CCLD sort
  1597. CCLD split
  1598. CCLD stat
  1599. CCLD sum
  1600. CCLD sync
  1601. CCLD tac
  1602. CCLD tail
  1603. CCLD tee
  1604. CCLD test
  1605. CCLD timeout
  1606. CCLD touch
  1607. CCLD tr
  1608. CCLD true
  1609. CCLD truncate
  1610. CCLD tsort
  1611. CCLD tty
  1612. CCLD uname
  1613. CCLD unexpand
  1614. CCLD uniq
  1615. CCLD unlink
  1616. CCLD vdir
  1617. CCLD wc
  1618. CCLD whoami
  1619. CCLD yes
  1620. CCLD su
  1621. CCLD setuidgid
  1622. CCLD getlimits
  1623. CCLD libstdbuf.so
  1624. make[3]: Leaving directory `/media/storage/.build/build/core/coreutils/src/coreutils-8.5/src'
  1625. make[2]: Leaving directory `/media/storage/.build/build/core/coreutils/src/coreutils-8.5/src'
  1626. Making all in doc
  1627. make[2]: Entering directory `/media/storage/.build/build/core/coreutils/src/coreutils-8.5/doc'
  1628. Updating ./version.texi
  1629. restore=: && backupdir=".am$$" && \
  1630. am__cwd=`pwd` && CDPATH="${ZSH_VERSION+.}:" && cd . && \
  1631. rm -rf $backupdir && mkdir $backupdir && \
  1632. if (/bin/sh /home/build/build/core/coreutils/src/coreutils-8.5/build-aux/missing --run makeinfo --version) >/dev/null 2>&1; then \
  1633. for f in coreutils.info coreutils.info-[0-9] coreutils.info-[0-9][0-9] coreutils.i[0-9] coreutils.i[0-9][0-9]; do \
  1634. if test -f $f; then mv $f $backupdir; restore=mv; else :; fi; \
  1635. done; \
  1636. else :; fi && \
  1637. cd "$am__cwd"; \
  1638. if /bin/sh /home/build/build/core/coreutils/src/coreutils-8.5/build-aux/missing --run makeinfo --no-split -I . \
  1639. -o coreutils.info coreutils.texi; \
  1640. then \
  1641. rc=0; \
  1642. CDPATH="${ZSH_VERSION+.}:" && cd .; \
  1643. else \
  1644. rc=$?; \
  1645. CDPATH="${ZSH_VERSION+.}:" && cd . && \
  1646. $restore $backupdir/* `echo "./coreutils.info" | sed 's|[^/]*$||'`; \
  1647. fi; \
  1648. rm -rf $backupdir; exit $rc
  1649. make[2]: Leaving directory `/media/storage/.build/build/core/coreutils/src/coreutils-8.5/doc'
  1650. Making all in man
  1651. make[2]: Entering directory `/media/storage/.build/build/core/coreutils/src/coreutils-8.5/man'
  1652. GEN uname.1
  1653. GEN su.1
  1654. make[2]: Leaving directory `/media/storage/.build/build/core/coreutils/src/coreutils-8.5/man'
  1655. Making all in po
  1656. make[2]: Entering directory `/media/storage/.build/build/core/coreutils/src/coreutils-8.5/po'
  1657. make[2]: Leaving directory `/media/storage/.build/build/core/coreutils/src/coreutils-8.5/po'
  1658. Making all in tests
  1659. make[2]: Entering directory `/media/storage/.build/build/core/coreutils/src/coreutils-8.5/tests'
  1660. make[2]: Nothing to be done for `all'.
  1661. make[2]: Leaving directory `/media/storage/.build/build/core/coreutils/src/coreutils-8.5/tests'
  1662. Making all in gnulib-tests
  1663. make[2]: Entering directory `/media/storage/.build/build/core/coreutils/src/coreutils-8.5/gnulib-tests'
  1664. GEN arg-nonnull.h
  1665. GEN c++defs.h
  1666. GEN warn-on-use.h
  1667. GEN unused-parameter.h
  1668. GEN sys/ioctl.h
  1669. make all-recursive
  1670. make[3]: Entering directory `/media/storage/.build/build/core/coreutils/src/coreutils-8.5/gnulib-tests'
  1671. Making all in .
  1672. make[4]: Entering directory `/media/storage/.build/build/core/coreutils/src/coreutils-8.5/gnulib-tests'
  1673. make[4]: Nothing to be done for `all-am'.
  1674. make[4]: Leaving directory `/media/storage/.build/build/core/coreutils/src/coreutils-8.5/gnulib-tests'
  1675. make[3]: Leaving directory `/media/storage/.build/build/core/coreutils/src/coreutils-8.5/gnulib-tests'
  1676. make[2]: Leaving directory `/media/storage/.build/build/core/coreutils/src/coreutils-8.5/gnulib-tests'
  1677. make[2]: Entering directory `/media/storage/.build/build/core/coreutils/src/coreutils-8.5'
  1678. make[2]: Nothing to be done for `all-am'.
  1679. make[2]: Leaving directory `/media/storage/.build/build/core/coreutils/src/coreutils-8.5'
  1680. make[1]: Leaving directory `/media/storage/.build/build/core/coreutils/src/coreutils-8.5'
  1681. make check-recursive
  1682. make[1]: Entering directory `/media/storage/.build/build/core/coreutils/src/coreutils-8.5'
  1683. Making check in lib
  1684. make[2]: Entering directory `/media/storage/.build/build/core/coreutils/src/coreutils-8.5/lib'
  1685. make check-recursive
  1686. make[3]: Entering directory `/media/storage/.build/build/core/coreutils/src/coreutils-8.5/lib'
  1687. make[4]: Entering directory `/media/storage/.build/build/core/coreutils/src/coreutils-8.5/lib'
  1688. make[4]: Nothing to be done for `check-am'.
  1689. make[4]: Leaving directory `/media/storage/.build/build/core/coreutils/src/coreutils-8.5/lib'
  1690. make[3]: Leaving directory `/media/storage/.build/build/core/coreutils/src/coreutils-8.5/lib'
  1691. make[2]: Leaving directory `/media/storage/.build/build/core/coreutils/src/coreutils-8.5/lib'
  1692. Making check in src
  1693. make[2]: Entering directory `/media/storage/.build/build/core/coreutils/src/coreutils-8.5/src'
  1694. GEN check-README
  1695. GEN check-duplicate-no-install
  1696. make check-am
  1697. make[3]: Entering directory `/media/storage/.build/build/core/coreutils/src/coreutils-8.5/src'
  1698. make[3]: Nothing to be done for `check-am'.
  1699. make[3]: Leaving directory `/media/storage/.build/build/core/coreutils/src/coreutils-8.5/src'
  1700. make[2]: Leaving directory `/media/storage/.build/build/core/coreutils/src/coreutils-8.5/src'
  1701. Making check in doc
  1702. make[2]: Entering directory `/media/storage/.build/build/core/coreutils/src/coreutils-8.5/doc'
  1703. GEN sc-avoid-builtin
  1704. GEN sc-avoid-io
  1705. GEN sc-avoid-non-zero
  1706. GEN sc-avoid-path
  1707. GEN sc-avoid-timezone
  1708. GEN sc-avoid-zeroes
  1709. GEN sc-exponent-grouping
  1710. GEN sc-lower-case-var
  1711. GEN sc-use-small-caps-NUL
  1712. GEN check-texinfo
  1713. make[2]: Leaving directory `/media/storage/.build/build/core/coreutils/src/coreutils-8.5/doc'
  1714. Making check in man
  1715. make[2]: Entering directory `/media/storage/.build/build/core/coreutils/src/coreutils-8.5/man'
  1716. make[2]: Nothing to be done for `check'.
  1717. make[2]: Leaving directory `/media/storage/.build/build/core/coreutils/src/coreutils-8.5/man'
  1718. Making check in po
  1719. make[2]: Entering directory `/media/storage/.build/build/core/coreutils/src/coreutils-8.5/po'
  1720. make[2]: Leaving directory `/media/storage/.build/build/core/coreutils/src/coreutils-8.5/po'
  1721. Making check in tests
  1722. make[2]: Entering directory `/media/storage/.build/build/core/coreutils/src/coreutils-8.5/tests'
  1723. make check-TESTS
  1724. make[3]: Entering directory `/media/storage/.build/build/core/coreutils/src/coreutils-8.5/tests'
  1725. make[4]: Entering directory `/media/storage/.build/build/core/coreutils/src/coreutils-8.5/tests'
  1726. ./rm/ext3-perf: skipping test: very expensive: disabled by default
  1727. SKIP: rm/ext3-perf
  1728. PASS: tail-2/inotify-hash-abuse
  1729. ./cp/link-heap: skipping test: expensive: disabled by default
  1730. SKIP: cp/link-heap
  1731. ./tail-2/inotify-race: skipping test: very expensive: disabled by default
  1732. SKIP: tail-2/inotify-race
  1733. PASS: rm/cycle
  1734. PASS: tail-2/F-vs-rename
  1735. ./tail-2/inotify-rotate: skipping test: expensive: disabled by default
  1736. SKIP: tail-2/inotify-rotate
  1737. PASS: chmod/no-x
  1738. ./chgrp/basic: skipping test: requires membership in two groups
  1739. SKIP: chgrp/basic
  1740. PASS: rm/dangling-symlink
  1741. PASS: tail-2/inotify-hash-abuse2
  1742. PASS: rm/deep-2
  1743. PASS: misc/invalid-opt
  1744. PASS: rm/dir-no-w
  1745. PASS: rm/dir-nonrecur
  1746. PASS: rm/dot-rel
  1747. PASS: misc/ls-time
  1748. PASS: rm/empty-inacc
  1749. PASS: rm/empty-name
  1750. PASS: rm/isatty
  1751. PASS: rm/f-1
  1752. PASS: rm/deep-1
  1753. PASS: rm/i-1
  1754. ./tail-2/assert: skipping test: very expensive: disabled by default
  1755. SKIP: tail-2/assert
  1756. ./rm/hash: skipping test: expensive: disabled by default
  1757. SKIP: rm/hash
  1758. PASS: rm/fail-eacces
  1759. PASS: rm/i-never
  1760. PASS: rm/fail-eperm
  1761. PASS: rm/i-no-r
  1762. PASS: tail-2/infloop-1
  1763. PASS: rm/ignorable
  1764. PASS: rm/interactive-always
  1765. PASS: rm/inaccessible
  1766. PASS: rm/interactive-once
  1767. PASS: rm/ir-1
  1768. PASS: rm/one-file-system2
  1769. PASS: rm/r-1
  1770. PASS: rm/r-3
  1771. PASS: rm/r-4
  1772. PASS: rm/r-2
  1773. PASS: rm/rm1
  1774. PASS: rm/rm2
  1775. PASS: rm/rm4
  1776. PASS: rm/rm5
  1777. PASS: rm/rm3
  1778. PASS: rm/sunos-1
  1779. PASS: touch/empty-file
  1780. PASS: rm/unread2
  1781. PASS: rm/unread3
  1782. PASS: rm/v-slash
  1783. ./chgrp/default-no-deref: skipping test: requires membership in two groups
  1784. SKIP: chgrp/default-no-deref
  1785. PASS: rm/unreadable
  1786. PASS: rm/readdir-bug
  1787. ./chgrp/deref: skipping test: requires membership in two groups
  1788. SKIP: chgrp/deref
  1789. ./chgrp/no-x: skipping test: requires membership in two groups
  1790. SKIP: chgrp/no-x
  1791. ./chgrp/posix-H: skipping test: requires membership in two groups
  1792. SKIP: chgrp/posix-H
  1793. ./chgrp/recurse: skipping test: requires membership in two groups
  1794. SKIP: chgrp/recurse
  1795. PASS: misc/env
  1796. PASS: misc/seq-long-double
  1797. PASS: misc/ptx
  1798. PASS: misc/seq
  1799. PASS: misc/head-elide-tail
  1800. PASS: misc/head
  1801. PASS: misc/ptx-overrun
  1802. PASS: misc/date-next-dow
  1803. PASS: tail-2/tail-n0f
  1804. PASS: misc/ls-misc
  1805. PASS: misc/xstrtol
  1806. PASS: misc/od
  1807. PASS: tail-2/pid
  1808. ./misc/arch: skipping test: required program(s) not built
  1809. SKIP: misc/arch
  1810. PASS: misc/help-version
  1811. PASS: misc/mktemp
  1812. PASS: misc/pr
  1813. PASS: misc/df-P
  1814. PASS: misc/pwd-option
  1815. ./misc/pwd-unreadable-parent: skipping test: can't use buggy system getcwd
  1816. SKIP: misc/pwd-unreadable-parent
  1817. PASS: misc/test
  1818. PASS: misc/chcon-fail
  1819. PASS: misc/join
  1820. PASS: misc/wc-files0
  1821. PASS: misc/cat-proc
  1822. PASS: misc/wc
  1823. PASS: misc/wc-files0-from
  1824. PASS: misc/wc-parallel
  1825. PASS: misc/cat-buf
  1826. PASS: misc/close-stdout
  1827. PASS: misc/chroot-fail
  1828. PASS: misc/basename
  1829. PASS: misc/csplit
  1830. PASS: misc/date
  1831. PASS: misc/date-sec
  1832. PASS: misc/comm
  1833. PASS: misc/cut
  1834. PASS: misc/dircolors
  1835. PASS: misc/base64
  1836. PASS: misc/df
  1837. PASS: misc/env-null
  1838. PASS: misc/expand
  1839. PASS: misc/dirname
  1840. PASS: misc/false-status
  1841. PASS: misc/fmt-long-line
  1842. PASS: misc/factor
  1843. ./misc/groups-dash: skipping test: required program(s) not built
  1844. SKIP: misc/groups-dash
  1845. PASS: misc/fmt
  1846. PASS: misc/expr
  1847. PASS: misc/fold
  1848. ./misc/groups-version: skipping test: required program(s) not built
  1849. SKIP: misc/groups-version
  1850. ./misc/id-context: skipping test: this system (or maybe just the current file system) lacks SELinux support
  1851. SKIP: misc/id-context
  1852. PASS: misc/id-groups
  1853. PASS: misc/head-pos
  1854. PASS: misc/head-c
  1855. PASS: misc/md5sum-parallel
  1856. PASS: misc/nice-fail
  1857. PASS: misc/mknod
  1858. PASS: misc/md5sum-newline
  1859. PASS: misc/nl
  1860. PASS: misc/md5sum
  1861. PASS: misc/nice
  1862. PASS: misc/nproc-positive
  1863. PASS: misc/od-N
  1864. PASS: misc/nohup
  1865. PASS: misc/nproc-avail
  1866. PASS: misc/od-x8
  1867. PASS: misc/pathchk1
  1868. PASS: misc/printf
  1869. PASS: misc/printenv
  1870. PASS: misc/paste
  1871. PASS: pr/pr-tests
  1872. PASS: misc/printf-hex
  1873. PASS: misc/printf-surprise
  1874. PASS: misc/readlink-fp-loop
  1875. PASS: misc/runcon-no-reorder
  1876. PASS: misc/printf-cov
  1877. PASS: misc/sha256sum
  1878. PASS: misc/sha1sum
  1879. PASS: misc/pwd-long
  1880. PASS: misc/sha224sum
  1881. PASS: misc/shred-exact
  1882. PASS: misc/shred-passes
  1883. PASS: misc/shuf
  1884. PASS: misc/shred-remove
  1885. PASS: misc/sha384sum
  1886. PASS: misc/sha512sum
  1887. PASS: misc/sort-continue
  1888. PASS: misc/sort-compress
  1889. PASS: misc/sort-merge-fdlimit
  1890. PASS: misc/sort-files0-from
  1891. PASS: misc/sort-merge
  1892. PASS: misc/sort-month
  1893. PASS: misc/sort-rand
  1894. PASS: misc/sort-version
  1895. PASS: misc/split-fail
  1896. PASS: misc/split-l
  1897. PASS: misc/split-a
  1898. PASS: misc/sha1sum-vec
  1899. PASS: misc/stat-hyphen
  1900. PASS: misc/stat-fmt
  1901. PASS: misc/stat-slash
  1902. ./misc/stty: skipping test: requires controlling input terminal
  1903. SKIP: misc/stty
  1904. PASS: misc/stat-printf
  1905. PASS: misc/stty-invalid
  1906. ./misc/stty-row-col: skipping test: requires controlling input terminal
  1907. PASS: misc/stdbuf
  1908. SKIP: misc/stty-row-col
  1909. PASS: misc/su-fail
  1910. PASS: misc/sum-sysv
  1911. ./misc/tac-continue: skipping test: FULL_PARTITION_TMPDIR not defined
  1912. SKIP: misc/tac-continue
  1913. PASS: misc/sum
  1914. PASS: misc/tee
  1915. PASS: misc/tee-dash
  1916. PASS: misc/tac
  1917. PASS: misc/test-diag
  1918. PASS: misc/timeout
  1919. PASS: misc/timeout-parameters
  1920. PASS: misc/truncate-dir-fail
  1921. PASS: misc/sort
  1922. PASS: misc/truncate-dangling-symlink
  1923. PASS: misc/tail
  1924. PASS: misc/truncate-fifo
  1925. PASS: misc/truncate-fail-diag
  1926. PASS: misc/truncate-overflow
  1927. PASS: misc/truncate-relative
  1928. PASS: misc/truncate-parameters
  1929. PASS: misc/truncate-no-create-missing
  1930. PASS: misc/tr
  1931. SKIP: misc/tty-eof
  1932. ./misc/xattr: skipping test: failed to set xattr of file
  1933. SKIP: misc/xattr
  1934. PASS: misc/tsort
  1935. SKIP: misc/uniq
  1936. PASS: misc/unexpand
  1937. PASS: misc/od-multiple-t
  1938. PASS: chmod/c-option
  1939. PASS: chmod/inaccessible
  1940. PASS: chmod/equal-x
  1941. PASS: chmod/equals
  1942. PASS: chmod/octal
  1943. PASS: chmod/silent
  1944. PASS: chmod/setgid
  1945. PASS: chmod/umask-x
  1946. PASS: chmod/thru-dangling
  1947. PASS: chown/deref
  1948. PASS: chown/preserve-root
  1949. PASS: cp/abuse
  1950. PASS: cp/backup-1
  1951. PASS: chmod/usage
  1952. PASS: chown/separator
  1953. ./cp/acl: skipping test: '.' is not on a suitable file system for this test
  1954. SKIP: cp/acl
  1955. PASS: cp/backup-dir
  1956. PASS: cp/backup-is-src
  1957. PASS: cp/cp-HL
  1958. PASS: cp/cp-deref
  1959. PASS: cp/cp-i
  1960. PASS: cp/deref-slink
  1961. PASS: cp/cp-parents
  1962. PASS: tail-2/wait
  1963. PASS: cp/dir-rm-dest
  1964. PASS: cp/dir-slash
  1965. PASS: cp/dir-vs-file
  1966. PASS: cp/file-perm-race
  1967. ./cp/existing-perm-race: skipping test: requires membership in two groups
  1968. SKIP: cp/existing-perm-race
  1969. PASS: cp/fail-perm
  1970. PASS: cp/link
  1971. PASS: cp/into-self
  1972. PASS: cp/link-no-deref
  1973. PASS: cp/cp-mv-backup
  1974. PASS: cp/no-deref-link1
  1975. PASS: cp/no-deref-link3
  1976. PASS: cp/no-deref-link2
  1977. PASS: cp/parent-perm-race
  1978. PASS: cp/parent-perm
  1979. PASS: cp/link-preserve
  1980. ./cp/perm: skipping test: very expensive: disabled by default
  1981. SKIP: cp/perm
  1982. PASS: cp/preserve-2
  1983. PASS: cp/preserve-slink-time
  1984. PASS: cp/proc-zero-len
  1985. PASS: cp/r-vs-symlink
  1986. PASS: cp/reflink-perm
  1987. PASS: cp/proc-short-read
  1988. PASS: cp/reflink-auto
  1989. PASS: cp/slink-2-slink
  1990. PASS: cp/sparse
  1991. PASS: cp/special-f
  1992. PASS: cp/src-base-dot
  1993. PASS: df/unreadable
  1994. PASS: cp/thru-dangling
  1995. PASS: cp/symlink-slash
  1996. PASS: dd/direct
  1997. PASS: dd/not-rewound
  1998. PASS: dd/reblock
  1999. PASS: dd/misc
  2000. PASS: dd/skip-seek2
  2001. PASS: dd/stderr
  2002. PASS: dd/skip-seek-past-file
  2003. PASS: dd/unblock
  2004. PASS: dd/skip-seek
  2005. PASS: dd/unblock-sync
  2006. ./df/total-verify: skipping test: df fails
  2007. SKIP: df/total-verify
  2008. ./du/2g: skipping test: very expensive: disabled by default
  2009. SKIP: du/2g
  2010. PASS: du/8gb
  2011. PASS: du/deref-args
  2012. PASS: du/deref
  2013. PASS: du/basic
  2014. PASS: cp/same-file
  2015. PASS: du/exclude
  2016. PASS: du/hard-link
  2017. ./du/fd-leak: skipping test: expensive: disabled by default
  2018. SKIP: du/fd-leak
  2019. PASS: du/inaccessible-cwd
  2020. PASS: du/inacc-dir
  2021. PASS: du/no-x
  2022. PASS: du/inacc-dest
  2023. PASS: du/long-from-unreadable
  2024. PASS: du/no-deref
  2025. PASS: du/files0-from
  2026. PASS: du/restore-wd
  2027. PASS: du/one-file-system
  2028. ./id/no-context: skipping test: this system (or maybe just the current file system) lacks SELinux support
  2029. SKIP: id/no-context
  2030. PASS: du/slash
  2031. ./du/slink: skipping test: `.' is on an XFS file system
  2032. SKIP: du/slink
  2033. PASS: du/trailing-slash
  2034. PASS: install/create-leading
  2035. PASS: du/two-args
  2036. PASS: install/d-slashdot
  2037. PASS: install/basic-1
  2038. ./install/install-C-selinux: skipping test: this system (or maybe just the current file system) lacks SELinux support
  2039. SKIP: install/install-C-selinux
  2040. PASS: install/install-C
  2041. PASS: install/strip-program
  2042. PASS: ln/backup-1
  2043. PASS: install/trap
  2044. PASS: ln/sf-1
  2045. PASS: ln/hard-backup
  2046. PASS: ln/hard-to-sym
  2047. PASS: ln/misc
  2048. PASS: ln/target-1
  2049. PASS: ln/slash-decorated-nonexistent-dest
  2050. PASS: ls/color-clear-to-eol
  2051. PASS: ls/color-dtype-dir
  2052. PASS: ls/dangle
  2053. PASS: du/long-sloop
  2054. PASS: ls/dired
  2055. PASS: ls/color-norm
  2056. PASS: ls/follow-slink
  2057. PASS: ls/file-type
  2058. PASS: ls/infloop
  2059. PASS: ls/inode
  2060. PASS: ls/m-option
  2061. PASS: ls/multihardlink
  2062. PASS: ls/no-arg
  2063. PASS: ls/proc-selinux-segfault
  2064. ./ls/no-cap: skipping test: no strace program
  2065. SKIP: ls/no-cap
  2066. PASS: ls/abmon-align
  2067. PASS: ls/recursive
  2068. PASS: ls/rt-1
  2069. PASS: ls/readdir-mountpoint-inode
  2070. PASS: ls/stat-dtype
  2071. PASS: ls/stat-failed
  2072. ./ls/stat-free-symlinks: skipping test: no strace program
  2073. SKIP: ls/stat-free-symlinks
  2074. PASS: ls/symlink-slash
  2075. PASS: ls/stat-vs-dirent
  2076. PASS: mkdir/p-1
  2077. PASS: mkdir/p-2
  2078. PASS: mkdir/p-3
  2079. PASS: ls/x-option
  2080. PASS: mkdir/p-slashdot
  2081. PASS: mkdir/p-thru-slink
  2082. PASS: mkdir/p-v
  2083. PASS: mkdir/parents
  2084. ./mkdir/selinux: skipping test: This test is useful only with SELinux in Enforcing mode.
  2085. SKIP: mkdir/selinux
  2086. PASS: mkdir/t-slash
  2087. ./mv/atomic: skipping test: no strace program
  2088. SKIP: mv/atomic
  2089. PASS: mkdir/special-1
  2090. ./mv/acl: skipping test: '/tmp/tmp13431' is not on a suitable file system for this test
  2091. SKIP: mv/acl
  2092. PASS: mkdir/perm
  2093. ./mv/atomic2: skipping test: no strace program
  2094. SKIP: mv/atomic2
  2095. PASS: mv/backup-dir
  2096. PASS: mv/childproof
  2097. PASS: mv/backup-is-src
  2098. PASS: mv/diag
  2099. PASS: mv/dir-file
  2100. PASS: mv/dir2dir
  2101. PASS: mv/force
  2102. PASS: mv/hard-4
  2103. PASS: mv/dup-source
  2104. PASS: mv/hard-2
  2105. PASS: mv/hard-link-1
  2106. PASS: mv/hard-3
  2107. PASS: mv/hard-verbose
  2108. PASS: mv/i-1
  2109. PASS: mv/i-5
  2110. PASS: mv/i-2
  2111. ./mv/i-3: skipping test: /dev/stdin is not readable
  2112. PASS: mv/i-4
  2113. SKIP: mv/i-3
  2114. PASS: mv/into-self
  2115. PASS: mv/i-link-no
  2116. PASS: mv/into-self-2
  2117. PASS: mv/into-self-3
  2118. PASS: mv/into-self-4
  2119. ./mv/leak-fd: skipping test: expensive: disabled by default
  2120. SKIP: mv/leak-fd
  2121. PASS: mv/part-fail
  2122. PASS: mv/mv-special-1
  2123. PASS: mv/no-target-dir
  2124. PASS: mv/mv-n
  2125. PASS: mv/part-hardlink
  2126. PASS: mv/part-rename
  2127. PASS: mv/partition-perm
  2128. PASS: mv/perm-1
  2129. PASS: mv/to-symlink
  2130. PASS: mv/trailing-slash
  2131. PASS: mv/update
  2132. PASS: readlink/can-e
  2133. PASS: readlink/can-f
  2134. PASS: rmdir/fail-perm
  2135. PASS: readlink/rl-1
  2136. PASS: readlink/can-m
  2137. PASS: rmdir/t-slash
  2138. PASS: rmdir/ignore
  2139. ./tail-2/assert-2: skipping test: very expensive: disabled by default
  2140. SKIP: tail-2/assert-2
  2141. ./tail-2/big-4gb: skipping test: expensive: disabled by default
  2142. SKIP: tail-2/big-4gb
  2143. PASS: tail-2/flush-initial
  2144. PASS: tail-2/proc-ksyms
  2145. PASS: tail-2/follow-stdin
  2146. PASS: tail-2/pipe-f
  2147. PASS: tail-2/start-middle
  2148. PASS: tail-2/pipe-f2
  2149. PASS: touch/60-seconds
  2150. PASS: touch/dangling-symlink
  2151. PASS: mv/part-symlink
  2152. PASS: touch/dir-1
  2153. PASS: touch/fail-diag
  2154. PASS: touch/fifo
  2155. PASS: touch/no-create-missing
  2156. PASS: touch/no-dereference
  2157. PASS: touch/no-rights
  2158. PASS: touch/not-owner
  2159. PASS: touch/obsolescent
  2160. PASS: touch/read-only
  2161. PASS: touch/relative
  2162. PASS: touch/trailing-slash
  2163. ./chown/basic: skipping test: must be run as root
  2164. SKIP: chown/basic
  2165. ./cp/cp-a-selinux: skipping test: must be run as root
  2166. SKIP: cp/cp-a-selinux
  2167. ./cp/special-bits: skipping test: must be run as root
  2168. SKIP: cp/special-bits
  2169. ./cp/preserve-gid: skipping test: must be run as root
  2170. SKIP: cp/preserve-gid
  2171. ./dd/skip-seek-past-dev: skipping test: must be run as root
  2172. SKIP: dd/skip-seek-past-dev
  2173. ./cp/capability: skipping test: must be run as root
  2174. SKIP: cp/capability
  2175. ./cp/cp-mv-enotsup-xattr: skipping test: must be run as root
  2176. SKIP: cp/cp-mv-enotsup-xattr
  2177. ./install/install-C-root: skipping test: must be run as root
  2178. SKIP: install/install-C-root
  2179. ./ls/capability: skipping test: must be run as root
  2180. SKIP: ls/capability
  2181. ./ls/nameless-uid: skipping test: must be run as root
  2182. SKIP: ls/nameless-uid
  2183. ./misc/chcon: skipping test: must be run as root
  2184. SKIP: misc/chcon
  2185. ./misc/chroot-credentials: skipping test: must be run as root
  2186. SKIP: misc/chroot-credentials
  2187. ./misc/selinux: skipping test: must be run as root
  2188. SKIP: misc/selinux
  2189. ./misc/truncate-owned-by-other: skipping test: must be run as root
  2190. SKIP: misc/truncate-owned-by-other
  2191. ./mv/sticky-to-xpart: skipping test: must be run as root
  2192. SKIP: mv/sticky-to-xpart
  2193. ./mkdir/writable-under-readonly: skipping test: must be run as root
  2194. ./rm/fail-2eperm: skipping test: must be run as root
  2195. SKIP: mkdir/writable-under-readonly
  2196. SKIP: rm/fail-2eperm
  2197. ./rm/no-give-up: skipping test: must be run as root
  2198. SKIP: rm/no-give-up
  2199. ./tail-2/append-only: skipping test: must be run as root
  2200. ./rm/one-file-system: skipping test: must be run as root
  2201. SKIP: tail-2/append-only
  2202. SKIP: rm/one-file-system
  2203. ./rm/read-only: skipping test: must be run as root
  2204. SKIP: rm/read-only
  2205. ./touch/now-owned-by-other: skipping test: must be run as root
  2206. SKIP: touch/now-owned-by-other
  2207. =======================
  2208. All 355 tests passed
  2209. (64 tests were not run)
  2210. =======================
  2211. make[4]: Leaving directory `/media/storage/.build/build/core/coreutils/src/coreutils-8.5/tests'
  2212. make[3]: Leaving directory `/media/storage/.build/build/core/coreutils/src/coreutils-8.5/tests'
  2213. make[2]: Leaving directory `/media/storage/.build/build/core/coreutils/src/coreutils-8.5/tests'
  2214. Making check in gnulib-tests
  2215. make[2]: Entering directory `/media/storage/.build/build/core/coreutils/src/coreutils-8.5/gnulib-tests'
  2216. make check-recursive
  2217. make[3]: Entering directory `/media/storage/.build/build/core/coreutils/src/coreutils-8.5/gnulib-tests'
  2218. Making check in .
  2219. make[4]: Entering directory `/media/storage/.build/build/core/coreutils/src/coreutils-8.5/gnulib-tests'
  2220. make libtests.a test-file-has-acl test-set-mode-acl test-copy-acl test-sameacls test-alignof test-alloca-opt test-areadlink test-areadlink-with-size test-areadlinkat test-argmatch test-argv-iter test-arpa_inet test-atexit test-base64 test-binary-io test-bitrotate test-btowc test-c-ctype test-c-strcasecmp test-c-strncasecmp test-canonicalize test-chown test-cloexec test-closein test-md5 test-sha1 test-ctype test-dirent-safer test-dirent test-dirname test-dup2 test-environ test-errno test-exclude test-fchdir test-fcntl-h test-fcntl-safer test-fcntl test-fdopendir test-fflush test-fflush2 test-filenamecat test-filevercmp test-fnmatch test-fopen-safer test-fopen test-fpending test-fpurge test-freadahead test-freading test-freadptr test-freadptr2 test-freadseek test-freopen-safer test-freopen test-frexp-nolibm test-frexpl-nolibm test-fseeko test-fseterr test-fsync test-ftello test-getaddrinfo test-getcwd test-getdate test-getdelim test-getdtablesize test-getgroups test-gethostname test-getline test-getndelim2 test-getopt test-gettimeofday test-hash test-i-ring test-iconv-h test-iconv test-inet_ntop test-inet_pton test-inttypes test-isblank test-isnand-nolibm test-isnanf-nolibm test-isnanl-nolibm test-langinfo test-lchown test-link test-linkat test-locale test-lock test-lseek test-lstat test-malloca test-math test-mbrtowc test-mbsalign test-mbscasecmp test-mbsinit test-mbsrtowcs test-mbsstr1 test-mbsstr2 test-mbsstr3 test-memchr test-memchr2 test-memcmp test-memrchr test-mkdir test-nanosleep test-netdb test-netinet_in test-nl_langinfo test-open test-openat-safer test-fchownat test-fstatat test-mkdirat test-openat test-unlinkat test-perror test-posixtm test-printf-frexp test-printf-frexpl test-priv-set test-quotearg test-read-file test-readlink test-remove test-rename test-rmdir test-select test-select-fd test-select-stdin test-setenv test-sigaction test-signal test-signbit test-sleep test-snprintf test-sockets test-stat test-stat-time test-stdbool test-stddef test-stdint test-stdio test-stdlib test-strerror test-striconv test-string test-strsignal test-strtod test-symlink test-symlinkat test-sys_ioctl test-sys_select test-sys_socket test-sys_stat test-sys_time test-sys_utsname test-time test-tls test-u64 test-uname test-dup-safer test-unistd test-u8-uctomb test-uc_width test-uc_width2 test-unlink test-unsetenv test-userspec test-usleep test-utimens test-vasnprintf test-vasprintf-posix test-vasprintf test-version-etc test-vfprintf-posix test-vprintf-posix test-wchar test-wcrtomb test-wctype test-wcwidth test-xalloc-die test-xfprintf-posix test-xprintf-posix test-xstrtoimax test-xstrtol test-xstrtoul test-xstrtoumax test-xvasprintf test-yesno
  2221. make[5]: Entering directory `/media/storage/.build/build/core/coreutils/src/coreutils-8.5/gnulib-tests'
  2222. CC ioctl.o
  2223. CC read-file.o
  2224. CC unlinkdir.o
  2225. CC test-file-has-acl.o
  2226. CC test-set-mode-acl.o
  2227. CC test-sameacls.o
  2228. CC test-copy-acl.o
  2229. CC test-alignof.o
  2230. CC test-alloca-opt.o
  2231. CC test-areadlink.o
  2232. CC test-areadlink-with-size.o
  2233. CC test-argmatch.o
  2234. CC test-areadlinkat.o
  2235. CC test-argv-iter.o
  2236. CC test-arpa_inet.o
  2237. CC test-atexit.o
  2238. CC test-base64.o
  2239. CC test-binary-io.o
  2240. CC test-bitrotate.o
  2241. CC test-btowc.o
  2242. CC test-c-ctype.o
  2243. CC test-c-strcasecmp.o
  2244. CC test-c-strncasecmp.o
  2245. CC test-canonicalize.o
  2246. CC test-chown.o
  2247. CC test-cloexec.o
  2248. CC test-closein.o
  2249. CC test-md5.o
  2250. CC test-sha1.o
  2251. CC test-ctype.o
  2252. CC test-dirent-safer.o
  2253. CC test-dirent.o
  2254. CC test-dirname.o
  2255. CC test-dup2.o
  2256. CC test-environ.o
  2257. CC test-errno.o
  2258. CC test-exclude.o
  2259. CC test-fchdir.o
  2260. CC test-fcntl-h.o
  2261. CC test-fcntl-safer.o
  2262. CC test-fcntl.o
  2263. CC test-fdopendir.o
  2264. CC test-fflush.o
  2265. CC test-fflush2.o
  2266. CC test-filenamecat.o
  2267. CC test-filevercmp.o
  2268. CC test-fnmatch.o
  2269. CC test-fopen-safer.o
  2270. CC test-fopen.o
  2271. CC test-fpending.o
  2272. CC test-fpurge.o
  2273. CC test-freadahead.o
  2274. CC test-freading.o
  2275. CC test-freadptr.o
  2276. CC test-freadptr2.o
  2277. CC test-freadseek.o
  2278. CC test-freopen-safer.o
  2279. CC test-freopen.o
  2280. CC test-frexp.o
  2281. CC test-frexpl.o
  2282. CC test-fseeko.o
  2283. CC test-fseterr.o
  2284. CC test-fsync.o
  2285. CC test-ftello.o
  2286. CC test-getaddrinfo.o
  2287. CC test-getcwd.o
  2288. CC test-getdate.o
  2289. CC test-getdelim.o
  2290. CC test-getdtablesize.o
  2291. CC test-getgroups.o
  2292. CC test-gethostname.o
  2293. CC test-getline.o
  2294. CC test-getndelim2.o
  2295. CC test-getopt.o
  2296. CC test-gettimeofday.o
  2297. CC test-hash.o
  2298. CC test-i-ring.o
  2299. CC test-iconv-h.o
  2300. CC test-iconv.o
  2301. CC test-inet_ntop.o
  2302. CC test-inet_pton.o
  2303. CC test-inttypes.o
  2304. CC test-isblank.o
  2305. CC test-isnand-nolibm.o
  2306. CC test-isnanf-nolibm.o
  2307. CC test-isnanl-nolibm.o
  2308. CC test-langinfo.o
  2309. CC test-lchown.o
  2310. CC test-link.o
  2311. CC test-linkat.o
  2312. CC test-locale.o
  2313. CC test-lock.o
  2314. CC test-lseek.o
  2315. CC test-lstat.o
  2316. CC test-malloca.o
  2317. CC test-math.o
  2318. CC test-mbrtowc.o
  2319. CC test-mbsalign.o
  2320. CC test-mbscasecmp.o
  2321. CC test-mbsinit.o
  2322. CC test-mbsrtowcs.o
  2323. CC test-mbsstr1.o
  2324. CC test-mbsstr2.o
  2325. CC test-mbsstr3.o
  2326. In file included from test-linkat.c:44:0:
  2327. test-link.h: In function 'test_link':
  2328. test-link.h:47:5: warning: implicit declaration of function 'stat'
  2329. test-link.h:98:3: warning: implicit declaration of function 'mkdir'
  2330. test-linkat.c: In function 'check_same_link':
  2331. test-linkat.c:65:3: warning: implicit declaration of function 'lstat'
  2332. CC test-memchr.o
  2333. CC test-memchr2.o
  2334. CC test-memcmp.o
  2335. CC test-memrchr.o
  2336. CC test-mkdir.o
  2337. CC test-nanosleep.o
  2338. CC test-netdb.o
  2339. CC test-netinet_in.o
  2340. CC test-nl_langinfo.o
  2341. CC test-open.o
  2342. CC test-openat-safer.o
  2343. CC test-fchownat.o
  2344. CC test-fstatat.o
  2345. CC test-mkdirat.o
  2346. CC test-openat.o
  2347. CC test-unlinkat.o
  2348. CC test-perror.o
  2349. CC test-posixtm.o
  2350. CC test-printf-frexp.o
  2351. CC test-printf-frexpl.o
  2352. CC test-priv-set.o
  2353. CC test-quotearg.o
  2354. CC test-read-file.o
  2355. CC test-readlink.o
  2356. CC test-remove.o
  2357. CC test-rename.o
  2358. CC test-rmdir.o
  2359. CC test-select.o
  2360. CC test-select-fd.o
  2361. CC test-select-stdin.o
  2362. CC test-setenv.o
  2363. CC test-sigaction.o
  2364. CC test-signal.o
  2365. CC test-signbit.o
  2366. CC test-sleep.o
  2367. CC test-snprintf.o
  2368. CC test-sockets.o
  2369. CC test-stat.o
  2370. CC test-stat-time.o
  2371. CC test-stdbool.o
  2372. CC test-stddef.o
  2373. CC test-stdint.o
  2374. CC test-stdio.o
  2375. CC test-stdlib.o
  2376. CC test-strerror.o
  2377. CC test-striconv.o
  2378. CC test-string.o
  2379. CC test-strsignal.o
  2380. CC test-strtod.o
  2381. CC test-symlink.o
  2382. CC test-symlinkat.o
  2383. CC test-sys_ioctl.o
  2384. CC test-sys_select.o
  2385. CC test-sys_socket.o
  2386. CC test-sys_stat.o
  2387. CC test-sys_time.o
  2388. CC test-sys_utsname.o
  2389. CC test-time.o
  2390. CC test-tls.o
  2391. CC test-u64.o
  2392. CC test-uname.o
  2393. CC test-dup-safer.o
  2394. CC test-unistd.o
  2395. CC test-unlink.o
  2396. CC test-unsetenv.o
  2397. CC test-userspec.o
  2398. CC test-usleep.o
  2399. CC test-utimens.o
  2400. CC test-vasnprintf.o
  2401. CC test-vasprintf-posix.o
  2402. CC test-vasprintf.o
  2403. CC test-version-etc.o
  2404. CC test-vfprintf-posix.o
  2405. CC test-vprintf-posix.o
  2406. CC test-wchar.o
  2407. CC test-wcrtomb.o
  2408. CC test-wctype.o
  2409. CC test-wcwidth.o
  2410. CC test-xalloc-die.o
  2411. CC test-xfprintf-posix.o
  2412. CC test-xprintf-posix.o
  2413. CC test-xstrtoimax.o
  2414. CC test-xstrtol.o
  2415. CC test-xstrtoul.o
  2416. CC test-xstrtoumax.o
  2417. CC test-xvasprintf.o
  2418. CC test-yesno.o
  2419. CC glthread/thread.o
  2420. CC unistr/test-u8-uctomb.o
  2421. CC uniwidth/test-uc_width.o
  2422. CC uniwidth/test-uc_width2.o
  2423. AR libtests.a
  2424. CCLD test-file-has-acl
  2425. CCLD test-set-mode-acl
  2426. CCLD test-copy-acl
  2427. CCLD test-sameacls
  2428. CCLD test-alignof
  2429. CCLD test-alloca-opt
  2430. CCLD test-areadlink
  2431. CCLD test-areadlink-with-size
  2432. CCLD test-areadlinkat
  2433. CCLD test-argmatch
  2434. CCLD test-argv-iter
  2435. CCLD test-arpa_inet
  2436. CCLD test-atexit
  2437. CCLD test-base64
  2438. CCLD test-binary-io
  2439. CCLD test-bitrotate
  2440. CCLD test-btowc
  2441. CCLD test-c-ctype
  2442. CCLD test-c-strcasecmp
  2443. CCLD test-c-strncasecmp
  2444. CCLD test-canonicalize
  2445. CCLD test-chown
  2446. CCLD test-cloexec
  2447. CCLD test-closein
  2448. CCLD test-md5
  2449. CCLD test-sha1
  2450. CCLD test-ctype
  2451. CCLD test-dirent-safer
  2452. CCLD test-dirent
  2453. CCLD test-dirname
  2454. CCLD test-dup2
  2455. CCLD test-environ
  2456. CCLD test-errno
  2457. CCLD test-exclude
  2458. CCLD test-fchdir
  2459. CCLD test-fcntl-h
  2460. CCLD test-fcntl-safer
  2461. CCLD test-fcntl
  2462. CCLD test-fdopendir
  2463. CCLD test-fflush
  2464. CCLD test-fflush2
  2465. CCLD test-filenamecat
  2466. CCLD test-filevercmp
  2467. CCLD test-fnmatch
  2468. CCLD test-fopen-safer
  2469. CCLD test-fopen
  2470. CCLD test-fpending
  2471. CCLD test-fpurge
  2472. CCLD test-freadahead
  2473. CCLD test-freading
  2474. CCLD test-freadptr
  2475. CCLD test-freadptr2
  2476. CCLD test-freadseek
  2477. CCLD test-freopen-safer
  2478. CCLD test-freopen
  2479. CCLD test-frexp-nolibm
  2480. CCLD test-frexpl-nolibm
  2481. CCLD test-fseeko
  2482. CCLD test-fseterr
  2483. CCLD test-fsync
  2484. CCLD test-ftello
  2485. CCLD test-getaddrinfo
  2486. CCLD test-getcwd
  2487. CCLD test-getdate
  2488. CCLD test-getdelim
  2489. CCLD test-getdtablesize
  2490. CCLD test-getgroups
  2491. CCLD test-gethostname
  2492. CCLD test-getline
  2493. CCLD test-getndelim2
  2494. CCLD test-getopt
  2495. CCLD test-gettimeofday
  2496. CCLD test-hash
  2497. CCLD test-i-ring
  2498. CCLD test-iconv-h
  2499. CCLD test-iconv
  2500. CCLD test-inet_ntop
  2501. CCLD test-inet_pton
  2502. CCLD test-inttypes
  2503. CCLD test-isblank
  2504. CCLD test-isnand-nolibm
  2505. CCLD test-isnanf-nolibm
  2506. CCLD test-isnanl-nolibm
  2507. CCLD test-langinfo
  2508. CCLD test-lchown
  2509. CCLD test-link
  2510. CCLD test-linkat
  2511. CCLD test-locale
  2512. CCLD test-lock
  2513. CCLD test-lseek
  2514. CCLD test-lstat
  2515. CCLD test-malloca
  2516. CCLD test-math
  2517. CCLD test-mbrtowc
  2518. CCLD test-mbsalign
  2519. CCLD test-mbscasecmp
  2520. CCLD test-mbsinit
  2521. CCLD test-mbsrtowcs
  2522. CCLD test-mbsstr1
  2523. CCLD test-mbsstr2
  2524. CCLD test-mbsstr3
  2525. CCLD test-memchr
  2526. CCLD test-memchr2
  2527. CCLD test-memcmp
  2528. CCLD test-memrchr
  2529. CCLD test-mkdir
  2530. CCLD test-nanosleep
  2531. CCLD test-netdb
  2532. CCLD test-netinet_in
  2533. CCLD test-nl_langinfo
  2534. CCLD test-open
  2535. CCLD test-openat-safer
  2536. CCLD test-fchownat
  2537. CCLD test-fstatat
  2538. CCLD test-mkdirat
  2539. CCLD test-openat
  2540. CCLD test-unlinkat
  2541. CCLD test-perror
  2542. CCLD test-posixtm
  2543. CCLD test-printf-frexp
  2544. CCLD test-printf-frexpl
  2545. CCLD test-priv-set
  2546. CCLD test-quotearg
  2547. CCLD test-read-file
  2548. CCLD test-readlink
  2549. CCLD test-remove
  2550. CCLD test-rename
  2551. CCLD test-rmdir
  2552. CCLD test-select
  2553. CCLD test-select-fd
  2554. CCLD test-select-stdin
  2555. CCLD test-setenv
  2556. CCLD test-sigaction
  2557. CCLD test-signal
  2558. CCLD test-signbit
  2559. CCLD test-sleep
  2560. CCLD test-snprintf
  2561. CCLD test-sockets
  2562. CCLD test-stat
  2563. CCLD test-stat-time
  2564. CCLD test-stdbool
  2565. CCLD test-stddef
  2566. CCLD test-stdint
  2567. CCLD test-stdio
  2568. CCLD test-stdlib
  2569. CCLD test-strerror
  2570. CCLD test-striconv
  2571. CCLD test-string
  2572. CCLD test-strsignal
  2573. CCLD test-strtod
  2574. CCLD test-symlink
  2575. CCLD test-symlinkat
  2576. CCLD test-sys_ioctl
  2577. CCLD test-sys_select
  2578. CCLD test-sys_socket
  2579. CCLD test-sys_stat
  2580. CCLD test-sys_time
  2581. CCLD test-sys_utsname
  2582. CCLD test-time
  2583. CCLD test-tls
  2584. CCLD test-u64
  2585. CCLD test-uname
  2586. CCLD test-dup-safer
  2587. CCLD test-unistd
  2588. CCLD test-u8-uctomb
  2589. CCLD test-uc_width
  2590. CCLD test-uc_width2
  2591. CCLD test-unlink
  2592. CCLD test-unsetenv
  2593. CCLD test-userspec
  2594. CCLD test-usleep
  2595. CCLD test-utimens
  2596. CCLD test-vasnprintf
  2597. CCLD test-vasprintf-posix
  2598. CCLD test-vasprintf
  2599. CCLD test-version-etc
  2600. CCLD test-vfprintf-posix
  2601. CCLD test-vprintf-posix
  2602. CCLD test-wchar
  2603. CCLD test-wcrtomb
  2604. CCLD test-wctype
  2605. CCLD test-wcwidth
  2606. CCLD test-xalloc-die
  2607. CCLD test-xfprintf-posix
  2608. CCLD test-xprintf-posix
  2609. CCLD test-xstrtoimax
  2610. CCLD test-xstrtol
  2611. CCLD test-xstrtoul
  2612. CCLD test-xstrtoumax
  2613. CCLD test-xvasprintf
  2614. CCLD test-yesno
  2615. make[5]: Leaving directory `/media/storage/.build/build/core/coreutils/src/coreutils-8.5/gnulib-tests'
  2616. make check-TESTS
  2617. make[5]: Entering directory `/media/storage/.build/build/core/coreutils/src/coreutils-8.5/gnulib-tests'
  2618. make[6]: Entering directory `/media/storage/.build/build/core/coreutils/src/coreutils-8.5/gnulib-tests'
  2619. PASS: test-alignof
  2620. PASS: test-areadlink
  2621. PASS: test-alloca-opt
  2622. PASS: test-areadlink-with-size
  2623. PASS: test-areadlinkat
  2624. PASS: test-argmatch
  2625. PASS: test-file-has-acl.sh
  2626. PASS: test-argv-iter
  2627. PASS: test-arpa_inet
  2628. PASS: test-base64
  2629. PASS: test-bitrotate
  2630. PASS: test-binary-io.sh
  2631. SKIP: test-btowc1.sh
  2632. SKIP: test-btowc2.sh
  2633. PASS: test-c-ctype
  2634. PASS: test-atexit.sh
  2635. PASS: test-c-strcase.sh
  2636. PASS: test-canonicalize
  2637. PASS: test-cloexec
  2638. PASS: test-md5
  2639. PASS: test-sha1
  2640. PASS: test-ctype
  2641. PASS: test-dirent-safer
  2642. PASS: test-dirent
  2643. PASS: test-closein.sh
  2644. PASS: test-dirname
  2645. PASS: test-dup2
  2646. PASS: test-environ
  2647. PASS: test-errno
  2648. PASS: test-exclude1.sh
  2649. PASS: test-exclude2.sh
  2650. PASS: test-exclude3.sh
  2651. PASS: test-exclude4.sh
  2652. PASS: test-exclude5.sh
  2653. PASS: test-copy-acl.sh
  2654. PASS: test-fchdir
  2655. PASS: test-exclude6.sh
  2656. PASS: test-fcntl-h
  2657. PASS: test-fcntl-safer
  2658. PASS: test-fcntl
  2659. PASS: test-exclude7.sh
  2660. PASS: test-fdopendir
  2661. PASS: test-filenamecat
  2662. PASS: test-fflush
  2663. PASS: test-fflush2.sh
  2664. PASS: test-fnmatch
  2665. PASS: test-filevercmp
  2666. PASS: test-fopen-safer
  2667. PASS: test-fopen
  2668. PASS: test-fpurge
  2669. PASS: test-fpending.sh
  2670. PASS: test-freading
  2671. PASS: test-freadahead.sh
  2672. PASS: test-freadptr.sh
  2673. PASS: test-freadptr2.sh
  2674. PASS: test-freopen-safer
  2675. PASS: test-freopen
  2676. PASS: test-freadseek.sh
  2677. PASS: test-frexp-nolibm
  2678. PASS: test-fseterr
  2679. PASS: test-fseeko.sh
  2680. PASS: test-frexpl-nolibm
  2681. PASS: test-fsync
  2682. PASS: test-fseeko2.sh
  2683. PASS: test-ftello.sh
  2684. PASS: test-ftello2.sh
  2685. PASS: test-getdate
  2686. PASS: test-getcwd
  2687. PASS: test-getdelim
  2688. PASS: test-getgroups
  2689. PASS: test-getdtablesize
  2690. PASS: test-gethostname
  2691. PASS: test-getline
  2692. PASS: test-set-mode-acl.sh
  2693. PASS: test-getndelim2
  2694. PASS: test-getopt
  2695. PASS: test-getaddrinfo
  2696. PASS: test-gettimeofday
  2697. PASS: test-i-ring
  2698. PASS: test-iconv-h
  2699. PASS: test-inet_ntop
  2700. PASS: test-inet_pton
  2701. PASS: test-iconv
  2702. PASS: test-inttypes
  2703. PASS: test-isblank
  2704. PASS: test-isnand-nolibm
  2705. PASS: test-isnanl-nolibm
  2706. PASS: test-isnanf-nolibm
  2707. PASS: test-langinfo
  2708. PASS: test-link
  2709. PASS: test-locale
  2710. /bin/sh: line 1: 24229 Aborted EXEEXT='' srcdir='.' USE_ACL=1 LOCALE_FR='none' LOCALE_FR_UTF8='none' LOCALE_FR='none' LOCALE_TR_UTF8='none' LOCALE_FR='none' LOCALE_FR_UTF8='none' LOCALE_JA='none' LOCALE_ZH_CN='none' LOCALE_TR_UTF8='none' LOCALE_FR_UTF8='none' LOCALE_FR='none' LOCALE_FR_UTF8='none' LOCALE_JA='none' LOCALE_ZH_CN='none' LOCALE_FR_UTF8='none' LOCALE_ZH_CN='none' LOCALE_FR='none' LOCALE_FR_UTF8='none' LOCALE_FR='none' LOCALE_FR_UTF8='none' PATH='/home/build/build/core/coreutils/src/coreutils-8.5/build-aux':"$PATH" PATH='/home/build/build/core/coreutils/src/coreutils-8.5/build-aux':"$PATH" LOCALE_FR='none' LOCALE_FR_UTF8='none' LOCALE_JA='none' LOCALE_ZH_CN='none' "$tst" > test-linkat.log-t 2>&1
  2711. FAIL: test-linkat
  2712. PASS: test-lstat
  2713. PASS: test-lseek.sh
  2714. PASS: test-math
  2715. SKIP: test-mbrtowc1.sh
  2716. SKIP: test-mbrtowc2.sh
  2717. SKIP: test-mbrtowc3.sh
  2718. SKIP: test-mbrtowc4.sh
  2719. SKIP: test-mbscasecmp.sh
  2720. PASS: test-mbsalign
  2721. PASS: test-malloca
  2722. SKIP: test-mbsinit.sh
  2723. SKIP: test-mbsrtowcs1.sh
  2724. SKIP: test-mbsrtowcs2.sh
  2725. SKIP: test-mbsrtowcs3.sh
  2726. SKIP: test-mbsrtowcs4.sh
  2727. SKIP: test-mbsstr2.sh
  2728. SKIP: test-mbsstr3.sh
  2729. PASS: test-chown
  2730. PASS: test-memcmp
  2731. PASS: test-memrchr
  2732. PASS: test-mkdir
  2733. PASS: test-memchr2
  2734. PASS: test-memchr
  2735. PASS: test-netdb
  2736. PASS: test-netinet_in
  2737. PASS: test-open
  2738. PASS: test-nl_langinfo.sh
  2739. PASS: test-openat-safer
  2740. PASS: test-fstatat
  2741. PASS: test-mkdirat
  2742. PASS: test-openat
  2743. PASS: test-unlinkat
  2744. PASS: test-posixtm
  2745. PASS: test-perror.sh
  2746. PASS: test-nanosleep
  2747. PASS: test-printf-frexp
  2748. PASS: test-lchown
  2749. PASS: test-priv-set
  2750. PASS: test-read-file
  2751. PASS: test-printf-frexpl
  2752. PASS: test-quotearg.sh
  2753. PASS: test-readlink
  2754. PASS: test-remove
  2755. PASS: test-rmdir
  2756. PASS: test-rename
  2757. PASS: test-select
  2758. PASS: test-setenv
  2759. PASS: test-sigaction
  2760. PASS: test-signal
  2761. PASS: test-signbit
  2762. PASS: test-snprintf
  2763. PASS: test-sockets
  2764. PASS: test-stat
  2765. PASS: test-mbsstr1
  2766. PASS: test-select-out.sh
  2767. PASS: test-stdbool
  2768. PASS: test-stddef
  2769. PASS: test-stdint
  2770. PASS: test-stdio
  2771. PASS: test-stdlib
  2772. PASS: test-strerror
  2773. PASS: test-string
  2774. PASS: test-striconv
  2775. PASS: test-strsignal
  2776. PASS: test-strtod
  2777. PASS: test-sleep
  2778. PASS: test-symlink
  2779. PASS: test-select-in.sh
  2780. PASS: test-symlinkat
  2781. PASS: test-sys_ioctl
  2782. PASS: test-sys_select
  2783. PASS: test-sys_socket
  2784. PASS: test-sys_stat
  2785. PASS: test-sys_utsname
  2786. PASS: test-sys_time
  2787. PASS: test-time
  2788. PASS: test-u64
  2789. PASS: test-uname
  2790. PASS: test-dup-safer
  2791. PASS: test-unistd
  2792. PASS: test-u8-uctomb
  2793. PASS: test-uc_width
  2794. PASS: test-unsetenv
  2795. PASS: test-unlink
  2796. PASS: test-userspec
  2797. PASS: uniwidth/test-uc_width2.sh
  2798. PASS: test-usleep
  2799. PASS: test-vasnprintf
  2800. PASS: test-vasprintf-posix
  2801. PASS: test-tls
  2802. PASS: test-vasprintf
  2803. PASS: test-vc-list-files-git.sh
  2804. PASS: test-version-etc.sh
  2805. PASS: test-vfprintf-posix.sh
  2806. PASS: test-vprintf-posix.sh
  2807. PASS: test-wchar
  2808. PASS: test-wcrtomb.sh
  2809. PASS: test-wctype
  2810. PASS: test-wcwidth
  2811. PASS: test-hash
  2812. PASS: test-fchownat
  2813. PASS: test-xprintf-posix.sh
  2814. PASS: test-xalloc-die.sh
  2815. PASS: test-stat-time
  2816. PASS: test-xvasprintf
  2817. PASS: test-xstrtoimax.sh
  2818. PASS: test-update-copyright.sh
  2819. PASS: test-xstrtoumax.sh
  2820. PASS: test-xstrtol.sh
  2821. PASS: test-yesno.sh
  2822. PASS: test-vc-list-files-cvs.sh
  2823. PASS: test-lock
  2824. PASS: test-utimens
  2825. ====================================================
  2826. GNU coreutils 8.5: gnulib-tests/test-suite.log
  2827. ====================================================
  2828.  
  2829. 1 of 191 tests failed. (14 tests were not run).
  2830.  
  2831. .. contents:: :depth: 2
  2832.  
  2833.  
  2834. SKIP: test-btowc1.sh (exit: 77)
  2835. ===============================
  2836.  
  2837. Skipping test: no traditional french locale is installed
  2838.  
  2839. SKIP: test-btowc2.sh (exit: 77)
  2840. ===============================
  2841.  
  2842. Skipping test: no french Unicode locale is installed
  2843.  
  2844. FAIL: test-linkat (exit: 134)
  2845. =============================
  2846.  
  2847. test-linkat.c:73: assertion failed
  2848.  
  2849. SKIP: test-mbrtowc1.sh (exit: 77)
  2850. =================================
  2851.  
  2852. Skipping test: no traditional french locale is installed
  2853.  
  2854. SKIP: test-mbrtowc2.sh (exit: 77)
  2855. =================================
  2856.  
  2857. Skipping test: no french Unicode locale is installed
  2858.  
  2859. SKIP: test-mbrtowc3.sh (exit: 77)
  2860. =================================
  2861.  
  2862. Skipping test: no traditional japanese locale is installed
  2863.  
  2864. SKIP: test-mbrtowc4.sh (exit: 77)
  2865. =================================
  2866.  
  2867. Skipping test: no transitional chinese locale is installed
  2868.  
  2869. SKIP: test-mbscasecmp.sh (exit: 77)
  2870. ===================================
  2871.  
  2872. Skipping test: no turkish Unicode locale is installed
  2873.  
  2874. SKIP: test-mbsinit.sh (exit: 77)
  2875. ================================
  2876.  
  2877. Skipping test: no french Unicode locale is installed
  2878.  
  2879. SKIP: test-mbsrtowcs1.sh (exit: 77)
  2880. ===================================
  2881.  
  2882. Skipping test: no traditional french locale is installed
  2883.  
  2884. SKIP: test-mbsrtowcs2.sh (exit: 77)
  2885. ===================================
  2886.  
  2887. Skipping test: no french Unicode locale is installed
  2888.  
  2889. SKIP: test-mbsrtowcs3.sh (exit: 77)
  2890. ===================================
  2891.  
  2892. Skipping test: no traditional japanese locale is installed
  2893.  
  2894. SKIP: test-mbsrtowcs4.sh (exit: 77)
  2895. ===================================
  2896.  
  2897. Skipping test: no transitional chinese locale is installed
  2898.  
  2899. SKIP: test-mbsstr2.sh (exit: 77)
  2900. ================================
  2901.  
  2902. Skipping test: no french Unicode locale is installed
  2903.  
  2904. SKIP: test-mbsstr3.sh (exit: 77)
  2905. ================================
  2906.  
  2907. Skipping test: no chinese GB18030 locale is installed
  2908. ======================================
  2909. 1 of 191 tests failed
  2910. (14 tests were not run)
  2911. See gnulib-tests/test-suite.log
  2912. Please report to [email protected]
  2913. ======================================
  2914. make[6]: *** [test-suite.log] Error 1
  2915. make[6]: Leaving directory `/media/storage/.build/build/core/coreutils/src/coreutils-8.5/gnulib-tests'
  2916. make[5]: *** [check-TESTS] Error 2
  2917. make[5]: Leaving directory `/media/storage/.build/build/core/coreutils/src/coreutils-8.5/gnulib-tests'
  2918. make[4]: *** [check-am] Error 2
  2919. make[4]: Leaving directory `/media/storage/.build/build/core/coreutils/src/coreutils-8.5/gnulib-tests'
  2920. make[3]: *** [check-recursive] Error 1
  2921. make[3]: Leaving directory `/media/storage/.build/build/core/coreutils/src/coreutils-8.5/gnulib-tests'
  2922. make[2]: *** [check] Error 2
  2923. make[2]: Leaving directory `/media/storage/.build/build/core/coreutils/src/coreutils-8.5/gnulib-tests'
  2924. make[1]: *** [check-recursive] Error 1
  2925. make[1]: Leaving directory `/media/storage/.build/build/core/coreutils/src/coreutils-8.5'
  2926. make: *** [check] Error 2
  2927. Aborting...
Advertisement
Add Comment
Please, Sign In to add comment