This week only. Pastebin PRO Accounts Christmas Special! Don't miss out!Want more features on Pastebin? Sign Up, it's FREE!
Guest

Untitled

By: a guest on Oct 14th, 2011  |  syntax: Bash  |  size: 7.79 KB  |  views: 136  |  expires: Never
download  |  raw  |  embed  |  report abuse  |  print
Text below is selected. Please press Ctrl+C to copy to your clipboard. (⌘+C on Mac)
  1. $ makepkg -s
  2. ==> Making package: cower 3.0.8-1 (Fri Oct 14 16:07:59 PDT 2011)
  3. ==> Checking runtime dependencies...
  4. ==> Checking buildtime dependencies...
  5. ==> Retrieving Sources...
  6.   -> Found cower-3.0.8.tar.gz
  7. ==> Validating source files with md5sums...
  8.     cower-3.0.8.tar.gz ... Passed
  9. ==> Extracting Sources...
  10.   -> Extracting cower-3.0.8.tar.gz with bsdtar
  11. ==> Removing existing pkg/ directory...
  12. ==> Starting build()...
  13. cc -std=c99 -g -pedantic -Wall -Wextra -Werror -pthread -march=x86-64 -mtune=generic -O2 -pipe -fstack-protector --param=ssp-buffer-size=4 -D_FORTIFY_SOURCE=2 -DCOWER_VERSION=\"3.0.8\"   -c -o cower.o cower.c
  14. cower.c:257:1: error: unknown type name ‘alpm_handle_t’
  15. cower.c:258:32: error: unknown type name ‘alpm_pkg_t’
  16. cower.c:336:1: error: unknown type name ‘alpm_handle_t’
  17. cower.c:337:1: error: unknown type name ‘alpm_db_t’
  18. cower.c:364:1: error: unknown type name ‘alpm_handle_t’
  19. cower.c: In function ‘alpm_init’:
  20. cower.c:369:7: error: ISO C forbids forward references to ‘enum’ types [-Werror=edantic]
  21. cower.c:369:21: error: storage size of ‘err’ isn’t known
  22. cower.c:372:2: error: too many arguments to function ‘alpm_initialize’
  23. /usr/include/alpm.h:65:5: note: declared here
  24. cower.c:372:11: error: assignment makes pointer from integer without a cast [-Werror]
  25. cower.c:401:7: error: ‘ALPM_SIG_DATABASE’ undeclared (first use in this function)
  26. cower.c:401:7: note: each undeclared identifier is reported only once for each function it appears in
  27. cower.c:401:27: error: ‘ALPM_SIG_DATABASE_OPTIONAL’ undeclared (first use in this function)
  28. cower.c:401:7: error: passing argument 1 of ‘alpm_db_register_sync’ from incompatible pointer type [-Werror]
  29. /usr/include/alpm.h:231:9: note: expected ‘const char *’ but argument is of type ‘int *
  30. cower.c:401:7: error: too many arguments to function ‘alpm_db_register_sync’
  31. /usr/include/alpm.h:231:9: note: declared here
  32. cower.c:420:2: error: too many arguments to function ‘alpm_option_get_localdb’
  33. /usr/include/alpm.h:218:9: note: declared here
  34. cower.c:420:11: error: assignment from incompatible pointer type [-Werror]
  35. cower.c:369:21: error: unused variable ‘err’ [-Werror=unused-variable]
  36. cower.c: In function ‘alpm_find_foreign_pkgs’:
  37. cower.c:433:2: error: passing argument 1 of ‘alpm_db_get_pkgcache’ from incompatible pointer type [-Werror]
  38. /usr/include/alpm.h:276:14: note: expected ‘struct pmdb_t *’ but argument is of type ‘int *
  39. cower.c:434:3: error: unknown type name ‘alpm_pkg_t’
  40. cower.c:436:3: error: implicit declaration of function ‘alpm_pkg_is_foreign’ [-Werror=implicit-function-declaration]
  41. cower.c:437:4: error: passing argument 1 of ‘alpm_pkg_get_name’ from incompatible pointer type [-Werror]
  42. /usr/include/alpm.h:365:13: note: expected ‘struct pmpkg_t *’ but argument is of type ‘int *
  43. cower.c:437:4: error: passing argument 1 of ‘alpm_pkg_get_name’ from incompatible pointer type [-Werror]
  44. /usr/include/alpm.h:365:13: note: expected ‘struct pmpkg_t *’ but argument is of type ‘int *
  45. cower.c:437:4: error: passing argument 1 of ‘alpm_pkg_get_name’ from incompatible pointer type [-Werror]
  46. /usr/include/alpm.h:365:13: note: expected ‘struct pmpkg_t *’ but argument is of type ‘int *
  47. cower.c:437:4: error: passing argument 1 of ‘alpm_pkg_get_name’ from incompatible pointer type [-Werror]
  48. /usr/include/alpm.h:365:13: note: expected ‘struct pmpkg_t *’ but argument is of type ‘int *
  49. cower.c:437:4: error: passing argument 1 of ‘alpm_pkg_get_name’ from incompatible pointer type [-Werror]
  50. /usr/include/alpm.h:365:13: note: expected ‘struct pmpkg_t *’ but argument is of type ‘int *
  51. cower.c:437:4: error: passing argument 1 of ‘alpm_pkg_get_name’ from incompatible pointer type [-Werror]
  52. /usr/include/alpm.h:365:13: note: expected ‘struct pmpkg_t *’ but argument is of type ‘int *
  53. cower.c:437:4: error: passing argument 1 of ‘alpm_pkg_get_name’ from incompatible pointer type [-Werror]
  54. /usr/include/alpm.h:365:13: note: expected ‘struct pmpkg_t *’ but argument is of type ‘int *
  55. cower.c: At top level:
  56. cower.c:444:25: error: unknown type name ‘alpm_pkg_t’
  57. cower.c: In function ‘alpm_provides_pkg’:
  58. cower.c:463:2: error: unknown type name ‘alpm_db_t’
  59. cower.c:465:2: error: too many arguments to function ‘alpm_option_get_syncdbs’
  60. /usr/include/alpm.h:225:14: note: declared here
  61. cower.c:467:3: error: passing argument 1 of ‘alpm_db_get_pkgcache’ from incompatible pointer type [-Werror]
  62. /usr/include/alpm.h:276:14: note: expected ‘struct pmdb_t *’ but argument is of type ‘int *
  63. cower.c:468:4: error: passing argument 1 of ‘alpm_db_get_name’ from incompatible pointer type [-Werror]
  64. /usr/include/alpm.h:248:13: note: expected ‘const struct pmdb_t *’ but argument is of type ‘int *
  65. cower.c: In function ‘print_pkg_info’:
  66. cower.c:1590:2: error: unknown type name ‘alpm_pkg_t’
  67. cower.c:1594:2: error: passing argument 1 of ‘alpm_db_get_pkg’ from incompatible pointer type [-Werror]
  68. /usr/include/alpm.h:270:10: note: expected ‘struct pmdb_t *’ but argument is of type ‘int *
  69. cower.c:1594:11: error: assignment from incompatible pointer type [-Werror]
  70. cower.c:1596:3: error: passing argument 1 of ‘alpm_pkg_get_version’ from incompatible pointer type [-Werror]
  71. /usr/include/alpm.h:373:13: note: expected ‘struct pmpkg_t *’ but argument is of type ‘int *
  72. cower.c: In function ‘print_pkg_search’:
  73. cower.c:1654:3: error: unknown type name ‘alpm_pkg_t’
  74. cower.c:1658:3: error: passing argument 1 of ‘alpm_db_get_pkg’ from incompatible pointer type [-Werror]
  75. /usr/include/alpm.h:270:10: note: expected ‘struct pmdb_t *’ but argument is of type ‘int *
  76. cower.c:1658:12: error: assignment from incompatible pointer type [-Werror]
  77. cower.c:1660:4: error: passing argument 1 of ‘alpm_pkg_get_version’ from incompatible pointer type [-Werror]
  78. /usr/include/alpm.h:373:13: note: expected ‘struct pmpkg_t *’ but argument is of type ‘int *
  79. cower.c: In function ‘resolve_dependencies’:
  80. cower.c:1736:8: error: passing argument 1 of ‘alpm_db_get_pkgcache’ from incompatible pointer type [-Werror]
  81. /usr/include/alpm.h:276:14: note: expected ‘struct pmdb_t *’ but argument is of type ‘int *
  82. cower.c:1743:4: error: passing argument 1 of ‘alpm_db_get_pkgcache’ from incompatible pointer type [-Werror]
  83. /usr/include/alpm.h:276:14: note: expected ‘struct pmdb_t *’ but argument is of type ‘int *
  84. cower.c: In function ‘task_update’:
  85. cower.c:2066:2: error: unknown type name ‘alpm_pkg_t’
  86. cower.c:2081:3: error: passing argument 1 of ‘alpm_db_get_pkg’ from incompatible pointer type [-Werror]
  87. /usr/include/alpm.h:270:10: note: expected ‘struct pmdb_t *’ but argument is of type ‘int *
  88. cower.c:2081:9: error: assignment from incompatible pointer type [-Werror]
  89. cower.c:2089:3: error: passing argument 1 of ‘alpm_pkg_get_version’ from incompatible pointer type [-Werror]
  90. /usr/include/alpm.h:373:13: note: expected ‘struct pmpkg_t *’ but argument is of type ‘int *
  91. cower.c:2101:8: error: passing argument 1 of ‘alpm_pkg_get_version’ from incompatible pointer type [-Werror]
  92. /usr/include/alpm.h:373:13: note: expected ‘struct pmpkg_t *’ but argument is of type ‘int *
  93. cower.c: In function ‘main’:
  94. cower.c:2329:2: error: passing argument 1 of ‘alpm_db_get_pkgcache’ from incompatible pointer type [-Werror]
  95. /usr/include/alpm.h:276:14: note: expected ‘struct pmdb_t *’ but argument is of type ‘int *
  96. cower.c:2373:2: error: too many arguments to function ‘alpm_release’
  97. /usr/include/alpm.h:66:5: note: declared here
  98. cc1: all warnings being treated as errors
  99.  
  100. make: *** [cower.o] Error 1
  101. ==> ERROR: A failure occurred in build().
  102.     Aborting...
  103.  
  104.  
clone this paste RAW Paste Data