Guest User

Untitled

a guest
Aug 20th, 2016
136
0
Never
Not a member of Pastebin yet? Sign Up, it unlocks many cool features!
text 9.25 KB | None | 0 0
  1. This mapping 'snapshot_20160518' was designed for MC 1.9.4! Use at your own peril.
  2. #################################################
  3. ForgeGradle 2.2-SNAPSHOT-8ea24cd
  4. https://github.com/MinecraftForge/ForgeGradle
  5. #################################################
  6. Powered by MCP unknown
  7. http://modcoderpack.com
  8. by: Searge, ProfMobius, Fesh0r,
  9. R4wk, ZeuX, IngisKahn, bspkrs
  10. #################################################
  11. :deobfCompileDummyTask
  12. :deobfProvidedDummyTask
  13. :getVersionJson
  14. :extractUserdev UP-TO-DATE
  15. :extractDependencyATs SKIPPED
  16. :extractMcpData SKIPPED
  17. :extractMcpMappings SKIPPED
  18. :genSrgs SKIPPED
  19. :downloadClient SKIPPED
  20. :downloadServer SKIPPED
  21. :splitServerJar SKIPPED
  22. :mergeJars SKIPPED
  23. :deobfMcSRG SKIPPED
  24. :decompileMc SKIPPED
  25. :fixMcSources SKIPPED
  26. :applySourcePatches SKIPPED
  27. :remapMcSources SKIPPED
  28. :recompileMc FAILED
  29.  
  30. FAILURE: Build failed with an exception.
  31.  
  32. * What went wrong:
  33. Execution failed for task ':recompileMc'.
  34. > javac doesn't support the "Djava.ext.dirs" attribute
  35.  
  36. * Try:
  37. Run with --info or --debug option to get more log output.
  38.  
  39. * Exception is:
  40. org.gradle.api.tasks.TaskExecutionException: Execution failed for task ':recompileMc'.
  41. at org.gradle.api.internal.tasks.execution.ExecuteActionsTaskExecuter.executeActions(ExecuteActionsTaskExecuter.java:69)
  42. at org.gradle.api.internal.tasks.execution.ExecuteActionsTaskExecuter.execute(ExecuteActionsTaskExecuter.java:46)
  43. at org.gradle.api.internal.tasks.execution.PostExecutionAnalysisTaskExecuter.execute(PostExecutionAnalysisTaskExecuter.java:35)
  44. at org.gradle.api.internal.tasks.execution.SkipUpToDateTaskExecuter.execute(SkipUpToDateTaskExecuter.java:64)
  45. at org.gradle.api.internal.tasks.execution.ValidatingTaskExecuter.execute(ValidatingTaskExecuter.java:58)
  46. at org.gradle.api.internal.tasks.execution.SkipEmptySourceFilesTaskExecuter.execute(SkipEmptySourceFilesTaskExecuter.java:52)
  47. at org.gradle.api.internal.tasks.execution.SkipTaskWithNoActionsExecuter.execute(SkipTaskWithNoActionsExecuter.java:52)
  48. at org.gradle.api.internal.tasks.execution.SkipOnlyIfTaskExecuter.execute(SkipOnlyIfTaskExecuter.java:53)
  49. at org.gradle.api.internal.tasks.execution.ExecuteAtMostOnceTaskExecuter.execute(ExecuteAtMostOnceTaskExecuter.java:43)
  50. at org.gradle.execution.taskgraph.DefaultTaskGraphExecuter$EventFiringTaskWorker.execute(DefaultTaskGraphExecuter.java:203)
  51. at org.gradle.execution.taskgraph.DefaultTaskGraphExecuter$EventFiringTaskWorker.execute(DefaultTaskGraphExecuter.java:185)
  52. at org.gradle.execution.taskgraph.AbstractTaskPlanExecutor$TaskExecutorWorker.processTask(AbstractTaskPlanExecutor.java:62)
  53. at org.gradle.execution.taskgraph.AbstractTaskPlanExecutor$TaskExecutorWorker.run(AbstractTaskPlanExecutor.java:50)
  54. at org.gradle.execution.taskgraph.DefaultTaskPlanExecutor.process(DefaultTaskPlanExecutor.java:25)
  55. at org.gradle.execution.taskgraph.DefaultTaskGraphExecuter.execute(DefaultTaskGraphExecuter.java:110)
  56. at org.gradle.execution.SelectedTaskExecutionAction.execute(SelectedTaskExecutionAction.java:37)
  57. at org.gradle.execution.DefaultBuildExecuter.execute(DefaultBuildExecuter.java:37)
  58. at org.gradle.execution.DefaultBuildExecuter.access$000(DefaultBuildExecuter.java:23)
  59. at org.gradle.execution.DefaultBuildExecuter$1.proceed(DefaultBuildExecuter.java:43)
  60. at org.gradle.execution.DryRunBuildExecutionAction.execute(DryRunBuildExecutionAction.java:32)
  61. at org.gradle.execution.DefaultBuildExecuter.execute(DefaultBuildExecuter.java:37)
  62. at org.gradle.execution.DefaultBuildExecuter.execute(DefaultBuildExecuter.java:30)
  63. at org.gradle.initialization.DefaultGradleLauncher$4.run(DefaultGradleLauncher.java:155)
  64. at org.gradle.internal.Factories$1.create(Factories.java:22)
  65. at org.gradle.internal.progress.DefaultBuildOperationExecutor.run(DefaultBuildOperationExecutor.java:90)
  66. at org.gradle.internal.progress.DefaultBuildOperationExecutor.run(DefaultBuildOperationExecutor.java:52)
  67. at org.gradle.initialization.DefaultGradleLauncher.doBuildStages(DefaultGradleLauncher.java:152)
  68. at org.gradle.initialization.DefaultGradleLauncher.access$200(DefaultGradleLauncher.java:33)
  69. at org.gradle.initialization.DefaultGradleLauncher$1.create(DefaultGradleLauncher.java:100)
  70. at org.gradle.initialization.DefaultGradleLauncher$1.create(DefaultGradleLauncher.java:94)
  71. at org.gradle.internal.progress.DefaultBuildOperationExecutor.run(DefaultBuildOperationExecutor.java:90)
  72. at org.gradle.internal.progress.DefaultBuildOperationExecutor.run(DefaultBuildOperationExecutor.java:62)
  73. at org.gradle.initialization.DefaultGradleLauncher.doBuild(DefaultGradleLauncher.java:94)
  74. at org.gradle.initialization.DefaultGradleLauncher.run(DefaultGradleLauncher.java:83)
  75. at org.gradle.launcher.exec.InProcessBuildActionExecuter$DefaultBuildController.run(InProcessBuildActionExecuter.java:94)
  76. at org.gradle.tooling.internal.provider.ExecuteBuildActionRunner.run(ExecuteBuildActionRunner.java:28)
  77. at org.gradle.launcher.exec.ChainingBuildActionRunner.run(ChainingBuildActionRunner.java:35)
  78. at org.gradle.launcher.exec.InProcessBuildActionExecuter.execute(InProcessBuildActionExecuter.java:43)
  79. at org.gradle.launcher.exec.InProcessBuildActionExecuter.execute(InProcessBuildActionExecuter.java:28)
  80. at org.gradle.launcher.exec.ContinuousBuildActionExecuter.execute(ContinuousBuildActionExecuter.java:77)
  81. at org.gradle.launcher.exec.ContinuousBuildActionExecuter.execute(ContinuousBuildActionExecuter.java:47)
  82. at org.gradle.launcher.exec.DaemonUsageSuggestingBuildActionExecuter.execute(DaemonUsageSuggestingBuildActionExecuter.java:51)
  83. at org.gradle.launcher.exec.DaemonUsageSuggestingBuildActionExecuter.execute(DaemonUsageSuggestingBuildActionExecuter.java:28)
  84. at org.gradle.launcher.cli.RunBuildAction.run(RunBuildAction.java:43)
  85. at org.gradle.internal.Actions$RunnableActionAdapter.execute(Actions.java:170)
  86. at org.gradle.launcher.cli.CommandLineActionFactory$ParseAndBuildAction.execute(CommandLineActionFactory.java:237)
  87. at org.gradle.launcher.cli.CommandLineActionFactory$ParseAndBuildAction.execute(CommandLineActionFactory.java:210)
  88. at org.gradle.launcher.cli.JavaRuntimeValidationAction.execute(JavaRuntimeValidationAction.java:35)
  89. at org.gradle.launcher.cli.JavaRuntimeValidationAction.execute(JavaRuntimeValidationAction.java:24)
  90. at org.gradle.launcher.cli.CommandLineActionFactory$WithLogging.execute(CommandLineActionFactory.java:206)
  91. at org.gradle.launcher.cli.CommandLineActionFactory$WithLogging.execute(CommandLineActionFactory.java:169)
  92. at org.gradle.launcher.cli.ExceptionReportingAction.execute(ExceptionReportingAction.java:33)
  93. at org.gradle.launcher.cli.ExceptionReportingAction.execute(ExceptionReportingAction.java:22)
  94. at org.gradle.launcher.Main.doAction(Main.java:33)
  95. at org.gradle.launcher.bootstrap.EntryPoint.run(EntryPoint.java:45)
  96. at org.gradle.launcher.bootstrap.ProcessBootstrap.runNoExit(ProcessBootstrap.java:54)
  97. at org.gradle.launcher.bootstrap.ProcessBootstrap.run(ProcessBootstrap.java:35)
  98. at org.gradle.launcher.GradleMain.main(GradleMain.java:23)
  99. at org.gradle.wrapper.BootstrapMainStarter.start(BootstrapMainStarter.java:30)
  100. at org.gradle.wrapper.WrapperExecutor.execute(WrapperExecutor.java:127)
  101. at org.gradle.wrapper.GradleWrapperMain.main(GradleWrapperMain.java:61)
  102. Caused by: : javac doesn't support the "Djava.ext.dirs" attribute
  103. at org.apache.tools.ant.RuntimeConfigurable.maybeConfigure(RuntimeConfigurable.java:536)
  104. at org.apache.tools.ant.RuntimeConfigurable.maybeConfigure(RuntimeConfigurable.java:464)
  105. at org.apache.tools.ant.Task.maybeConfigure(Task.java:202)
  106. at org.apache.tools.ant.UnknownElement.configure(UnknownElement.java:199)
  107. at org.apache.tools.ant.UnknownElement.maybeConfigure(UnknownElement.java:163)
  108. at org.gradle.api.internal.project.ant.BasicAntBuilder.nodeCompleted(BasicAntBuilder.java:77)
  109. at org.gradle.api.internal.project.ant.BasicAntBuilder.doInvokeMethod(BasicAntBuilder.java:92)
  110. at net.minecraftforge.gradle.user.TaskRecompileMc.doStuff(TaskRecompileMc.java:84)
  111. at org.gradle.internal.reflect.JavaMethod.invoke(JavaMethod.java:75)
  112. at org.gradle.api.internal.project.taskfactory.AnnotationProcessingTaskFactory$StandardTaskAction.doExecute(AnnotationProcessingTaskFactory.java:226)
  113. at org.gradle.api.internal.project.taskfactory.AnnotationProcessingTaskFactory$StandardTaskAction.execute(AnnotationProcessingTaskFactory.java:219)
  114. at org.gradle.api.internal.project.taskfactory.AnnotationProcessingTaskFactory$StandardTaskAction.execute(AnnotationProcessingTaskFactory.java:208)
  115. at org.gradle.api.internal.AbstractTask$TaskActionWrapper.execute(AbstractTask.java:585)
  116. at org.gradle.api.internal.AbstractTask$TaskActionWrapper.execute(AbstractTask.java:568)
  117. at org.gradle.api.internal.tasks.execution.ExecuteActionsTaskExecuter.executeAction(ExecuteActionsTaskExecuter.java:80)
  118. at org.gradle.api.internal.tasks.execution.ExecuteActionsTaskExecuter.executeActions(ExecuteActionsTaskExecuter.java:61)
  119. ... 60 more
  120. Caused by: The <javac> type doesn't support the "Djava.ext.dirs" attribute.
  121. at org.apache.tools.ant.IntrospectionHelper.setAttribute(IntrospectionHelper.java:408)
  122. at org.apache.tools.ant.RuntimeConfigurable.maybeConfigure(RuntimeConfigurable.java:528)
  123. ... 75 more
  124.  
  125.  
  126. BUILD FAILED
  127.  
  128. Total time: 53.639 secs
Advertisement
Add Comment
Please, Sign In to add comment