Want more features on Pastebin? Sign Up, it's FREE!
Guest

Untitled

By: a guest on Jan 31st, 2013  |  syntax: Bash  |  size: 3.09 KB  |  views: 88  |  expires: Never
download  |  raw  |  embed  |  report abuse  |  print
Text below is selected. Please press Ctrl+C to copy to your clipboard. (⌘+C on Mac)
  1. dsampson@David-Desktop ~/arm-dev/STM32L1xx/projects/template/code $ make
  2. /home/dsampson/arm-dev/arm-gcc/bin/arm-none-linux-gnueabi-gcc -T../stm32_flash.ld -mthumb -mcpu=cortex-m3  -o code.elf startup_stm32l1xx_md.o system_stm32l1xx.o  main.o
  3. /home/dsampson/arm-dev/arm-gcc/bin/../lib/gcc/arm-none-linux-gnueabi/4.7.2/../../../../arm-none-linux-gnueabi/bin/ld: error: startup_stm32l1xx_md.o: Conflicting architecture profiles M/A
  4. /home/dsampson/arm-dev/arm-gcc/bin/../lib/gcc/arm-none-linux-gnueabi/4.7.2/../../../../arm-none-linux-gnueabi/bin/ld: failed to merge target specific data of file startup_stm32l1xx_md.o
  5. /home/dsampson/arm-dev/arm-gcc/bin/../lib/gcc/arm-none-linux-gnueabi/4.7.2/../../../../arm-none-linux-gnueabi/bin/ld: error: system_stm32l1xx.o: Conflicting architecture profiles M/A
  6. /home/dsampson/arm-dev/arm-gcc/bin/../lib/gcc/arm-none-linux-gnueabi/4.7.2/../../../../arm-none-linux-gnueabi/bin/ld: failed to merge target specific data of file system_stm32l1xx.o
  7. /home/dsampson/arm-dev/arm-gcc/bin/../lib/gcc/arm-none-linux-gnueabi/4.7.2/../../../../arm-none-linux-gnueabi/bin/ld: error: main.o: Conflicting architecture profiles M/A
  8. /home/dsampson/arm-dev/arm-gcc/bin/../lib/gcc/arm-none-linux-gnueabi/4.7.2/../../../../arm-none-linux-gnueabi/bin/ld: failed to merge target specific data of file main.o
  9. startup_stm32l1xx_md.o: In function `LoopFillZerobss':
  10. /home/dsampson/arm-dev/STM32L1xx/projects/template/code/../startup_stm32l1xx_md.s:104: undefined reference to `__libc_init_array'
  11. /home/dsampson/arm-dev/arm-gcc/bin/../lib/gcc/arm-none-linux-gnueabi/4.7.2/../../../../arm-none-linux-gnueabi/bin/ld: BFD (Sourcery CodeBench Lite 2012.09-64) 2.23.51.20120829 assertion fail /scratch/jbrown/arm-linux/obj/binutils-src-2012.09-64-arm-none-linux-gnueabi-i686-pc-linux-gnu/bfd/elf32-arm.c:7677
  12. /home/dsampson/arm-dev/arm-gcc/bin/../lib/gcc/arm-none-linux-gnueabi/4.7.2/../../../../arm-none-linux-gnueabi/bin/ld: BFD (Sourcery CodeBench Lite 2012.09-64) 2.23.51.20120829 assertion fail /scratch/jbrown/arm-linux/obj/binutils-src-2012.09-64-arm-none-linux-gnueabi-i686-pc-linux-gnu/bfd/elf32-arm.c:7677
  13. /home/dsampson/arm-dev/arm-gcc/bin/../lib/gcc/arm-none-linux-gnueabi/4.7.2/../../../../arm-none-linux-gnueabi/bin/ld: BFD (Sourcery CodeBench Lite 2012.09-64) 2.23.51.20120829 assertion fail /scratch/jbrown/arm-linux/obj/binutils-src-2012.09-64-arm-none-linux-gnueabi-i686-pc-linux-gnu/bfd/elf32-arm.c:7677
  14. /home/dsampson/arm-dev/arm-gcc/bin/../lib/gcc/arm-none-linux-gnueabi/4.7.2/../../../../arm-none-linux-gnueabi/bin/ld: BFD (Sourcery CodeBench Lite 2012.09-64) 2.23.51.20120829 assertion fail /scratch/jbrown/arm-linux/obj/binutils-src-2012.09-64-arm-none-linux-gnueabi-i686-pc-linux-gnu/bfd/elf32-arm.c:7677
  15. /home/dsampson/arm-dev/arm-gcc/bin/../lib/gcc/arm-none-linux-gnueabi/4.7.2/../../../../arm-none-linux-gnueabi/bin/ld: error: required section '.rel.plt' not found in the linker script
  16. /home/dsampson/arm-dev/arm-gcc/bin/../lib/gcc/arm-none-linux-gnueabi/4.7.2/../../../../arm-none-linux-gnueabi/bin/ld: final link failed: Invalid operation
  17. collect2: error: ld returned 1 exit status
  18. make: *** [code.elf] Error 1
clone this paste RAW Paste Data