Pastebin launched a little side project called HostCabi.net, check it out ;-)Don't like ads? PRO users don't see any ads ;-)
Guest

Untitled

By: a guest on May 8th, 2010  |  syntax: None  |  size: 0.63 KB  |  hits: 387  |  expires: Never
download  |  raw  |  embed  |  report abuse  |  print
Text below is selected. Please press Ctrl+C to copy to your clipboard. (⌘+C on Mac)
  1. compiling openssl
  2. make[1]: Entering directory `/tmp/yaourt-tmp-estk/aur-ruby-1.8.7-svn/ruby-1.8.7-svn/src/ext/openssl'
  3. gcc -I. -I../.. -I../../. -I../.././ext/openssl -DRUBY_EXTCONF_H=\"extconf.h\"    -fPIC -march=x86-64 -mtune=generic -O2 -pipe  -fPIC   -c ossl.c
  4. ossl.c:118:1: error: expected ‘)’ before ‘*’ token
  5. ossl.c:119:1: error: expected ‘)’ before ‘*’ token
  6. make[1]: *** [ossl.o] Error 1
  7. make[1]: Leaving directory `/tmp/yaourt-tmp-estk/aur-ruby-1.8.7-svn/ruby-1.8.7-svn/src/ext/openssl'
  8. make: *** [all] Error 1
  9. ==> ERROR: Build Failed.
  10.     Aborting...
  11. Error: Makepkg was unable to build ruby-1.8.7-svn package.