Guest User

silk.js odroid

a guest
Mar 19th, 2014
115
0
Never
Not a member of Pastebin yet? Sign Up, it unlocks many cool features!
text 160.77 KB | None | 0 0
  1. odroid@odroid:~/src/SilkJS$ make
  2. cd src && make -fMakefile
  3. make[1]: Entering directory `/home/odroid/src/SilkJS/src'
  4. sudo apt-get -y install libmm-dev libmysqlclient-dev libmemcached-dev libgd2-xpm-dev libncurses5-dev libsqlite3-dev libcurl4-openssl-dev libssh2-1-dev libcairo2-dev
  5. Reading package lists... Done
  6. Building dependency tree
  7. Reading state information... Done
  8. libcairo2-dev is already the newest version.
  9. libgd2-xpm-dev is already the newest version.
  10. libmemcached-dev is already the newest version.
  11. libncurses5-dev is already the newest version.
  12. libsqlite3-dev is already the newest version.
  13. libmm-dev is already the newest version.
  14. libssh2-1-dev is already the newest version.
  15. libcurl4-openssl-dev is already the newest version.
  16. libmysqlclient-dev is already the newest version.
  17. The following packages were automatically installed and are no longer required:
  18. libv8-3.14.5 openjdk-7-jre-lib xbase-clients
  19. Use 'apt-get autoremove' to remove them.
  20. 0 upgraded, 0 newly installed, 0 to remove and 13 not upgraded.
  21. echo "svn checkout"
  22. svn checkout
  23. svn checkout -r 12823 http://v8.googlecode.com/svn/trunk/ v8-read-only
  24. A v8-read-only/test
  25. A v8-read-only/test/es5conform
  26. A v8-read-only/test/es5conform/es5conform.status
  27. A v8-read-only/test/es5conform/harness-adapt.js
  28. A v8-read-only/test/es5conform/testcfg.py
  29. A v8-read-only/test/es5conform/README
  30. A v8-read-only/test/preparser
  31. A v8-read-only/test/preparser/strict-octal-use-strict-after.js
  32. A v8-read-only/test/preparser/symbols-only.js
  33. A v8-read-only/test/preparser/nonstrict-eval.js
  34. A v8-read-only/test/preparser/strict-octal-use-strict-before.js
  35. A v8-read-only/test/preparser/preparser.expectation
  36. A v8-read-only/test/preparser/preparser.status
  37. A v8-read-only/test/preparser/non-use-strict-hex-escape.js
  38. A v8-read-only/test/preparser/testcfg.py
  39. A v8-read-only/test/preparser/strict-identifiers.pyt
  40. A v8-read-only/test/preparser/strict-octal-string.js
  41. A v8-read-only/test/preparser/strict-with.js
  42. A v8-read-only/test/preparser/nonstrict-arguments.js
  43. A v8-read-only/test/preparser/functions-only.js
  44. A v8-read-only/test/preparser/duplicate-parameter.pyt
  45. A v8-read-only/test/preparser/non-use-strict-octal-escape.js
  46. A v8-read-only/test/preparser/strict-const.js
  47. A v8-read-only/test/preparser/nonstrict-with.js
  48. A v8-read-only/test/preparser/duplicate-property.pyt
  49. A v8-read-only/test/preparser/non-alphanum.js
  50. A v8-read-only/test/preparser/strict-function-statement.pyt
  51. A v8-read-only/test/preparser/strict-octal-number.js
  52. A v8-read-only/test/preparser/empty.js
  53. A v8-read-only/test/preparser/non-use-strict-uhex-escape.js
  54. A v8-read-only/test/preparser/strict-octal-indirect-regexp.js
  55. A v8-read-only/test/preparser/strict-octal-regexp.js
  56. A v8-read-only/test/message
  57. A v8-read-only/test/message/try-finally-throw-in-finally.out
  58. A v8-read-only/test/message/try-catch-finally-throw-in-catch-and-finally.out
  59. A v8-read-only/test/message/try-catch-finally-return-in-finally.js
  60. A v8-read-only/test/message/overwritten-builtins.out
  61. A v8-read-only/test/message/try-catch-finally-throw-in-catch.out
  62. A v8-read-only/test/message/try-catch-finally-throw-in-catch-and-finally.js
  63. A v8-read-only/test/message/testcfg.py
  64. A v8-read-only/test/message/try-finally-throw-in-finally.js
  65. A v8-read-only/test/message/try-catch-finally-throw-in-catch.js
  66. A v8-read-only/test/message/overwritten-builtins.js
  67. A v8-read-only/test/message/try-catch-finally-no-message.out
  68. A v8-read-only/test/message/try-finally-throw-in-try-and-finally.out
  69. A v8-read-only/test/message/try-finally-return-in-finally.out
  70. A v8-read-only/test/message/simple-throw.out
  71. A v8-read-only/test/message/try-finally-throw-in-try.out
  72. A v8-read-only/test/message/try-catch-finally-throw-in-finally.out
  73. A v8-read-only/test/message/try-catch-finally-no-message.js
  74. A v8-read-only/test/message/try-finally-return-in-finally.js
  75. A v8-read-only/test/message/try-finally-throw-in-try-and-finally.js
  76. A v8-read-only/test/message/simple-throw.js
  77. A v8-read-only/test/message/replacement-marker-as-argument.out
  78. A v8-read-only/test/message/try-catch-finally-throw-in-finally.js
  79. A v8-read-only/test/message/message.status
  80. A v8-read-only/test/message/try-finally-throw-in-try.js
  81. A v8-read-only/test/message/regress
  82. A v8-read-only/test/message/regress/regress-1527.js
  83. A v8-read-only/test/message/regress/regress-73.out
  84. A v8-read-only/test/message/regress/regress-75.out
  85. A v8-read-only/test/message/regress/regress-1527.out
  86. A v8-read-only/test/message/regress/regress-73.js
  87. A v8-read-only/test/message/regress/regress-75.js
  88. A v8-read-only/test/message/replacement-marker-as-argument.js
  89. A v8-read-only/test/message/try-catch-finally-return-in-finally.out
  90. A v8-read-only/test/cctest
  91. A v8-read-only/test/cctest/test-log.cc
  92. A v8-read-only/test/cctest/test-fast-dtoa.cc
  93. A v8-read-only/test/cctest/test-profile-generator.cc
  94. A v8-read-only/test/cctest/test-accessors.cc
  95. A v8-read-only/test/cctest/log-eq-of-logging-and-traversal.js
  96. A v8-read-only/test/cctest/test-circular-queue.cc
  97. A v8-read-only/test/cctest/test-debug.cc
  98. A v8-read-only/test/cctest/test-ast.cc
  99. A v8-read-only/test/cctest/test-diy-fp.cc
  100. A v8-read-only/test/cctest/test-assembler-x64.cc
  101. A v8-read-only/test/cctest/test-thread-termination.cc
  102. A v8-read-only/test/cctest/test-platform-nullos.cc
  103. A v8-read-only/test/cctest/test-deoptimization.cc
  104. A v8-read-only/test/cctest/test-log-stack-tracer.cc
  105. A v8-read-only/test/cctest/gay-fixed.h
  106. A v8-read-only/test/cctest/cctest.cc
  107. A v8-read-only/test/cctest/test-weakmaps.cc
  108. A v8-read-only/test/cctest/test-sockets.cc
  109. A v8-read-only/test/cctest/test-list.cc
  110. A v8-read-only/test/cctest/gay-shortest.cc
  111. A v8-read-only/test/cctest/test-mark-compact.cc
  112. A v8-read-only/test/cctest/test-strtod.cc
  113. A v8-read-only/test/cctest/cctest.gyp
  114. A v8-read-only/test/cctest/test-platform-win32.cc
  115. A v8-read-only/test/cctest/test-fixed-dtoa.cc
  116. A v8-read-only/test/cctest/testcfg.py
  117. A v8-read-only/test/cctest/test-disasm-mips.cc
  118. A v8-read-only/test/cctest/test-serialize.cc
  119. A v8-read-only/test/cctest/test-decls.cc
  120. A v8-read-only/test/cctest/test-macro-assembler-x64.cc
  121. A v8-read-only/test/cctest/gay-precision.cc
  122. A v8-read-only/test/cctest/test-reloc-info.cc
  123. A v8-read-only/test/cctest/test-utils.cc
  124. A v8-read-only/test/cctest/test-dataflow.cc
  125. A v8-read-only/test/cctest/test-lockers.cc
  126. A v8-read-only/test/cctest/test-bignum-dtoa.cc
  127. A v8-read-only/test/cctest/test-cpu-profiler.cc
  128. A v8-read-only/test/cctest/test-compiler.cc
  129. A v8-read-only/test/cctest/test-disasm-ia32.cc
  130. A v8-read-only/test/cctest/test-spaces.cc
  131. A v8-read-only/test/cctest/test-random.cc
  132. A v8-read-only/test/cctest/test-bignum.cc
  133. A v8-read-only/test/cctest/test-platform-linux.cc
  134. A v8-read-only/test/cctest/test-hashmap.cc
  135. A v8-read-only/test/cctest/test-platform-macos.cc
  136. A v8-read-only/test/cctest/test-platform-tls.cc
  137. A v8-read-only/test/cctest/test-version.cc
  138. A v8-read-only/test/cctest/test-dtoa.cc
  139. A v8-read-only/test/cctest/test-regexp.cc
  140. A v8-read-only/test/cctest/test-threads.cc
  141. A v8-read-only/test/cctest/test-unbound-queue.cc
  142. A v8-read-only/test/cctest/test-heap-profiler.cc
  143. A v8-read-only/test/cctest/test-disasm-arm.cc
  144. A v8-read-only/test/cctest/gay-fixed.cc
  145. A v8-read-only/test/cctest/test-parsing.cc
  146. A v8-read-only/test/cctest/test-liveedit.cc
  147. A v8-read-only/test/cctest/test-func-name-inference.cc
  148. A v8-read-only/test/cctest/test-api.cc
  149. A v8-read-only/test/cctest/cctest.h
  150. A v8-read-only/test/cctest/test-date.cc
  151. A v8-read-only/test/cctest/gay-shortest.h
  152. A v8-read-only/test/cctest/test-hashing.cc
  153. A v8-read-only/test/cctest/test-assembler-mips.cc
  154. A v8-read-only/test/cctest/SConscript
  155. A v8-read-only/test/cctest/test-lock.cc
  156. A v8-read-only/test/cctest/test-strings.cc
  157. A v8-read-only/test/cctest/test-alloc.cc
  158. A v8-read-only/test/cctest/test-assembler-arm.cc
  159. A v8-read-only/test/cctest/test-flags.cc
  160. A v8-read-only/test/cctest/gay-precision.h
  161. A v8-read-only/test/cctest/test-disasm-x64.cc
  162. A v8-read-only/test/cctest/test-dictionary.cc
  163. A v8-read-only/test/cctest/cctest.status
  164. A v8-read-only/test/cctest/test-conversions.cc
  165. A v8-read-only/test/cctest/test-assembler-ia32.cc
  166. A v8-read-only/test/cctest/test-double.cc
  167. A v8-read-only/test/cctest/test-heap.cc
  168. A v8-read-only/test/mozilla
  169. A v8-read-only/test/mozilla/mozilla-shell-emulation.js
  170. A v8-read-only/test/mozilla/testcfg.py
  171. A v8-read-only/test/mozilla/mozilla.status
  172. A v8-read-only/test/mjsunit
  173. A v8-read-only/test/mjsunit/arguments-indirect.js
  174. A v8-read-only/test/mjsunit/debug-breakpoints.js
  175. A v8-read-only/test/mjsunit/apply-arguments-gc-safepoint.js
  176. A v8-read-only/test/mjsunit/mul-exhaustive-part1.js
  177. A v8-read-only/test/mjsunit/megamorphic-callbacks.js
  178. A v8-read-only/test/mjsunit/const-declaration.js
  179. A v8-read-only/test/mjsunit/mirror-undefined.js
  180. A v8-read-only/test/mjsunit/debug-version.js
  181. A v8-read-only/test/mjsunit/sparse-array.js
  182. A v8-read-only/test/mjsunit/invalid-source-element.js
  183. A v8-read-only/test/mjsunit/try.js
  184. A v8-read-only/test/mjsunit/object-is.js
  185. A v8-read-only/test/mjsunit/fuzz-accessors.js
  186. A v8-read-only/test/mjsunit/fast-non-keyed.js
  187. A v8-read-only/test/mjsunit/get-prototype-of.js
  188. A v8-read-only/test/mjsunit/date-parse.js
  189. A v8-read-only/test/mjsunit/global-deleted-property-keyed.js
  190. A v8-read-only/test/mjsunit/object-define-properties.js
  191. A v8-read-only/test/mjsunit/var.js
  192. A v8-read-only/test/mjsunit/debug-event-listener.js
  193. A v8-read-only/test/mjsunit/try-finally-nested.js
  194. A v8-read-only/test/mjsunit/array-length.js
  195. A v8-read-only/test/mjsunit/math-floor-part2.js
  196. A v8-read-only/test/mjsunit/div-mod.js
  197. A v8-read-only/test/mjsunit/big-object-literal.js
  198. A v8-read-only/test/mjsunit/debug-liveedit-stack-padding.js
  199. A v8-read-only/test/mjsunit/function-arguments-null.js
  200. A v8-read-only/test/mjsunit/binary-operation-overwrite.js
  201. A v8-read-only/test/mjsunit/debug-conditional-breakpoints.js
  202. A v8-read-only/test/mjsunit/array-length-number-conversion.js
  203. A v8-read-only/test/mjsunit/setter-on-constructor-prototype.js
  204. A v8-read-only/test/mjsunit/testcfg.py
  205. A v8-read-only/test/mjsunit/debug-liveedit-patch-positions.js
  206. A v8-read-only/test/mjsunit/delete-in-with.js
  207. A v8-read-only/test/mjsunit/mod.js
  208. A v8-read-only/test/mjsunit/string-replace.js
  209. A v8-read-only/test/mjsunit/compare-character.js
  210. A v8-read-only/test/mjsunit/mirror-unresolved-function.js
  211. A v8-read-only/test/mjsunit/large-object-allocation.js
  212. A v8-read-only/test/mjsunit/debug-stepin-function-call.js
  213. A v8-read-only/test/mjsunit/global-load-from-nested-eval.js
  214. A v8-read-only/test/mjsunit/array-store-and-grow.js
  215. A v8-read-only/test/mjsunit/indexed-value-properties.js
  216. A v8-read-only/test/mjsunit/object-prevent-extensions.js
  217. A v8-read-only/test/mjsunit/hex-parsing.js
  218. A v8-read-only/test/mjsunit/apply.js
  219. A v8-read-only/test/mjsunit/elements-transition-hoisting.js
  220. A v8-read-only/test/mjsunit/debug-liveedit-1.js
  221. A v8-read-only/test/mjsunit/debug-script-breakpoints-nested.js
  222. A v8-read-only/test/mjsunit/debug-enable-disable-breakpoints.js
  223. A v8-read-only/test/mjsunit/value-wrapper.js
  224. A v8-read-only/test/mjsunit/scope-calls-eval.js
  225. A v8-read-only/test/mjsunit/string-external-cached.js
  226. A v8-read-only/test/mjsunit/array-unshift.js
  227. A v8-read-only/test/mjsunit/string-externalize.js
  228. A v8-read-only/test/mjsunit/arguments-escape.js
  229. A v8-read-only/test/mjsunit/array-sort.js
  230. A v8-read-only/test/mjsunit/unicodelctest-no-optimization.js
  231. A v8-read-only/test/mjsunit/arguments-enum.js
  232. A v8-read-only/test/mjsunit/function-property.js
  233. A v8-read-only/test/mjsunit/debug-liveedit-double-call.js
  234. A v8-read-only/test/mjsunit/mul-exhaustive-part7.js
  235. A v8-read-only/test/mjsunit/no-branch-elimination.js
  236. A v8-read-only/test/mjsunit/math-round.js
  237. A v8-read-only/test/mjsunit/array-indexing.js
  238. A v8-read-only/test/mjsunit/sparse-array-reverse.js
  239. A v8-read-only/test/mjsunit/array-concat.js
  240. A v8-read-only/test/mjsunit/stack-traces.js
  241. A v8-read-only/test/mjsunit/debug-backtrace-text.js
  242. A v8-read-only/test/mjsunit/function.js
  243. A v8-read-only/test/mjsunit/api-call-after-bypassed-exception.js
  244. A v8-read-only/test/mjsunit/with-readonly.js
  245. A v8-read-only/test/mjsunit/debug-stepout-scope-part4.js
  246. A v8-read-only/test/mjsunit/global-ic.js
  247. A v8-read-only/test/mjsunit/keyed-ic.js
  248. A v8-read-only/test/mjsunit/string-add.js
  249. A v8-read-only/test/mjsunit/global-vars-eval.js
  250. A v8-read-only/test/mjsunit/tobool.js
  251. A v8-read-only/test/mjsunit/debug-referenced-by.js
  252. A v8-read-only/test/mjsunit/int32-ops.js
  253. A v8-read-only/test/mjsunit/arguments-load-across-eval.js
  254. A v8-read-only/test/mjsunit/compiler
  255. A v8-read-only/test/mjsunit/compiler/regress-3218915.js
  256. A v8-read-only/test/mjsunit/compiler/regress-serialized-slots.js
  257. A v8-read-only/test/mjsunit/compiler/jsnatives.js
  258. A v8-read-only/test/mjsunit/compiler/regress-0.js
  259. A v8-read-only/test/mjsunit/compiler/inline-arity-mismatch.js
  260. A v8-read-only/test/mjsunit/compiler/regress-toint32.js
  261. A v8-read-only/test/mjsunit/compiler/call-keyed.js
  262. A v8-read-only/test/mjsunit/compiler/regress-4.js
  263. A v8-read-only/test/mjsunit/compiler/for-stmt.js
  264. A v8-read-only/test/mjsunit/compiler/regress-8.js
  265. A v8-read-only/test/mjsunit/compiler/inline-throw.js
  266. A v8-read-only/test/mjsunit/compiler/regress-deopt-call-as-function.js
  267. A v8-read-only/test/mjsunit/compiler/inline-arguments.js
  268. A v8-read-only/test/mjsunit/compiler/property-refs.js
  269. A v8-read-only/test/mjsunit/compiler/regress-rep-change.js
  270. A v8-read-only/test/mjsunit/compiler/control-flow-0.js
  271. A v8-read-only/test/mjsunit/compiler/optimized-function-calls.js
  272. A v8-read-only/test/mjsunit/compiler/uint32.js
  273. A v8-read-only/test/mjsunit/compiler/unary-add.js
  274. A v8-read-only/test/mjsunit/compiler/literals-assignment.js
  275. A v8-read-only/test/mjsunit/compiler/this-property-refs.js
  276. A v8-read-only/test/mjsunit/compiler/regress-intoverflow.js
  277. A v8-read-only/test/mjsunit/compiler/safepoint.js
  278. A v8-read-only/test/mjsunit/compiler/inline-literals.js
  279. A v8-read-only/test/mjsunit/compiler/optimized-for-in.js
  280. A v8-read-only/test/mjsunit/compiler/regress-stacktrace.js
  281. A v8-read-only/test/mjsunit/compiler/array-length.js
  282. A v8-read-only/test/mjsunit/compiler/regress-stacktrace-methods.js
  283. A v8-read-only/test/mjsunit/compiler/alloc-object.js
  284. A v8-read-only/test/mjsunit/compiler/function-call.js
  285. A v8-read-only/test/mjsunit/compiler/regress-3260426.js
  286. A v8-read-only/test/mjsunit/compiler/simple-inlining.js
  287. A v8-read-only/test/mjsunit/compiler/regress-const.js
  288. A v8-read-only/test/mjsunit/compiler/switch-bailout.js
  289. A v8-read-only/test/mjsunit/compiler/complex-for-in.js
  290. A v8-read-only/test/mjsunit/compiler/inline-construct.js
  291. A v8-read-only/test/mjsunit/compiler/math-floor-local.js
  292. A v8-read-only/test/mjsunit/compiler/inline-accessors.js
  293. A v8-read-only/test/mjsunit/compiler/count-deopt.js
  294. A v8-read-only/test/mjsunit/compiler/delete.js
  295. A v8-read-only/test/mjsunit/compiler/inline-compare.js
  296. A v8-read-only/test/mjsunit/compiler/regress-3249650.js
  297. A v8-read-only/test/mjsunit/compiler/regress-3136962.js
  298. A v8-read-only/test/mjsunit/compiler/math-floor-global.js
  299. A v8-read-only/test/mjsunit/compiler/assignment.js
  300. A v8-read-only/test/mjsunit/compiler/regress-valueof.js
  301. A v8-read-only/test/mjsunit/compiler/simple-bailouts.js
  302. A v8-read-only/test/mjsunit/compiler/logical-and.js
  303. A v8-read-only/test/mjsunit/compiler/regress-3.js
  304. A v8-read-only/test/mjsunit/compiler/lazy-const-lookup.js
  305. A v8-read-only/test/mjsunit/compiler/inline-global-access.js
  306. A v8-read-only/test/mjsunit/compiler/property-simple.js
  307. A v8-read-only/test/mjsunit/compiler/pic.js
  308. A v8-read-only/test/mjsunit/compiler/thisfunction.js
  309. A v8-read-only/test/mjsunit/compiler/regress-7.js
  310. A v8-read-only/test/mjsunit/compiler/inline-conditional.js
  311. A v8-read-only/test/mjsunit/compiler/expression-trees.js
  312. A v8-read-only/test/mjsunit/compiler/alloc-object-huge.js
  313. A v8-read-only/test/mjsunit/compiler/simple-global-access.js
  314. A v8-read-only/test/mjsunit/compiler/simple-osr.js
  315. A v8-read-only/test/mjsunit/compiler/loops.js
  316. A v8-read-only/test/mjsunit/compiler/regress-max.js
  317. A v8-read-only/test/mjsunit/compiler/null-compare.js
  318. A v8-read-only/test/mjsunit/compiler/eval-introduced-closure.js
  319. A v8-read-only/test/mjsunit/compiler/optimized-closures.js
  320. A v8-read-only/test/mjsunit/compiler/regress-gvn.js
  321. A v8-read-only/test/mjsunit/compiler/simple-deopt.js
  322. A v8-read-only/test/mjsunit/compiler/regress-inline-callfunctionstub.js
  323. A v8-read-only/test/mjsunit/compiler/regress-1085.js
  324. A v8-read-only/test/mjsunit/compiler/regress-closures-with-eval.js
  325. A v8-read-only/test/mjsunit/compiler/objectliterals.js
  326. A v8-read-only/test/mjsunit/compiler/regress-106351.js
  327. A v8-read-only/test/mjsunit/compiler/regress-1394.js
  328. A v8-read-only/test/mjsunit/compiler/variables.js
  329. A v8-read-only/test/mjsunit/compiler/regress-2.js
  330. A v8-read-only/test/mjsunit/compiler/regress-6.js
  331. A v8-read-only/test/mjsunit/compiler/regress-96989.js
  332. A v8-read-only/test/mjsunit/compiler/assignment-deopt.js
  333. A v8-read-only/test/mjsunit/compiler/loopcount.js
  334. A v8-read-only/test/mjsunit/compiler/global-accessors.js
  335. A v8-read-only/test/mjsunit/compiler/control-flow-2.js
  336. A v8-read-only/test/mjsunit/compiler/regress-funarguments.js
  337. A v8-read-only/test/mjsunit/compiler/regress-loop-deopt.js
  338. A v8-read-only/test/mjsunit/compiler/short-circuit.js
  339. A v8-read-only/test/mjsunit/compiler/property-stores.js
  340. A v8-read-only/test/mjsunit/compiler/regress-3185901.js
  341. A v8-read-only/test/mjsunit/compiler/deopt-args.js
  342. A v8-read-only/test/mjsunit/compiler/regress-1.js
  343. A v8-read-only/test/mjsunit/compiler/countoperation.js
  344. A v8-read-only/test/mjsunit/compiler/inline-param.js
  345. A v8-read-only/test/mjsunit/compiler/regress-5.js
  346. A v8-read-only/test/mjsunit/compiler/array-access.js
  347. A v8-read-only/test/mjsunit/compiler/regress-arguments.js
  348. A v8-read-only/test/mjsunit/compiler/regress-gap.js
  349. A v8-read-only/test/mjsunit/compiler/literals.js
  350. A v8-read-only/test/mjsunit/compiler/alloc-number.js
  351. A v8-read-only/test/mjsunit/compiler/property-calls.js
  352. A v8-read-only/test/mjsunit/compiler/recursive-deopt.js
  353. A v8-read-only/test/mjsunit/compiler/deopt-inlined-smi.js
  354. A v8-read-only/test/mjsunit/compiler/literals-optimized.js
  355. A v8-read-only/test/mjsunit/compiler/control-flow-1.js
  356. A v8-read-only/test/mjsunit/compiler/binary-ops.js
  357. A v8-read-only/test/mjsunit/compiler/regress-funcaller.js
  358. A v8-read-only/test/mjsunit/compiler/globals.js
  359. A v8-read-only/test/mjsunit/compiler/inline-two.js
  360. A v8-read-only/test/mjsunit/compiler/strict-recompile.js
  361. A v8-read-only/test/mjsunit/compiler/compare.js
  362. A v8-read-only/test/mjsunit/compiler/simple-binary-op.js
  363. A v8-read-only/test/mjsunit/compiler/logical-or.js
  364. A v8-read-only/test/mjsunit/compiler/regress-or.js
  365. A v8-read-only/test/mjsunit/compiler/regress-lbranch-double.js
  366. A v8-read-only/test/mjsunit/compiler/regress-loadfield.js
  367. A v8-read-only/test/mjsunit/compiler/optimize-bitnot.js
  368. A v8-read-only/test/mjsunit/compiler/regress-max-locals-for-osr.js
  369. A v8-read-only/test/mjsunit/compiler/regress-lazy-deopt.js
  370. A v8-read-only/test/mjsunit/compiler/inline-context-slots.js
  371. A v8-read-only/test/mjsunit/compiler/regress-arrayliteral.js
  372. A v8-read-only/test/mjsunit/string-split.js
  373. A v8-read-only/test/mjsunit/debug-step-3.js
  374. A v8-read-only/test/mjsunit/debug-mirror-cache.js
  375. A v8-read-only/test/mjsunit/debug-step.js
  376. A v8-read-only/test/mjsunit/context-variable-assignments.js
  377. A v8-read-only/test/mjsunit/packed-elements.js
  378. A v8-read-only/test/mjsunit/debug-liveedit-newsource.js
  379. A v8-read-only/test/mjsunit/numops-fuzz-part2.js
  380. A v8-read-only/test/mjsunit/negate.js
  381. A v8-read-only/test/mjsunit/elements-transition.js
  382. A v8-read-only/test/mjsunit/for-in-special-cases.js
  383. A v8-read-only/test/mjsunit/sum-0-plus-undefined-is-NaN.js
  384. A v8-read-only/test/mjsunit/mul-exhaustive-part2.js
  385. A v8-read-only/test/mjsunit/debug-evaluate-bool-constructor.js
  386. A v8-read-only/test/mjsunit/in.js
  387. A v8-read-only/test/mjsunit/constant-folding.js
  388. A v8-read-only/test/mjsunit/samevalue.js
  389. A v8-read-only/test/mjsunit/arguments-lazy.js
  390. A v8-read-only/test/mjsunit/html-string-funcs.js
  391. A v8-read-only/test/mjsunit/debug-stepin-builtin-callback.js
  392. A v8-read-only/test/mjsunit/array-bounds-check-removal.js
  393. A v8-read-only/test/mjsunit/function-caller.js
  394. A v8-read-only/test/mjsunit/extra-arguments.js
  395. A v8-read-only/test/mjsunit/polymorph-arrays.js
  396. A v8-read-only/test/mjsunit/function-prototype.js
  397. A v8-read-only/test/mjsunit/scanner.js
  398. A v8-read-only/test/mjsunit/strict-mode-opt.js
  399. A v8-read-only/test/mjsunit/throw-exception-for-null-access.js
  400. A v8-read-only/test/mjsunit/debug-evaluate-arguments.js
  401. A v8-read-only/test/mjsunit/math-floor-part3.js
  402. A v8-read-only/test/mjsunit/arguments-call-apply.js
  403. A v8-read-only/test/mjsunit/unicode-test.js
  404. A v8-read-only/test/mjsunit/debug-function-scopes.js
  405. A v8-read-only/test/mjsunit/proto.js
  406. A v8-read-only/test/mjsunit/regexp-standalones.js
  407. A v8-read-only/test/mjsunit/debug-suspend.js
  408. A v8-read-only/test/mjsunit/number-tostring-small.js
  409. A v8-read-only/test/mjsunit/arguments-opt.js
  410. A v8-read-only/test/mjsunit/smi-ops-inlined.js
  411. A v8-read-only/test/mjsunit/comparison-ops-and-undefined.js
  412. A v8-read-only/test/mjsunit/string-localecompare.js
  413. A v8-read-only/test/mjsunit/string-index.js
  414. A v8-read-only/test/mjsunit/array-slice.js
  415. A v8-read-only/test/mjsunit/mirror-string.js
  416. A v8-read-only/test/mjsunit/debug-handle.js
  417. A v8-read-only/test/mjsunit/deopt-minus-zero.js
  418. A v8-read-only/test/mjsunit/length.js
  419. A v8-read-only/test/mjsunit/mirror-null.js
  420. A v8-read-only/test/mjsunit/bugs
  421. A v8-read-only/test/mjsunit/bugs/bug-941049.js
  422. A v8-read-only/test/mjsunit/bugs/bug-617.js
  423. A v8-read-only/test/mjsunit/bugs/bug-2337.js
  424. A v8-read-only/test/mjsunit/bugs/bug-618.js
  425. A v8-read-only/test/mjsunit/bugs/618.js
  426. A v8-read-only/test/mjsunit/bugs/bug-1344252.js
  427. A v8-read-only/test/mjsunit/bugs/bug-222.js
  428. A v8-read-only/test/mjsunit/bugs/harmony
  429. A v8-read-only/test/mjsunit/bugs/harmony/debug-blockscopes.js
  430. A v8-read-only/test/mjsunit/fast-element-smi-check.js
  431. A v8-read-only/test/mjsunit/debug-stepin-accessor.js
  432. A v8-read-only/test/mjsunit/call-non-function.js
  433. A v8-read-only/test/mjsunit/number-limits.js
  434. A v8-read-only/test/mjsunit/debug-liveedit-2.js
  435. A v8-read-only/test/mjsunit/object-seal.js
  436. A v8-read-only/test/mjsunit/mjsunit.js
  437. A v8-read-only/test/mjsunit/for-in.js
  438. A v8-read-only/test/mjsunit/debug-compile-event.js
  439. A v8-read-only/test/mjsunit/local-load-from-eval.js
  440. A v8-read-only/test/mjsunit/function-call.js
  441. A v8-read-only/test/mjsunit/debug-evaluate-recursive.js
  442. A v8-read-only/test/mjsunit/elements-kind.js
  443. A v8-read-only/test/mjsunit/uri.js
  444. A v8-read-only/test/mjsunit/escape.js
  445. A v8-read-only/test/mjsunit/extra-commas.js
  446. A v8-read-only/test/mjsunit/string-split-cache.js
  447. A v8-read-only/test/mjsunit/multiline.js
  448. A v8-read-only/test/mjsunit/double-equals.js
  449. A v8-read-only/test/mjsunit/delete.js
  450. A v8-read-only/test/mjsunit/global-load-from-eval.js
  451. A v8-read-only/test/mjsunit/optimized-typeof.js
  452. A v8-read-only/test/mjsunit/newline-in-string.js
  453. A v8-read-only/test/mjsunit/string-replace-one-char.js
  454. A v8-read-only/test/mjsunit/number-string-index-call.js
  455. A v8-read-only/test/mjsunit/array-join.js
  456. A v8-read-only/test/mjsunit/debug-stepout-to-builtin.js
  457. A v8-read-only/test/mjsunit/mul-exhaustive-part8.js
  458. A v8-read-only/test/mjsunit/receiver-in-with-calls.js
  459. A v8-read-only/test/mjsunit/unusual-constructor.js
  460. A v8-read-only/test/mjsunit/for-in-null-or-undefined.js
  461. A v8-read-only/test/mjsunit/regexp-compile.js
  462. A v8-read-only/test/mjsunit/integer-to-string.js
  463. A v8-read-only/test/mjsunit/object-literal-overwrite.js
  464. A v8-read-only/test/mjsunit/keyed-call-generic.js
  465. A v8-read-only/test/mjsunit/bitwise-operations-undefined.js
  466. A v8-read-only/test/mjsunit/debug-stepout-scope-part5.js
  467. A v8-read-only/test/mjsunit/html-comments.js
  468. A v8-read-only/test/mjsunit/override-read-only-property.js
  469. A v8-read-only/test/mjsunit/array-shift.js
  470. A v8-read-only/test/mjsunit/fuzz-natives-part1.js
  471. A v8-read-only/test/mjsunit/delete-in-eval.js
  472. A v8-read-only/test/mjsunit/with-function-expression.js
  473. A v8-read-only/test/mjsunit/class-of-builtins.js
  474. A v8-read-only/test/mjsunit/this-property-assignment.js
  475. A v8-read-only/test/mjsunit/closures.js
  476. A v8-read-only/test/mjsunit/search-string-multiple.js
  477. A v8-read-only/test/mjsunit/numops-fuzz-part3.js
  478. A v8-read-only/test/mjsunit/prototype.js
  479. A v8-read-only/test/mjsunit/throw-and-catch-function.js
  480. A v8-read-only/test/mjsunit/object-literal-conversions.js
  481. A v8-read-only/test/mjsunit/debug-script-breakpoints.js
  482. A v8-read-only/test/mjsunit/mul-exhaustive-part3.js
  483. A v8-read-only/test/mjsunit/debug-continue.js
  484. A v8-read-only/test/mjsunit/call.js
  485. A v8-read-only/test/mjsunit/bit-not.js
  486. A v8-read-only/test/mjsunit/new-function.js
  487. A v8-read-only/test/mjsunit/ascii-regexp-subject.js
  488. A v8-read-only/test/mjsunit/object-toprimitive.js
  489. A v8-read-only/test/mjsunit/break.js
  490. A v8-read-only/test/mjsunit/deep-recursion.js
  491. A v8-read-only/test/mjsunit/debug-break-inline.js
  492. A v8-read-only/test/mjsunit/debug-ignore-breakpoints.js
  493. A v8-read-only/test/mjsunit/string-slices.js
  494. A v8-read-only/test/mjsunit/function-names.js
  495. A v8-read-only/test/mjsunit/dtoa.js
  496. A v8-read-only/test/mjsunit/mirror-boolean.js
  497. A v8-read-only/test/mjsunit/touint32.js
  498. A v8-read-only/test/mjsunit/with-parameter-access.js
  499. A v8-read-only/test/mjsunit/delete-non-configurable.js
  500. A v8-read-only/test/mjsunit/limit-locals.js
  501. A v8-read-only/test/mjsunit/strict-mode.js
  502. A v8-read-only/test/mjsunit/no-octal-constants-above-256.js
  503. A v8-read-only/test/mjsunit/array-splice.js
  504. A v8-read-only/test/mjsunit/regexp-capture.js
  505. A v8-read-only/test/mjsunit/typed-array-slice.js
  506. A v8-read-only/test/mjsunit/has-own-property.js
  507. A v8-read-only/test/mjsunit/debug-multiple-breakpoints.js
  508. A v8-read-only/test/mjsunit/function-bind.js
  509. A v8-read-only/test/mjsunit/math-floor-of-div-minus-zero.js
  510. A v8-read-only/test/mjsunit/math-floor-part4.js
  511. A v8-read-only/test/mjsunit/not.js
  512. A v8-read-only/test/mjsunit/string-flatten.js
  513. A v8-read-only/test/mjsunit/getter-in-prototype.js
  514. A v8-read-only/test/mjsunit/debug-setexceptionbreak.js
  515. A v8-read-only/test/mjsunit/debug-backtrace.js
  516. A v8-read-only/test/mjsunit/regexp-UC16.js
  517. A v8-read-only/test/mjsunit/fun-name.js
  518. A v8-read-only/test/mjsunit/array-elements-from-array-prototype.js
  519. A v8-read-only/test/mjsunit/string-search.js
  520. A v8-read-only/test/mjsunit/array-iteration.js
  521. A v8-read-only/test/mjsunit/logical.js
  522. A v8-read-only/test/mjsunit/eval-typeof-non-existing.js
  523. A v8-read-only/test/mjsunit/short-circuit-boolean.js
  524. A v8-read-only/test/mjsunit/stress-array-push.js
  525. A v8-read-only/test/mjsunit/date.js
  526. A v8-read-only/test/mjsunit/boolean.js
  527. A v8-read-only/test/mjsunit/unicode-case-overoptimization.js
  528. A v8-read-only/test/mjsunit/debug-script-breakpoints-closure.js
  529. A v8-read-only/test/mjsunit/string-replace-with-empty.js
  530. A v8-read-only/test/mjsunit/arguments-read-and-assignment.js
  531. A v8-read-only/test/mjsunit/mul-exhaustive-part10.js
  532. A v8-read-only/test/mjsunit/array-tostring.js
  533. A v8-read-only/test/mjsunit/regexp-call-as-function.js
  534. A v8-read-only/test/mjsunit/regexp-global.js
  535. A v8-read-only/test/mjsunit/function-without-prototype.js
  536. A v8-read-only/test/mjsunit/debug-liveedit-3.js
  537. A v8-read-only/test/mjsunit/new.js
  538. A v8-read-only/test/mjsunit/delete-global-properties.js
  539. A v8-read-only/test/mjsunit/object-literal.js
  540. A v8-read-only/test/mjsunit/array-elements-from-object-prototype.js
  541. A v8-read-only/test/mjsunit/mjsunit.status
  542. A v8-read-only/test/mjsunit/unicode-string-to-number.js
  543. A v8-read-only/test/mjsunit/toint32.js
  544. A v8-read-only/test/mjsunit/harmony
  545. A v8-read-only/test/mjsunit/harmony/proxies-example-membrane.js
  546. A v8-read-only/test/mjsunit/harmony/typeof.js
  547. A v8-read-only/test/mjsunit/harmony/proxies-hash.js
  548. A v8-read-only/test/mjsunit/harmony/block-conflicts.js
  549. A v8-read-only/test/mjsunit/harmony/proxies-function.js
  550. A v8-read-only/test/mjsunit/harmony/proxies-for.js
  551. A v8-read-only/test/mjsunit/harmony/collections.js
  552. A v8-read-only/test/mjsunit/harmony/block-for.js
  553. A v8-read-only/test/mjsunit/harmony/module-linking.js
  554. A v8-read-only/test/mjsunit/harmony/block-early-errors.js
  555. A v8-read-only/test/mjsunit/harmony/block-leave.js
  556. A v8-read-only/test/mjsunit/harmony/module-parsing.js
  557. A v8-read-only/test/mjsunit/harmony/module-resolution.js
  558. A v8-read-only/test/mjsunit/harmony/proxies.js
  559. A v8-read-only/test/mjsunit/harmony/block-scoping.js
  560. A v8-read-only/test/mjsunit/harmony/debug-blockscopes.js
  561. A v8-read-only/test/mjsunit/harmony/block-lazy-compile.js
  562. A v8-read-only/test/mjsunit/harmony/block-let-crankshaft.js
  563. A v8-read-only/test/mjsunit/harmony/block-let-declaration.js
  564. A v8-read-only/test/mjsunit/harmony/debug-evaluate-blockscopes.js
  565. A v8-read-only/test/mjsunit/harmony/block-const-assign.js
  566. A v8-read-only/test/mjsunit/harmony/block-let-semantics.js
  567. A v8-read-only/test/mjsunit/harmony/module-recompile.js
  568. A v8-read-only/test/mjsunit/harmony/debug-function-scopes.js
  569. A v8-read-only/test/mjsunit/smi-negative-zero.js
  570. A v8-read-only/test/mjsunit/string-charat.js
  571. A v8-read-only/test/mjsunit/debug-evaluate-locals-optimized.js
  572. A v8-read-only/test/mjsunit/object-create.js
  573. A v8-read-only/test/mjsunit/big-array-literal.js
  574. A v8-read-only/test/mjsunit/cyrillic.js
  575. A v8-read-only/test/mjsunit/copy-on-write-assert.js
  576. A v8-read-only/test/mjsunit/mul-exhaustive-part9.js
  577. A v8-read-only/test/mjsunit/string-slices-regexp.js
  578. A v8-read-only/test/mjsunit/with-prototype.js
  579. A v8-read-only/test/mjsunit/elements-kind-depends.js
  580. A v8-read-only/test/mjsunit/pixel-array-rounding.js
  581. A v8-read-only/test/mjsunit/tools
  582. A v8-read-only/test/mjsunit/tools/tickprocessor-test.separate-ic
  583. A v8-read-only/test/mjsunit/tools/splaytree.js
  584. A v8-read-only/test/mjsunit/tools/codemap.js
  585. A v8-read-only/test/mjsunit/tools/csvparser.js
  586. A v8-read-only/test/mjsunit/tools/profile_view.js
  587. A v8-read-only/test/mjsunit/tools/tickprocessor.js
  588. A v8-read-only/test/mjsunit/tools/tickprocessor-test.ignore-unknown
  589. A v8-read-only/test/mjsunit/tools/tickprocessor-test.log
  590. A v8-read-only/test/mjsunit/tools/tickprocessor-test-func-info.log
  591. A v8-read-only/test/mjsunit/tools/tickprocessor-test.func-info
  592. A v8-read-only/test/mjsunit/tools/tickprocessor-test.default
  593. A v8-read-only/test/mjsunit/tools/profile.js
  594. A v8-read-only/test/mjsunit/tools/consarray.js
  595. A v8-read-only/test/mjsunit/tools/tickprocessor-test.gc-state
  596. A v8-read-only/test/mjsunit/for.js
  597. A v8-read-only/test/mjsunit/smi-ops.js
  598. A v8-read-only/test/mjsunit/object-literal-gc.js
  599. A v8-read-only/test/mjsunit/debug-stepout-scope-part6.js
  600. A v8-read-only/test/mjsunit/regexp.js
  601. A v8-read-only/test/mjsunit/fuzz-natives-part2.js
  602. A v8-read-only/test/mjsunit/lazy-load.js
  603. A v8-read-only/test/mjsunit/external-array.js
  604. A v8-read-only/test/mjsunit/compare-nan.js
  605. A v8-read-only/test/mjsunit/number-is.js
  606. A v8-read-only/test/mjsunit/no-semicolon.js
  607. A v8-read-only/test/mjsunit/regexp-cache-replace.js
  608. A v8-read-only/test/mjsunit/numops-fuzz-part4.js
  609. A v8-read-only/test/mjsunit/count-based-osr.js
  610. A v8-read-only/test/mjsunit/typeof.js
  611. A v8-read-only/test/mjsunit/accessor-map-sharing.js
  612. A v8-read-only/test/mjsunit/this.js
  613. A v8-read-only/test/mjsunit/object-get-own-property-names.js
  614. A v8-read-only/test/mjsunit/eval-enclosing-function-name.js
  615. A v8-read-only/test/mjsunit/mul-exhaustive-part4.js
  616. A v8-read-only/test/mjsunit/assert-opt-and-deopt.js
  617. A v8-read-only/test/mjsunit/to-precision.js
  618. A v8-read-only/test/mjsunit/readonly.js
  619. A v8-read-only/test/mjsunit/third_party
  620. A v8-read-only/test/mjsunit/third_party/array-isarray.js
  621. A v8-read-only/test/mjsunit/third_party/array-splice-webkit.js
  622. A v8-read-only/test/mjsunit/third_party/object-keys.js
  623. A v8-read-only/test/mjsunit/third_party/string-trim.js
  624. A v8-read-only/test/mjsunit/third_party/regexp-pcre.js
  625. A v8-read-only/test/mjsunit/global-load-from-eval-in-with.js
  626. A v8-read-only/test/mjsunit/stack-traces-2.js
  627. A v8-read-only/test/mjsunit/debug-stepout-scope-part1.js
  628. A v8-read-only/test/mjsunit/debug-evaluate-with-context.js
  629. A v8-read-only/test/mjsunit/fast-array-length.js
  630. A v8-read-only/test/mjsunit/this-in-callbacks.js
  631. A v8-read-only/test/mjsunit/debug-compile-event-newfunction.js
  632. A v8-read-only/test/mjsunit/debug-script.js
  633. A v8-read-only/test/mjsunit/transcendentals.js
  634. A v8-read-only/test/mjsunit/obj-construct.js
  635. A v8-read-only/test/mjsunit/math-pow.js
  636. A v8-read-only/test/mjsunit/mirror-function.js
  637. A v8-read-only/test/mjsunit/math-min-max.js
  638. A v8-read-only/test/mjsunit/string-match.js
  639. A v8-read-only/test/mjsunit/error-tostring.js
  640. A v8-read-only/test/mjsunit/mirror-error.js
  641. A v8-read-only/test/mjsunit/switch.js
  642. A v8-read-only/test/mjsunit/debug-sourceslice.js
  643. A v8-read-only/test/mjsunit/parse-int-float.js
  644. A v8-read-only/test/mjsunit/unicodelctest.js
  645. A v8-read-only/test/mjsunit/debug-clearbreakpointgroup.js
  646. A v8-read-only/test/mjsunit/greedy.js
  647. A v8-read-only/test/mjsunit/regexp-lookahead.js
  648. A v8-read-only/test/mjsunit/debug-evaluate-locals-optimized-double.js
  649. A v8-read-only/test/mjsunit/debug-set-script-source.js
  650. A v8-read-only/test/mjsunit/dont-reinit-global-var.js
  651. A v8-read-only/test/mjsunit/body-not-visible.js
  652. A v8-read-only/test/mjsunit/mirror-array.js
  653. A v8-read-only/test/mjsunit/large-object-literal.js
  654. A v8-read-only/test/mjsunit/instanceof.js
  655. A v8-read-only/test/mjsunit/debug-clearbreakpoint.js
  656. A v8-read-only/test/mjsunit/regexp-multiline.js
  657. A v8-read-only/test/mjsunit/declare-locally.js
  658. A v8-read-only/test/mjsunit/regexp-string-methods.js
  659. A v8-read-only/test/mjsunit/debug-scripts-request.js
  660. A v8-read-only/test/mjsunit/arguments.js
  661. A v8-read-only/test/mjsunit/with-leave.js
  662. A v8-read-only/test/mjsunit/debug-liveedit-check-stack.js
  663. A v8-read-only/test/mjsunit/debug-stepin-constructor.js
  664. A v8-read-only/test/mjsunit/delay-syntax-error.js
  665. A v8-read-only/test/mjsunit/sin-cos.js
  666. A v8-read-only/test/mjsunit/get-own-property-descriptor.js
  667. A v8-read-only/test/mjsunit/property-object-key.js
  668. A v8-read-only/test/mjsunit/regexp-static.js
  669. A v8-read-only/test/mjsunit/strict-mode-eval.js
  670. A v8-read-only/test/mjsunit/string-case.js
  671. A v8-read-only/test/mjsunit/debug-scopes.js
  672. A v8-read-only/test/mjsunit/object-define-property.js
  673. A v8-read-only/test/mjsunit/negate-zero.js
  674. A v8-read-only/test/mjsunit/const-redecl.js
  675. A v8-read-only/test/mjsunit/array-literal-transitions.js
  676. A v8-read-only/test/mjsunit/function-source.js
  677. A v8-read-only/test/mjsunit/do-not-strip-fc.js
  678. A v8-read-only/test/mjsunit/to_number_order.js
  679. A v8-read-only/test/mjsunit/debug-liveedit-utils.js
  680. A v8-read-only/test/mjsunit/array-construct-transition.js
  681. A v8-read-only/test/mjsunit/instanceof-2.js
  682. A v8-read-only/test/mjsunit/arguments-apply.js
  683. A v8-read-only/test/mjsunit/regexp-multiline-stack-trace.js
  684. A v8-read-only/test/mjsunit/debug-stepout-scope-part7.js
  685. A v8-read-only/test/mjsunit/non-ascii-replace.js
  686. A v8-read-only/test/mjsunit/debug-evaluate.js
  687. A v8-read-only/test/mjsunit/function-named-self-reference.js
  688. A v8-read-only/test/mjsunit/fuzz-natives-part3.js
  689. A v8-read-only/test/mjsunit/regress
  690. A v8-read-only/test/mjsunit/regress/regress-1625.js
  691. A v8-read-only/test/mjsunit/regress/regress-126412.js
  692. A v8-read-only/test/mjsunit/regress/regress-r4998.js
  693. A v8-read-only/test/mjsunit/regress/regress-1853.js
  694. A v8-read-only/test/mjsunit/regress/regress-crbug-134055.js
  695. A v8-read-only/test/mjsunit/regress/regress-1639.js
  696. A v8-read-only/test/mjsunit/regress/regress-1624-strict.js
  697. A v8-read-only/test/mjsunit/regress/regress-114.js
  698. A v8-read-only/test/mjsunit/regress/regress-117409.js
  699. A v8-read-only/test/mjsunit/regress/regress-1066899.js
  700. A v8-read-only/test/mjsunit/regress/regress-108296.js
  701. A v8-read-only/test/mjsunit/regress/regress-732.js
  702. A v8-read-only/test/mjsunit/regress/regress-1200351.js
  703. A v8-read-only/test/mjsunit/regress/regress-91120.js
  704. A v8-read-only/test/mjsunit/regress/regress-91013.js
  705. A v8-read-only/test/mjsunit/regress/regress-396.js
  706. A v8-read-only/test/mjsunit/regress/regress-974.js
  707. A v8-read-only/test/mjsunit/regress/regress-84234.js
  708. A v8-read-only/test/mjsunit/regress/regress-737588.js
  709. A v8-read-only/test/mjsunit/regress/regress-94425.js
  710. A v8-read-only/test/mjsunit/regress/regress-1620.js
  711. A v8-read-only/test/mjsunit/regress/regress-95920.js
  712. A v8-read-only/test/mjsunit/regress/regress-1182832.js
  713. A v8-read-only/test/mjsunit/regress/regress-1513.js
  714. A v8-read-only/test/mjsunit/regress/regress-1351.js
  715. A v8-read-only/test/mjsunit/regress/regress-2054.js
  716. A v8-read-only/test/mjsunit/regress/regress-1218.js
  717. A v8-read-only/test/mjsunit/regress/regress-588599.js
  718. A v8-read-only/test/mjsunit/regress/regress-1472.js
  719. A v8-read-only/test/mjsunit/regress/regress-1365.js
  720. A v8-read-only/test/mjsunit/regress/regress-1177809.js
  721. A v8-read-only/test/mjsunit/regress/regress-2296.js
  722. A v8-read-only/test/mjsunit/regress/regress-crbug-146910.js
  723. A v8-read-only/test/mjsunit/regress/regress-conditional-position.js
  724. A v8-read-only/test/mjsunit/regress/regress-136048.js
  725. A v8-read-only/test/mjsunit/regress/regress-351.js
  726. A v8-read-only/test/mjsunit/regress/regress-406.js
  727. A v8-read-only/test/mjsunit/regress/regress-244.js
  728. A v8-read-only/test/mjsunit/regress/regress-1114040.js
  729. A v8-read-only/test/mjsunit/regress/regress-137.js
  730. A v8-read-only/test/mjsunit/regress/regress-119925.js
  731. A v8-read-only/test/mjsunit/regress/regress-634.js
  732. A v8-read-only/test/mjsunit/regress/regress-284.js
  733. A v8-read-only/test/mjsunit/regress/regress-674753.js
  734. A v8-read-only/test/mjsunit/regress/regress-486.js
  735. A v8-read-only/test/mjsunit/regress/regress-1401.js
  736. A v8-read-only/test/mjsunit/regress/regress-1213.js
  737. A v8-read-only/test/mjsunit/regress/regress-1132.js
  738. A v8-read-only/test/mjsunit/regress/regress-1106.js
  739. A v8-read-only/test/mjsunit/regress/regress-2170.js
  740. A v8-read-only/test/mjsunit/regress/regress-1360.js
  741. A v8-read-only/test/mjsunit/regress/regress-1415.js
  742. A v8-read-only/test/mjsunit/regress/regress-1172.js
  743. A v8-read-only/test/mjsunit/regress/regress-2225.js
  744. A v8-read-only/test/mjsunit/regress/regress-1187524.js
  745. A v8-read-only/test/mjsunit/regress/regress-1146.js
  746. A v8-read-only/test/mjsunit/regress/regress-2291.js
  747. A v8-read-only/test/mjsunit/regress/regress-2185-2.js
  748. A v8-read-only/test/mjsunit/regress/regress-2346.js
  749. A v8-read-only/test/mjsunit/regress/regress-1790.js
  750. A v8-read-only/test/mjsunit/regress/regress-1079.js
  751. A v8-read-only/test/mjsunit/regress/regress-deopt-gc.js
  752. A v8-read-only/test/mjsunit/regress/regress-603.js
  753. A v8-read-only/test/mjsunit/regress/regress-334.js
  754. A v8-read-only/test/mjsunit/regress/regress-155924.js
  755. A v8-read-only/test/mjsunit/regress/regress-crbug-145961.js
  756. A v8-read-only/test/mjsunit/regress/regress-253.js
  757. A v8-read-only/test/mjsunit/regress/regress-227.js
  758. A v8-read-only/test/mjsunit/regress/regress-643.js
  759. A v8-read-only/test/mjsunit/regress/regress-1110164.js
  760. A v8-read-only/test/mjsunit/regress/regress-186.js
  761. A v8-read-only/test/mjsunit/regress/regress-267.js
  762. A v8-read-only/test/mjsunit/regress/regress-137768.js
  763. A v8-read-only/test/mjsunit/regress/regress-1062422.js
  764. A v8-read-only/test/mjsunit/regress/regress-1213516.js
  765. A v8-read-only/test/mjsunit/regress/regress-1020.js
  766. A v8-read-only/test/mjsunit/regress/regress-crbug-138887.js
  767. A v8-read-only/test/mjsunit/regress/regress-996542.js
  768. A v8-read-only/test/mjsunit/regress/regress-1201933.js
  769. A v8-read-only/test/mjsunit/regress/regress-992.js
  770. A v8-read-only/test/mjsunit/regress/regress-697.js
  771. A v8-read-only/test/mjsunit/regress/regress-1081309.js
  772. A v8-read-only/test/mjsunit/regress/regress-1060.js
  773. A v8-read-only/test/mjsunit/regress/regress-2032.js
  774. A v8-read-only/test/mjsunit/regress/regress-97116.js
  775. A v8-read-only/test/mjsunit/regress/regress-1531.js
  776. A v8-read-only/test/mjsunit/regress/regress-crbug-37853.js
  777. A v8-read-only/test/mjsunit/regress/regress-2153.js
  778. A v8-read-only/test/mjsunit/regress/regress-2234.js
  779. A v8-read-only/test/mjsunit/regress/regress-1181.js
  780. A v8-read-only/test/mjsunit/regress/regress-1236.js
  781. A v8-read-only/test/mjsunit/regress/regress-1129.js
  782. A v8-read-only/test/mjsunit/regress/regress-1177518.js
  783. A v8-read-only/test/mjsunit/regress/regress-123512.js
  784. A v8-read-only/test/mjsunit/regress/regress-2193.js
  785. A v8-read-only/test/mjsunit/regress/regress-crbug-122271.js
  786. A v8-read-only/test/mjsunit/regress/regress-1383.js
  787. A v8-read-only/test/mjsunit/regress/regress-94873.js
  788. A v8-read-only/test/mjsunit/regress/regress-create-exception.js
  789. A v8-read-only/test/mjsunit/regress/regress-1692.js
  790. A v8-read-only/test/mjsunit/regress/regress-115452.js
  791. A v8-read-only/test/mjsunit/regress/regress-1639-2.js
  792. A v8-read-only/test/mjsunit/regress/regress-900055.js
  793. A v8-read-only/test/mjsunit/regress/regress-612.js
  794. A v8-read-only/test/mjsunit/regress/regress-670147.js
  795. A v8-read-only/test/mjsunit/regress/regress-317.js
  796. A v8-read-only/test/mjsunit/regress/regress-490.js
  797. A v8-read-only/test/mjsunit/regress/regress-545.js
  798. A v8-read-only/test/mjsunit/regress/regress-734862.js
  799. A v8-read-only/test/mjsunit/regress/regress-deep-proto.js
  800. A v8-read-only/test/mjsunit/regress/regress-992733.js
  801. A v8-read-only/test/mjsunit/regress/regress-747.js
  802. A v8-read-only/test/mjsunit/regress/regress-1110.js
  803. A v8-read-only/test/mjsunit/regress/regress-397.js
  804. A v8-read-only/test/mjsunit/regress/splice-missing-wb.js
  805. A v8-read-only/test/mjsunit/regress/regress-3006390.js
  806. A v8-read-only/test/mjsunit/regress/regress-799761.js
  807. A v8-read-only/test/mjsunit/regress/regress-3230771.js
  808. A v8-read-only/test/mjsunit/regress/regress-1150.js
  809. A v8-read-only/test/mjsunit/regress/regress-1017.js
  810. A v8-read-only/test/mjsunit/regress/regress-1083.js
  811. A v8-read-only/test/mjsunit/regress/regress-2055.js
  812. A v8-read-only/test/mjsunit/regress/regress-3218915.js
  813. A v8-read-only/test/mjsunit/regress/regress-133211b.js
  814. A v8-read-only/test/mjsunit/regress/regress-86.js
  815. A v8-read-only/test/mjsunit/regress/regress-1528.js
  816. A v8-read-only/test/mjsunit/regress/regress-1447.js
  817. A v8-read-only/test/mjsunit/regress/regress-debug-code-recompilation.js
  818. A v8-read-only/test/mjsunit/regress/regress-3199913.js
  819. A v8-read-only/test/mjsunit/regress/regress-regexp-codeflush.js
  820. A v8-read-only/test/mjsunit/regress/regress-231.js
  821. A v8-read-only/test/mjsunit/regress/regress-312.js
  822. A v8-read-only/test/mjsunit/regress/regress-124.js
  823. A v8-read-only/test/mjsunit/regress/regress-540.js
  824. A v8-read-only/test/mjsunit/regress/regress-convert-transition.js
  825. A v8-read-only/test/mjsunit/regress/regress-676025.js
  826. A v8-read-only/test/mjsunit/regress/regress-119429.js
  827. A v8-read-only/test/mjsunit/regress/regress-326.js
  828. A v8-read-only/test/mjsunit/regress/regress-666721.js
  829. A v8-read-only/test/mjsunit/regress/regress-crbug-119926.js
  830. A v8-read-only/test/mjsunit/regress/regress-219.js
  831. A v8-read-only/test/mjsunit/regress/regress-117794.js
  832. A v8-read-only/test/mjsunit/regress/regress-580.js
  833. A v8-read-only/test/mjsunit/regress/regress-392.js
  834. A v8-read-only/test/mjsunit/regress/regress-fast-literal-transition.js
  835. A v8-read-only/test/mjsunit/regress/regress-259.js
  836. A v8-read-only/test/mjsunit/regress/regress-944.js
  837. A v8-read-only/test/mjsunit/regress/regress-877615.js
  838. A v8-read-only/test/mjsunit/regress/regress-918.js
  839. A v8-read-only/test/mjsunit/regress/regress-675.js
  840. A v8-read-only/test/mjsunit/regress/regress-push-args-twice.js
  841. A v8-read-only/test/mjsunit/regress/regress-1240.js
  842. A v8-read-only/test/mjsunit/regress/regress-58740.js
  843. A v8-read-only/test/mjsunit/regress/regress-1107.js
  844. A v8-read-only/test/mjsunit/regress/regress-1493017.js
  845. A v8-read-only/test/mjsunit/regress/regress-1175390.js
  846. A v8-read-only/test/mjsunit/regress/regress-1711.js
  847. A v8-read-only/test/mjsunit/regress/regress-lazy-deopt-reloc.js
  848. A v8-read-only/test/mjsunit/regress/regress-1523.js
  849. A v8-read-only/test/mjsunit/regress/regress-2226.js
  850. A v8-read-only/test/mjsunit/regress/regress-1092.js
  851. A v8-read-only/test/mjsunit/regress/regress-1309.js
  852. A v8-read-only/test/mjsunit/regress/regress-2119.js
  853. A v8-read-only/test/mjsunit/regress/regress-2373.js
  854. A v8-read-only/test/mjsunit/regress/regress-69.js
  855. A v8-read-only/test/mjsunit/regress/regress-1563.js
  856. A v8-read-only/test/mjsunit/regress/regress-crbug-140083.js
  857. A v8-read-only/test/mjsunit/regress/regress-2185.js
  858. A v8-read-only/test/mjsunit/regress/regress-6-9-regexp.js
  859. A v8-read-only/test/mjsunit/regress/regress-1389.js
  860. A v8-read-only/test/mjsunit/regress/regress-128146.js
  861. A v8-read-only/test/mjsunit/regress/regress-416.js
  862. A v8-read-only/test/mjsunit/regress/regress-254.js
  863. A v8-read-only/test/mjsunit/regress/regress-crbug-147475.js
  864. A v8-read-only/test/mjsunit/regress/regress-806473.js
  865. A v8-read-only/test/mjsunit/regress/regress-806.js
  866. A v8-read-only/test/mjsunit/regress/regress-294.js
  867. A v8-read-only/test/mjsunit/regress/regress-349.js
  868. A v8-read-only/test/mjsunit/regress/regress-187.js
  869. A v8-read-only/test/mjsunit/regress/regress-927.js
  870. A v8-read-only/test/mjsunit/regress/regress-682649.js
  871. A v8-read-only/test/mjsunit/regress/regress-496.js
  872. A v8-read-only/test/mjsunit/regress/regress-1346700.js
  873. A v8-read-only/test/mjsunit/regress/regress-78270.js
  874. A v8-read-only/test/mjsunit/regress/regress-1439135.js
  875. A v8-read-only/test/mjsunit/regress/regress-2261.js
  876. A v8-read-only/test/mjsunit/regress/regress-crbug-84186.js
  877. A v8-read-only/test/mjsunit/regress/regress-1156.js
  878. A v8-read-only/test/mjsunit/regress/regress-1237.js
  879. A v8-read-only/test/mjsunit/regress/regress-1491.js
  880. A v8-read-only/test/mjsunit/regress/regress-1708.js
  881. A v8-read-only/test/mjsunit/regress/regress-99167.js
  882. A v8-read-only/test/mjsunit/regress/regress-1546.js
  883. A v8-read-only/test/mjsunit/regress/regress-2249.js
  884. A v8-read-only/test/mjsunit/regress/regress-crbug-126414.js
  885. A v8-read-only/test/mjsunit/regress/regress-98773.js
  886. A v8-read-only/test/mjsunit/regress/regress-1748.js
  887. A v8-read-only/test/mjsunit/regress/regress-1586.js
  888. A v8-read-only/test/mjsunit/regress/regress-2289.js
  889. A v8-read-only/test/mjsunit/regress/regress-crbug-134609.js
  890. A v8-read-only/test/mjsunit/regress/regress-swapelements.js
  891. A v8-read-only/test/mjsunit/regress/regress-iteration-order.js
  892. A v8-read-only/test/mjsunit/regress/regress-875031.js
  893. A v8-read-only/test/mjsunit/regress/regress-116.js
  894. A v8-read-only/test/mjsunit/regress/regress-720.js
  895. A v8-read-only/test/mjsunit/regress/regress-119609.js
  896. A v8-read-only/test/mjsunit/regress/regress-263.js
  897. A v8-read-only/test/mjsunit/regress/regress-318.js
  898. A v8-read-only/test/mjsunit/regress/regress-1050043.js
  899. A v8-read-only/test/mjsunit/regress/regress-815.js
  900. A v8-read-only/test/mjsunit/regress/regress-491.js
  901. A v8-read-only/test/mjsunit/regress/regress-925537.js
  902. A v8-read-only/test/mjsunit/regress/regress-962.js
  903. A v8-read-only/test/mjsunit/regress/regress-crbug-40931.js
  904. A v8-read-only/test/mjsunit/regress/regress-r3391.js
  905. A v8-read-only/test/mjsunit/regress/regress-crbug-39160.js
  906. A v8-read-only/test/mjsunit/regress/regress-1151.js
  907. A v8-read-only/test/mjsunit/regress/regress-1125.js
  908. A v8-read-only/test/mjsunit/regress/regress-2163.js
  909. A v8-read-only/test/mjsunit/regress/regress-1434.js
  910. A v8-read-only/test/mjsunit/regress/regress-145201.js
  911. A v8-read-only/test/mjsunit/regress/regress-2056.js
  912. A v8-read-only/test/mjsunit/regress/regress-1246.js
  913. A v8-read-only/test/mjsunit/regress/regress-88591.js
  914. A v8-read-only/test/mjsunit/regress/regress-1134697.js
  915. A v8-read-only/test/mjsunit/regress/regress-87.js
  916. A v8-read-only/test/mjsunit/regress/regress-3185905.js
  917. A v8-read-only/test/mjsunit/regress/regress-2284.js
  918. A v8-read-only/test/mjsunit/regress/regress-1529.js
  919. A v8-read-only/test/mjsunit/regress/regress-2339.js
  920. A v8-read-only/test/mjsunit/regress/regress-1945.js
  921. A v8-read-only/test/mjsunit/regress/regress-1757.js
  922. A v8-read-only/test/mjsunit/regress/regress-1199637.js
  923. A v8-read-only/test/mjsunit/regress/regress-transcendental.js
  924. A v8-read-only/test/mjsunit/regress/regress-crbug-100859.js
  925. A v8-read-only/test/mjsunit/regress/regress-1878.js
  926. A v8-read-only/test/mjsunit/regress/regress-667061.js
  927. A v8-read-only/test/mjsunit/regress/regress-515.js
  928. A v8-read-only/test/mjsunit/regress/regress-191.js
  929. A v8-read-only/test/mjsunit/regress/regress-91010.js
  930. A v8-read-only/test/mjsunit/regress/regress-246.js
  931. A v8-read-only/test/mjsunit/regress/regress-931.js
  932. A v8-read-only/test/mjsunit/regress/regress-smi-only-concat.js
  933. A v8-read-only/test/mjsunit/regress/regress-900966.js
  934. A v8-read-only/test/mjsunit/regress/regress-636.js
  935. A v8-read-only/test/mjsunit/regress/regress-cnlt-enum-indices.js
  936. A v8-read-only/test/mjsunit/regress/regress-286.js
  937. A v8-read-only/test/mjsunit/regress/regress-1120.js
  938. A v8-read-only/test/mjsunit/regress/regress-1039610.js
  939. A v8-read-only/test/mjsunit/regress/regress-1213575.js
  940. A v8-read-only/test/mjsunit/regress/regress-1403.js
  941. A v8-read-only/test/mjsunit/regress/regress-1160.js
  942. A v8-read-only/test/mjsunit/regress/regress-1215.js
  943. A v8-read-only/test/mjsunit/regress/regress-sqrt.js
  944. A v8-read-only/test/mjsunit/regress/regress-133211.js
  945. A v8-read-only/test/mjsunit/regress/regress-2172.js
  946. A v8-read-only/test/mjsunit/regress/regress-1174.js
  947. A v8-read-only/test/mjsunit/regress/regress-1229.js
  948. A v8-read-only/test/mjsunit/regress/regress-builtin-array-op.js
  949. A v8-read-only/test/mjsunit/regress/regress-2374.js
  950. A v8-read-only/test/mjsunit/regress/regress-crbug-3184.js
  951. A v8-read-only/test/mjsunit/regress/regress-2186.js
  952. A v8-read-only/test/mjsunit/regress/regress-1980.js
  953. A v8-read-only/test/mjsunit/regress/regress-125515.js
  954. A v8-read-only/test/mjsunit/regress/regress-201.js
  955. A v8-read-only/test/mjsunit/regress/regress-1919169.js
  956. A v8-read-only/test/mjsunit/regress/regress-900.js
  957. A v8-read-only/test/mjsunit/regress/regress-990205.js
  958. A v8-read-only/test/mjsunit/regress/regress-662254.js
  959. A v8-read-only/test/mjsunit/regress/regress-712.js
  960. A v8-read-only/test/mjsunit/regress/regress-524.js
  961. A v8-read-only/test/mjsunit/regress/regress-131994.js
  962. A v8-read-only/test/mjsunit/regress/regress-undefined-store-keyed-fast-element.js
  963. A v8-read-only/test/mjsunit/regress/regress-752.js
  964. A v8-read-only/test/mjsunit/regress/regress-143967.js
  965. A v8-read-only/test/mjsunit/regress/regress-483.js
  966. A v8-read-only/test/mjsunit/regress/regress-52801.js
  967. A v8-read-only/test/mjsunit/regress/regress-619.js
  968. A v8-read-only/test/mjsunit/regress/regress-269.js
  969. A v8-read-only/test/mjsunit/regress/regress-crbug-137689.js
  970. A v8-read-only/test/mjsunit/regress/regress-685.js
  971. A v8-read-only/test/mjsunit/regress/regress-1210.js
  972. A v8-read-only/test/mjsunit/regress/regress-1103.js
  973. A v8-read-only/test/mjsunit/regress/regress-3218530.js
  974. A v8-read-only/test/mjsunit/regress/regress-3252443.js
  975. A v8-read-only/test/mjsunit/regress/regress-1412.js
  976. A v8-read-only/test/mjsunit/regress/regress-71647.js
  977. A v8-read-only/test/mjsunit/regress/regress-2034.js
  978. A v8-read-only/test/mjsunit/regress/regress-1117.js
  979. A v8-read-only/test/mjsunit/regress/regress-100702.js
  980. A v8-read-only/test/mjsunit/regress/regress-91.js
  981. A v8-read-only/test/mjsunit/regress/regress-82769.js
  982. A v8-read-only/test/mjsunit/regress/regress-crbug-87478.js
  983. A v8-read-only/test/mjsunit/regress/regress-1278.js
  984. A v8-read-only/test/mjsunit/regress/regress-131923.js
  985. A v8-read-only/test/mjsunit/regress/regress-crbug-125148.js
  986. A v8-read-only/test/mjsunit/regress/regress-842017.js
  987. A v8-read-only/test/mjsunit/regress/regress-1178598.js
  988. A v8-read-only/test/mjsunit/regress/regress-crbug-150729.js
  989. A v8-read-only/test/mjsunit/regress/regress-345.js
  990. A v8-read-only/test/mjsunit/regress/regress-crbug-148376.js
  991. A v8-read-only/test/mjsunit/regress/regress-842.js
  992. A v8-read-only/test/mjsunit/regress/regress-492.js
  993. A v8-read-only/test/mjsunit/regress/regress-678525.js
  994. A v8-read-only/test/mjsunit/regress/regress-1102760.js
  995. A v8-read-only/test/mjsunit/regress/regress-70066.js
  996. A v8-read-only/test/mjsunit/regress/regress-2110.js
  997. A v8-read-only/test/mjsunit/regress/regress-1112.js
  998. A v8-read-only/test/mjsunit/regress/regress-399.js
  999. A v8-read-only/test/mjsunit/regress/regress-115100.js
  1000. A v8-read-only/test/mjsunit/regress/regress-1233.js
  1001. A v8-read-only/test/mjsunit/regress/regress-1126.js
  1002. A v8-read-only/test/mjsunit/regress/regress-1207.js
  1003. A v8-read-only/test/mjsunit/regress/regress-74.js
  1004. A v8-read-only/test/mjsunit/regress/regress-2326.js
  1005. A v8-read-only/test/mjsunit/regress/regress-1166.js
  1006. A v8-read-only/test/mjsunit/regress/regress-2219.js
  1007. A v8-read-only/test/mjsunit/regress/regress-1582.js
  1008. A v8-read-only/test/mjsunit/regress/regress-2285.js
  1009. A v8-read-only/test/mjsunit/regress/regress-1099.js
  1010. A v8-read-only/test/mjsunit/regress/regress-128018.js
  1011. A v8-read-only/test/mjsunit/regress/regress-113924.js
  1012. A v8-read-only/test/mjsunit/regress/regress-1173979.js
  1013. A v8-read-only/test/mjsunit/regress/regress-502.js
  1014. A v8-read-only/test/mjsunit/regress/regress-233.js
  1015. A v8-read-only/test/mjsunit/regress/regress-760-1.js
  1016. A v8-read-only/test/mjsunit/regress/regress-cnlt-elements.js
  1017. A v8-read-only/test/mjsunit/regress/regress-192.js
  1018. A v8-read-only/test/mjsunit/regress/regress-851.js
  1019. A v8-read-only/test/mjsunit/regress/regress-bind-receiver.js
  1020. A v8-read-only/test/mjsunit/regress/regress-475.js
  1021. A v8-read-only/test/mjsunit/regress/regress-394.js
  1022. A v8-read-only/test/mjsunit/regress/regress-784.js
  1023. A v8-read-only/test/mjsunit/regress/regress-874178.js
  1024. A v8-read-only/test/mjsunit/regress/regress-convert-enum.js
  1025. A v8-read-only/test/mjsunit/regress/regress-1121.js
  1026. A v8-read-only/test/mjsunit/regress/regress-1215653.js
  1027. A v8-read-only/test/mjsunit/regress/short-circuit.js
  1028. A v8-read-only/test/mjsunit/regress/regress-798.js
  1029. A v8-read-only/test/mjsunit/regress/regress-1323.js
  1030. A v8-read-only/test/mjsunit/regress/regress-2249423.js
  1031. A v8-read-only/test/mjsunit/regress/regress-crbug-18639.js
  1032. A v8-read-only/test/mjsunit/regress/regress-57.js
  1033. A v8-read-only/test/mjsunit/regress/regress-85177.js
  1034. A v8-read-only/test/mjsunit/regress/regress-1713.js
  1035. A v8-read-only/test/mjsunit/regress/regress-arguments-gc.js
  1036. A v8-read-only/test/mjsunit/regress/regress-1337.js
  1037. A v8-read-only/test/mjsunit/regress/regress-1149.js
  1038. A v8-read-only/test/mjsunit/regress/regress-1591.js
  1039. A v8-read-only/test/mjsunit/regress/regress-110509.js
  1040. A v8-read-only/test/mjsunit/regress/regress-2294.js
  1041. A v8-read-only/test/mjsunit/regress/regress-crbug-135008.js
  1042. A v8-read-only/test/mjsunit/regress/regress-crbug-150545.js
  1043. A v8-read-only/test/mjsunit/regress/regress-103259.js
  1044. A v8-read-only/test/mjsunit/regress/regress-88858.js
  1045. A v8-read-only/test/mjsunit/regress/regress-inlining-function-literal-context.js
  1046. A v8-read-only/test/mjsunit/regress/regress-149.js
  1047. A v8-read-only/test/mjsunit/regress/regress-753.js
  1048. A v8-read-only/test/mjsunit/regress/regress-646.js
  1049. A v8-read-only/test/mjsunit/regress/regress-189.js
  1050. A v8-read-only/test/mjsunit/regress/regress-91008.js
  1051. A v8-read-only/test/mjsunit/regress/regress-955.js
  1052. A v8-read-only/test/mjsunit/regress/regress-874.js
  1053. A v8-read-only/test/mjsunit/regress/regress-1130.js
  1054. A v8-read-only/test/mjsunit/regress/regress-1104.js
  1055. A v8-read-only/test/mjsunit/regress/regress-995.js
  1056. A v8-read-only/test/mjsunit/regress/regress-3247124.js
  1057. A v8-read-only/test/mjsunit/regress/regress-969.js
  1058. A v8-read-only/test/mjsunit/regress/regress-96523.js
  1059. A v8-read-only/test/mjsunit/regress/regress-1170.js
  1060. A v8-read-only/test/mjsunit/regress/regress-1118.js
  1061. A v8-read-only/test/mjsunit/regress/regress-1560.js
  1062. A v8-read-only/test/mjsunit/regress/regress-2156.js
  1063. A v8-read-only/test/mjsunit/regress/regress-1184.js
  1064. A v8-read-only/test/mjsunit/regress/regress-2318.js
  1065. A v8-read-only/test/mjsunit/regress/regress-1036894.js
  1066. A v8-read-only/test/mjsunit/regress/regress-1924.js
  1067. A v8-read-only/test/mjsunit/regress/regress-91787.js
  1068. A v8-read-only/test/mjsunit/regress/regress-1548.js
  1069. A v8-read-only/test/mjsunit/regress/regress-crbug-3867.js
  1070. A v8-read-only/test/mjsunit/regress/regress-123919.js
  1071. A v8-read-only/test/mjsunit/regress/regress-225.js
  1072. A v8-read-only/test/mjsunit/regress/regress-641.js
  1073. A v8-read-only/test/mjsunit/regress/regress-1112051.js
  1074. A v8-read-only/test/mjsunit/regress/regress-265.js
  1075. A v8-read-only/test/mjsunit/regress/regress-681.js
  1076. A v8-read-only/test/mjsunit/regress/regress-892742.js
  1077. A v8-read-only/test/mjsunit/regress/regress-386.js
  1078. A v8-read-only/test/mjsunit/regress/regress-279.js
  1079. A v8-read-only/test/mjsunit/regress/regress-857.js
  1080. A v8-read-only/test/mjsunit/regress/regress-2030.js
  1081. A v8-read-only/test/mjsunit/regress/regress-35.js
  1082. A v8-read-only/test/mjsunit/regress/regress-crbug-72736.js
  1083. A v8-read-only/test/mjsunit/regress/regress-1207276.js
  1084. A v8-read-only/test/mjsunit/regress/regress-1650.js
  1085. A v8-read-only/test/mjsunit/regress/regress-1624.js
  1086. A v8-read-only/test/mjsunit/regress/regress-1436.js
  1087. A v8-read-only/test/mjsunit/regress/regress-1355.js
  1088. A v8-read-only/test/mjsunit/regress/regress-1327557.js
  1089. A v8-read-only/test/mjsunit/regress/regress-1167.js
  1090. A v8-read-only/test/mjsunit/regress/regress-2058.js
  1091. A v8-read-only/test/mjsunit/regress/regress-121407.js
  1092. A v8-read-only/test/mjsunit/regress/regress-1583.js
  1093. A v8-read-only/test/mjsunit/regress/regress-1476.js
  1094. A v8-read-only/test/mjsunit/regress/regress-2286.js
  1095. A v8-read-only/test/mjsunit/regress/regress-1369.js
  1096. A v8-read-only/test/mjsunit/regress/regress-220.js
  1097. A v8-read-only/test/mjsunit/regress/regress-1973.js
  1098. A v8-read-only/test/mjsunit/regress/regress-120099.js
  1099. A v8-read-only/test/mjsunit/regress/regress-crbug-135066.js
  1100. A v8-read-only/test/mjsunit/regress/regress-convert-enum2.js
  1101. A v8-read-only/test/mjsunit/regress/regress-crbug-142087.js
  1102. A v8-read-only/test/mjsunit/regress/regress-341.js
  1103. A v8-read-only/test/mjsunit/regress/regress-780423.js
  1104. A v8-read-only/test/mjsunit/regress/regress-503.js
  1105. A v8-read-only/test/mjsunit/regress/regress-260.js
  1106. A v8-read-only/test/mjsunit/regress/regress-760-2.js
  1107. A v8-read-only/test/mjsunit/regress/regress-193.js
  1108. A v8-read-only/test/mjsunit/regress/regress-crbug-107996.js
  1109. A v8-read-only/test/mjsunit/regress/regress-95113.js
  1110. A v8-read-only/test/mjsunit/regress/regress-1030466.js
  1111. A v8-read-only/test/mjsunit/regress/regress-1122.js
  1112. A v8-read-only/test/mjsunit/regress/regress-1015.js
  1113. A v8-read-only/test/mjsunit/regress/regress-3408144.js
  1114. A v8-read-only/test/mjsunit/regress/regress-1170187.js
  1115. A v8-read-only/test/mjsunit/regress/regress-2322.js
  1116. A v8-read-only/test/mjsunit/regress/regress-937896.js
  1117. A v8-read-only/test/mjsunit/regress/regress-1217.js
  1118. A v8-read-only/test/mjsunit/regress/regress-2027.js
  1119. A v8-read-only/test/mjsunit/regress/regress-102153.js
  1120. A v8-read-only/test/mjsunit/regress/regress-2336.js
  1121. A v8-read-only/test/mjsunit/regress/regress-1419.js
  1122. A v8-read-only/test/mjsunit/regress/regress-1176.js
  1123. A v8-read-only/test/mjsunit/regress/regress-1257.js
  1124. A v8-read-only/test/mjsunit/regress/regress-1592.js
  1125. A v8-read-only/test/mjsunit/regress/regress-crbug-142218.js
  1126. A v8-read-only/test/mjsunit/regress/regress-1647.js
  1127. A v8-read-only/test/mjsunit/regress/regress-1172-bis.js
  1128. A v8-read-only/test/mjsunit/regress/regress-1849.js
  1129. A v8-read-only/test/mjsunit/regress/regress-109195.js
  1130. A v8-read-only/test/mjsunit/regress/regress-526.js
  1131. A v8-read-only/test/mjsunit/regress/regress-176.js
  1132. A v8-read-only/test/mjsunit/regress/regress-754.js
  1133. A v8-read-only/test/mjsunit/regress/regress-485.js
  1134. A v8-read-only/test/mjsunit/regress/regress-728.js
  1135. A v8-read-only/test/mjsunit/regress/regress-fundecl.js
  1136. A v8-read-only/test/mjsunit/regress/regress-982.js
  1137. A v8-read-only/test/mjsunit/regress/regress-794.js
  1138. A v8-read-only/test/mjsunit/regress/regress-687.js
  1139. A v8-read-only/test/mjsunit/regress/regress-1131.js
  1140. A v8-read-only/test/mjsunit/regress/regress-1199401.js
  1141. A v8-read-only/test/mjsunit/regress/regress-2250.js
  1142. A v8-read-only/test/mjsunit/regress/regress-1521.js
  1143. A v8-read-only/test/mjsunit/regress/regress-1145.js
  1144. A v8-read-only/test/mjsunit/regress/regress-1254366.js
  1145. A v8-read-only/test/mjsunit/regress/regress-1119.js
  1146. A v8-read-only/test/mjsunit/regress/regress-100409.js
  1147. A v8-read-only/test/mjsunit/regress/regress-95485.js
  1148. A v8-read-only/test/mjsunit/regress/regress-cntl-descriptors-enum.js
  1149. A v8-read-only/test/mjsunit/regress/regress-20070207.js
  1150. A v8-read-only/test/mjsunit/regress/bitops-register-alias.js
  1151. A v8-read-only/test/mjsunit/regress/regress-1387.js
  1152. A v8-read-only/test/mjsunit/regress/regress-124594.js
  1153. A v8-read-only/test/mjsunit/regress/regress-171.js
  1154. A v8-read-only/test/mjsunit/regress/regress-1898.js
  1155. A v8-read-only/test/mjsunit/regress/regress-148378.js
  1156. A v8-read-only/test/mjsunit/regress/regress-696.js
  1157. A v8-read-only/test/mjsunit/regress/regress-1203459.js
  1158. A v8-read-only/test/mjsunit/regress/regress-1530.js
  1159. A v8-read-only/test/mjsunit/regress/regress-998565.js
  1160. A v8-read-only/test/mjsunit/regress/regress-1423.js
  1161. A v8-read-only/test/mjsunit/regress/regress-load-elements.js
  1162. A v8-read-only/test/mjsunit/regress/regress-2071.js
  1163. A v8-read-only/test/mjsunit/regress/regress-2045.js
  1164. A v8-read-only/test/mjsunit/regress/regress-1209.js
  1165. A v8-read-only/test/mjsunit/regress/regress-45469.js
  1166. A v8-read-only/test/mjsunit/store-dictionary.js
  1167. A v8-read-only/test/mjsunit/error-constructors.js
  1168. A v8-read-only/test/mjsunit/enumeration-order.js
  1169. A v8-read-only/test/mjsunit/call-non-function-call.js
  1170. A v8-read-only/test/mjsunit/debug-evaluate-with.js
  1171. A v8-read-only/test/mjsunit/binary-op-newspace.js
  1172. A v8-read-only/test/mjsunit/keyed-call-ic.js
  1173. A v8-read-only/test/mjsunit/debug-evaluate-locals.js
  1174. A v8-read-only/test/mjsunit/string-compare-alignment.js
  1175. A v8-read-only/test/mjsunit/argument-named-arguments.js
  1176. A v8-read-only/test/mjsunit/math-floor-negative.js
  1177. A v8-read-only/test/mjsunit/debug-liveedit-breakpoints.js
  1178. A v8-read-only/test/mjsunit/mul-exhaustive-part5.js
  1179. A v8-read-only/test/mjsunit/closure.js
  1180. A v8-read-only/test/mjsunit/mirror-script.js
  1181. A v8-read-only/test/mjsunit/mirror-object.js
  1182. A v8-read-only/test/mjsunit/value-of.js
  1183. A v8-read-only/test/mjsunit/object-freeze.js
  1184. A v8-read-only/test/mjsunit/debug-stepout-scope-part2.js
  1185. A v8-read-only/test/mjsunit/regexp-indexof.js
  1186. A v8-read-only/test/mjsunit/with-value.js
  1187. A v8-read-only/test/mjsunit/eval-stack-trace.js
  1188. A v8-read-only/test/mjsunit/const.js
  1189. A v8-read-only/test/mjsunit/call-stub.js
  1190. A v8-read-only/test/mjsunit/array-functions-prototype.js
  1191. A v8-read-only/test/mjsunit/builtins.js
  1192. A v8-read-only/test/mjsunit/debug-step-stub-callfunction.js
  1193. A v8-read-only/test/mjsunit/dont-enum-array-holes.js
  1194. A v8-read-only/test/mjsunit/regexp-results-cache.js
  1195. A v8-read-only/test/mjsunit/debug-stepin-call-function-stub.js
  1196. A v8-read-only/test/mjsunit/string-indexof-1.js
  1197. A v8-read-only/test/mjsunit/string-fromcharcode.js
  1198. A v8-read-only/test/mjsunit/top-level-assignments.js
  1199. A v8-read-only/test/mjsunit/strict-equals.js
  1200. A v8-read-only/test/mjsunit/if-in-undefined.js
  1201. A v8-read-only/test/mjsunit/indexed-accessors.js
  1202. A v8-read-only/test/mjsunit/strict-mode-implicit-receiver.js
  1203. A v8-read-only/test/mjsunit/json.js
  1204. A v8-read-only/test/mjsunit/leakcheck.js
  1205. A v8-read-only/test/mjsunit/invalid-lhs.js
  1206. A v8-read-only/test/mjsunit/array-pop.js
  1207. A v8-read-only/test/mjsunit/argument-assigned.js
  1208. A v8-read-only/test/mjsunit/debug-stepout-recursive-function.js
  1209. A v8-read-only/test/mjsunit/array-reduce.js
  1210. A v8-read-only/test/mjsunit/debug-liveedit-patch-positions-replace.js
  1211. A v8-read-only/test/mjsunit/keyed-storage-extend.js
  1212. A v8-read-only/test/mjsunit/compare-known-objects-slow.js
  1213. A v8-read-only/test/mjsunit/bitops-info.js
  1214. A v8-read-only/test/mjsunit/math-floor-of-div.js
  1215. A v8-read-only/test/mjsunit/debug-stepin-builtin.js
  1216. A v8-read-only/test/mjsunit/d8-os.js
  1217. A v8-read-only/test/mjsunit/array-push.js
  1218. A v8-read-only/test/mjsunit/math-abs.js
  1219. A v8-read-only/test/mjsunit/global-const-var-conflicts.js
  1220. A v8-read-only/test/mjsunit/math-floor-part1.js
  1221. A v8-read-only/test/mjsunit/debug-setbreakpoint.js
  1222. A v8-read-only/test/mjsunit/debug-liveedit-diff.js
  1223. A v8-read-only/test/mjsunit/number-tostring.js
  1224. A v8-read-only/test/mjsunit/debug-sourceinfo.js
  1225. A v8-read-only/test/mjsunit/fast-prototype.js
  1226. A v8-read-only/test/mjsunit/accessors-on-global-object.js
  1227. A v8-read-only/test/mjsunit/delete-vars-from-eval.js
  1228. A v8-read-only/test/mjsunit/unbox-double-arrays.js
  1229. A v8-read-only/test/mjsunit/define-property-gc.js
  1230. A v8-read-only/test/mjsunit/debug-stepnext-do-while.js
  1231. A v8-read-only/test/mjsunit/cyclic-array-to-string.js
  1232. A v8-read-only/test/mjsunit/char-escape.js
  1233. A v8-read-only/test/mjsunit/getter-in-value-prototype.js
  1234. A v8-read-only/test/mjsunit/nul-characters.js
  1235. A v8-read-only/test/mjsunit/simple-constructor.js
  1236. A v8-read-only/test/mjsunit/property-load-across-eval.js
  1237. A v8-read-only/test/mjsunit/math-sqrt.js
  1238. A v8-read-only/test/mjsunit/array-functions-prototype-misc.js
  1239. A v8-read-only/test/mjsunit/global-vars-with.js
  1240. A v8-read-only/test/mjsunit/global-accessors.js
  1241. A v8-read-only/test/mjsunit/mirror-date.js
  1242. A v8-read-only/test/mjsunit/str-to-num.js
  1243. A v8-read-only/test/mjsunit/array-elements-from-array-prototype-chain.js
  1244. A v8-read-only/test/mjsunit/try-catch-scopes.js
  1245. A v8-read-only/test/mjsunit/debug-changebreakpoint.js
  1246. A v8-read-only/test/mjsunit/debug-constructed-by.js
  1247. A v8-read-only/test/mjsunit/for-in-delete.js
  1248. A v8-read-only/test/mjsunit/debug-stepout-scope-part8.js
  1249. A v8-read-only/test/mjsunit/undeletable-functions.js
  1250. A v8-read-only/test/mjsunit/regexp-capture-3.js
  1251. A v8-read-only/test/mjsunit/fun-as-prototype.js
  1252. A v8-read-only/test/mjsunit/try-finally-continue.js
  1253. A v8-read-only/test/mjsunit/codegen-coverage.js
  1254. A v8-read-only/test/mjsunit/fuzz-natives-part4.js
  1255. A v8-read-only/test/mjsunit/mirror-number.js
  1256. A v8-read-only/test/mjsunit/debug-listbreakpoints.js
  1257. A v8-read-only/test/mjsunit/array-constructor.js
  1258. A v8-read-only/test/mjsunit/string-charcodeat.js
  1259. A v8-read-only/test/mjsunit/regexp-loop-capture.js
  1260. A v8-read-only/test/mjsunit/keywords-and-reserved_words.js
  1261. A v8-read-only/test/mjsunit/debug-liveedit-restart-frame.js
  1262. A v8-read-only/test/mjsunit/debug-references.js
  1263. A v8-read-only/test/mjsunit/string-replace-gc.js
  1264. A v8-read-only/test/mjsunit/multiple-return.js
  1265. A v8-read-only/test/mjsunit/debug-constructor.js
  1266. A v8-read-only/test/mjsunit/mul-exhaustive-part6.js
  1267. A v8-read-only/test/mjsunit/const-eval-init.js
  1268. A v8-read-only/test/mjsunit/try-catch-extension-object.js
  1269. A v8-read-only/test/mjsunit/debug-return-value.js
  1270. A v8-read-only/test/mjsunit/regexp-captures.js
  1271. A v8-read-only/test/mjsunit/global-deleted-property-ic.js
  1272. A v8-read-only/test/mjsunit/substr.js
  1273. A v8-read-only/test/mjsunit/string-lastindexof.js
  1274. A v8-read-only/test/mjsunit/debug-stepout-scope-part3.js
  1275. A v8-read-only/test/mjsunit/eval.js
  1276. A v8-read-only/test/mjsunit/value-callic-prototype-change.js
  1277. A v8-read-only/test/mjsunit/debug-receiver.js
  1278. A v8-read-only/test/mjsunit/debug-step-2.js
  1279. A v8-read-only/test/mjsunit/string-indexof-2.js
  1280. A v8-read-only/test/mjsunit/shifts.js
  1281. A v8-read-only/test/mjsunit/numops-fuzz-part1.js
  1282. A v8-read-only/test/mjsunit/mirror-regexp.js
  1283. A v8-read-only/test/test262
  1284. A v8-read-only/test/test262/harness-adapt.js
  1285. A v8-read-only/test/test262/testcfg.py
  1286. A v8-read-only/test/test262/test262.status
  1287. A v8-read-only/test/test262/README
  1288. A v8-read-only/test/benchmarks
  1289. A v8-read-only/test/benchmarks/testcfg.py
  1290. A v8-read-only/test/sputnik
  1291. A v8-read-only/test/sputnik/sputnik.status
  1292. A v8-read-only/test/sputnik/testcfg.py
  1293. A v8-read-only/test/sputnik/README
  1294. A v8-read-only/LICENSE
  1295. A v8-read-only/include
  1296. A v8-read-only/include/v8-profiler.h
  1297. A v8-read-only/include/v8.h
  1298. A v8-read-only/include/v8-preparser.h
  1299. A v8-read-only/include/v8-debug.h
  1300. A v8-read-only/include/v8stdint.h
  1301. A v8-read-only/include/v8-testing.h
  1302. A v8-read-only/AUTHORS
  1303. A v8-read-only/LICENSE.valgrind
  1304. A v8-read-only/src
  1305. A v8-read-only/src/scanner-character-streams.cc
  1306. A v8-read-only/src/spaces-inl.h
  1307. A v8-read-only/src/atomicops_internals_x86_gcc.h
  1308. A v8-read-only/src/d8-windows.cc
  1309. A v8-read-only/src/api.cc
  1310. A v8-read-only/src/atomicops_internals_x86_msvc.h
  1311. A v8-read-only/src/code.h
  1312. A v8-read-only/src/heap.cc
  1313. A v8-read-only/src/transitions.cc
  1314. A v8-read-only/src/v8natives.js
  1315. A v8-read-only/src/data-flow.cc
  1316. A v8-read-only/src/handles.cc
  1317. A v8-read-only/src/compilation-cache.h
  1318. A v8-read-only/src/allocation.cc
  1319. A v8-read-only/src/v8conversions.cc
  1320. A v8-read-only/src/v8memory.h
  1321. A v8-read-only/src/objects.cc
  1322. A v8-read-only/src/interface.cc
  1323. A v8-read-only/src/string-stream.h
  1324. A v8-read-only/src/v8globals.h
  1325. A v8-read-only/src/regexp-macro-assembler.h
  1326. A v8-read-only/src/allocation-inl.h
  1327. A v8-read-only/src/conversions.cc
  1328. A v8-read-only/src/string-search.h
  1329. A v8-read-only/src/list.h
  1330. A v8-read-only/src/safepoint-table.h
  1331. A v8-read-only/src/v8utils.h
  1332. A v8-read-only/src/spaces.h
  1333. A v8-read-only/src/log-utils.h
  1334. A v8-read-only/src/hashmap.h
  1335. A v8-read-only/src/bootstrapper.cc
  1336. A v8-read-only/src/platform-tls.h
  1337. A v8-read-only/src/ast.h
  1338. A v8-read-only/src/lithium-allocator.cc
  1339. A v8-read-only/src/flags.h
  1340. A v8-read-only/src/d8-debug.cc
  1341. A v8-read-only/src/preparser.cc
  1342. A v8-read-only/src/log-inl.h
  1343. A v8-read-only/src/runtime-profiler.cc
  1344. A v8-read-only/src/codegen.h
  1345. A v8-read-only/src/cpu-profiler.cc
  1346. A v8-read-only/src/contexts.cc
  1347. A v8-read-only/src/proxy.js
  1348. A v8-read-only/src/api.h
  1349. A v8-read-only/src/zone.cc
  1350. A v8-read-only/src/extensions
  1351. A v8-read-only/src/extensions/gc-extension.cc
  1352. A v8-read-only/src/extensions/statistics-extension.cc
  1353. A v8-read-only/src/extensions/gc-extension.h
  1354. A v8-read-only/src/extensions/statistics-extension.h
  1355. A v8-read-only/src/extensions/externalize-string-extension.cc
  1356. A v8-read-only/src/extensions/externalize-string-extension.h
  1357. A v8-read-only/src/platform-openbsd.cc
  1358. A v8-read-only/src/zone.h
  1359. A v8-read-only/src/token.cc
  1360. A v8-read-only/src/v8checks.h
  1361. A v8-read-only/src/runtime.cc
  1362. A v8-read-only/src/cached-powers.cc
  1363. A v8-read-only/src/circular-queue.cc
  1364. A v8-read-only/src/profile-generator.h
  1365. A v8-read-only/src/cpu.h
  1366. A v8-read-only/src/dtoa.h
  1367. A v8-read-only/src/objects.h
  1368. A v8-read-only/src/flags.cc
  1369. A v8-read-only/src/atomicops_internals_x86_gcc.cc
  1370. A v8-read-only/src/counters.cc
  1371. A v8-read-only/src/SConscript
  1372. A v8-read-only/src/store-buffer.h
  1373. A v8-read-only/src/bignum-dtoa.cc
  1374. A v8-read-only/src/messages.cc
  1375. A v8-read-only/src/code-stubs.cc
  1376. A v8-read-only/src/v8threads.cc
  1377. A v8-read-only/src/d8.cc
  1378. A v8-read-only/src/natives.h
  1379. A v8-read-only/src/dateparser-inl.h
  1380. A v8-read-only/src/objects-debug.cc
  1381. A v8-read-only/src/d8.h
  1382. A v8-read-only/src/safepoint-table.cc
  1383. A v8-read-only/src/macro-assembler.h
  1384. A v8-read-only/src/unbound-queue-inl.h
  1385. A v8-read-only/src/strtod.h
  1386. A v8-read-only/src/gdb-jit.h
  1387. A v8-read-only/src/func-name-inferrer.cc
  1388. A v8-read-only/src/fixed-dtoa.cc
  1389. A v8-read-only/src/platform-win32.cc
  1390. A v8-read-only/src/accessors.cc
  1391. A v8-read-only/src/debug.cc
  1392. A v8-read-only/src/mksnapshot.cc
  1393. A v8-read-only/src/dateparser.cc
  1394. A v8-read-only/src/lithium-allocator.h
  1395. A v8-read-only/src/list-inl.h
  1396. A v8-read-only/src/debug-debugger.js
  1397. A v8-read-only/src/snapshot.h
  1398. A v8-read-only/src/utils.h
  1399. A v8-read-only/src/splay-tree-inl.h
  1400. A v8-read-only/src/conversions.h
  1401. A v8-read-only/src/v8dll-main.cc
  1402. A v8-read-only/src/spaces.cc
  1403. A v8-read-only/src/v8utils.cc
  1404. A v8-read-only/src/compilation-cache.cc
  1405. A v8-read-only/src/bignum.cc
  1406. A v8-read-only/src/hydrogen-instructions.cc
  1407. A v8-read-only/src/platform-linux.cc
  1408. A v8-read-only/src/regexp-macro-assembler-tracer.cc
  1409. A v8-read-only/src/collection.js
  1410. A v8-read-only/src/objects-visiting.h
  1411. A v8-read-only/src/interpreter-irregexp.cc
  1412. A v8-read-only/src/uri.js
  1413. A v8-read-only/src/platform-posix.h
  1414. A v8-read-only/src/scopeinfo.h
  1415. A v8-read-only/src/regexp-macro-assembler-irregexp.cc
  1416. A v8-read-only/src/serialize.cc
  1417. A v8-read-only/src/builtins.cc
  1418. A v8-read-only/src/dateparser.h
  1419. A v8-read-only/src/zone-inl.h
  1420. A v8-read-only/src/string-stream.cc
  1421. A v8-read-only/src/v8-counters.h
  1422. A v8-read-only/src/frames-inl.h
  1423. A v8-read-only/src/vm-state.h
  1424. A v8-read-only/src/liveobjectlist-inl.h
  1425. A v8-read-only/src/full-codegen.cc
  1426. A v8-read-only/src/rewriter.h
  1427. A v8-read-only/src/liveedit.h
  1428. A v8-read-only/src/log-utils.cc
  1429. A v8-read-only/src/debug-agent.cc
  1430. A v8-read-only/src/d8.gyp
  1431. A v8-read-only/src/store-buffer-inl.h
  1432. A v8-read-only/src/once.h
  1433. A v8-read-only/src/platform-tls-win32.h
  1434. A v8-read-only/src/unicode.cc
  1435. A v8-read-only/src/version.h
  1436. A v8-read-only/src/v8conversions.h
  1437. A v8-read-only/src/smart-pointers.h
  1438. A v8-read-only/src/apiutils.h
  1439. A v8-read-only/src/parser.h
  1440. A v8-read-only/src/small-pointer-list.h
  1441. A v8-read-only/src/optimizing-compiler-thread.cc
  1442. A v8-read-only/src/circular-queue-inl.h
  1443. A v8-read-only/src/variables.cc
  1444. A v8-read-only/src/contexts.h
  1445. A v8-read-only/src/cpu-profiler.h
  1446. A v8-read-only/src/v8threads.h
  1447. A v8-read-only/src/code-stubs.h
  1448. A v8-read-only/src/lithium.cc
  1449. A v8-read-only/src/lithium.h
  1450. A v8-read-only/src/liveedit-debugger.js
  1451. A v8-read-only/src/global-handles.h
  1452. A v8-read-only/src/disassembler.h
  1453. A v8-read-only/src/math.js
  1454. A v8-read-only/src/preparse-data-format.h
  1455. A v8-read-only/src/atomicops_internals_mips_gcc.h
  1456. A v8-read-only/src/mips
  1457. A v8-read-only/src/mips/debug-mips.cc
  1458. A v8-read-only/src/mips/cpu-mips.cc
  1459. A v8-read-only/src/mips/builtins-mips.cc
  1460. A v8-read-only/src/mips/deoptimizer-mips.cc
  1461. A v8-read-only/src/mips/ic-mips.cc
  1462. A v8-read-only/src/mips/assembler-mips-inl.h
  1463. A v8-read-only/src/mips/full-codegen-mips.cc
  1464. A v8-read-only/src/mips/codegen-mips.cc
  1465. A v8-read-only/src/mips/regexp-macro-assembler-mips.cc
  1466. A v8-read-only/src/mips/regexp-macro-assembler-mips.h
  1467. A v8-read-only/src/mips/codegen-mips.h
  1468. A v8-read-only/src/mips/code-stubs-mips.cc
  1469. A v8-read-only/src/mips/code-stubs-mips.h
  1470. A v8-read-only/src/mips/lithium-mips.cc
  1471. A v8-read-only/src/mips/macro-assembler-mips.cc
  1472. A v8-read-only/src/mips/constants-mips.cc
  1473. A v8-read-only/src/mips/frames-mips.cc
  1474. A v8-read-only/src/mips/lithium-mips.h
  1475. A v8-read-only/src/mips/assembler-mips.cc
  1476. A v8-read-only/src/mips/lithium-codegen-mips.cc
  1477. A v8-read-only/src/mips/constants-mips.h
  1478. A v8-read-only/src/mips/macro-assembler-mips.h
  1479. A v8-read-only/src/mips/stub-cache-mips.cc
  1480. A v8-read-only/src/mips/simulator-mips.cc
  1481. A v8-read-only/src/mips/frames-mips.h
  1482. A v8-read-only/src/mips/lithium-gap-resolver-mips.cc
  1483. A v8-read-only/src/mips/assembler-mips.h
  1484. A v8-read-only/src/mips/lithium-codegen-mips.h
  1485. A v8-read-only/src/mips/disasm-mips.cc
  1486. A v8-read-only/src/mips/simulator-mips.h
  1487. A v8-read-only/src/mips/lithium-gap-resolver-mips.h
  1488. A v8-read-only/src/liveobjectlist.h
  1489. A v8-read-only/src/property.h
  1490. A v8-read-only/src/platform.h
  1491. A v8-read-only/src/allocation.h
  1492. A v8-read-only/src/jsregexp.cc
  1493. A v8-read-only/src/incremental-marking.cc
  1494. A v8-read-only/src/diy-fp.cc
  1495. A v8-read-only/src/win32-math.cc
  1496. A v8-read-only/src/builtins.h
  1497. A v8-read-only/src/parser.cc
  1498. A v8-read-only/src/v8-counters.cc
  1499. A v8-read-only/src/platform-solaris.cc
  1500. A v8-read-only/src/isolate.h
  1501. A v8-read-only/src/checks.h
  1502. A v8-read-only/src/date.js
  1503. A v8-read-only/src/execution.h
  1504. A v8-read-only/src/objects-visiting-inl.h
  1505. A v8-read-only/src/bytecodes-irregexp.h
  1506. A v8-read-only/src/factory.cc
  1507. A v8-read-only/src/messages.h
  1508. A v8-read-only/src/global-handles.cc
  1509. A v8-read-only/src/strtod.cc
  1510. A v8-read-only/src/stub-cache.h
  1511. A v8-read-only/src/hydrogen.h
  1512. A v8-read-only/src/log.h
  1513. A v8-read-only/src/globals.h
  1514. A v8-read-only/src/circular-queue.h
  1515. A v8-read-only/src/prettyprinter.cc
  1516. A v8-read-only/src/prettyprinter.h
  1517. A v8-read-only/src/heap-profiler.h
  1518. A v8-read-only/src/bignum-dtoa.h
  1519. A v8-read-only/src/disassembler.cc
  1520. A v8-read-only/src/char-predicates-inl.h
  1521. A v8-read-only/src/gdb-jit.cc
  1522. A v8-read-only/src/regexp.js
  1523. A v8-read-only/src/fast-dtoa.h
  1524. A v8-read-only/src/snapshot-common.cc
  1525. A v8-read-only/src/bootstrapper.h
  1526. A v8-read-only/src/macros.py
  1527. A v8-read-only/src/debug.h
  1528. A v8-read-only/src/serialize.h
  1529. A v8-read-only/src/regexp-macro-assembler-irregexp.h
  1530. A v8-read-only/src/cpu-profiler-inl.h
  1531. A v8-read-only/src/apinatives.js
  1532. A v8-read-only/src/win32-math.h
  1533. A v8-read-only/src/transitions-inl.h
  1534. A v8-read-only/src/heap-inl.h
  1535. A v8-read-only/src/utils.cc
  1536. A v8-read-only/src/mark-compact-inl.h
  1537. A v8-read-only/src/atomicops.h
  1538. A v8-read-only/src/elements-kind.h
  1539. A v8-read-only/src/third_party
  1540. A v8-read-only/src/third_party/valgrind
  1541. A v8-read-only/src/third_party/valgrind/valgrind.h
  1542. A v8-read-only/src/profile-generator-inl.h
  1543. A v8-read-only/src/arguments.h
  1544. A v8-read-only/src/unicode-inl.h
  1545. A v8-read-only/src/variables.h
  1546. A v8-read-only/src/ia32
  1547. A v8-read-only/src/ia32/assembler-ia32-inl.h
  1548. A v8-read-only/src/ia32/codegen-ia32.cc
  1549. A v8-read-only/src/ia32/regexp-macro-assembler-ia32.cc
  1550. A v8-read-only/src/ia32/full-codegen-ia32.cc
  1551. A v8-read-only/src/ia32/codegen-ia32.h
  1552. A v8-read-only/src/ia32/regexp-macro-assembler-ia32.h
  1553. A v8-read-only/src/ia32/code-stubs-ia32.cc
  1554. A v8-read-only/src/ia32/code-stubs-ia32.h
  1555. A v8-read-only/src/ia32/lithium-ia32.cc
  1556. A v8-read-only/src/ia32/macro-assembler-ia32.cc
  1557. A v8-read-only/src/ia32/lithium-codegen-ia32.cc
  1558. A v8-read-only/src/ia32/frames-ia32.cc
  1559. A v8-read-only/src/ia32/assembler-ia32.cc
  1560. A v8-read-only/src/ia32/lithium-ia32.h
  1561. A v8-read-only/src/ia32/stub-cache-ia32.cc
  1562. A v8-read-only/src/ia32/macro-assembler-ia32.h
  1563. A v8-read-only/src/ia32/lithium-gap-resolver-ia32.cc
  1564. A v8-read-only/src/ia32/simulator-ia32.cc
  1565. A v8-read-only/src/ia32/assembler-ia32.h
  1566. A v8-read-only/src/ia32/frames-ia32.h
  1567. A v8-read-only/src/ia32/lithium-codegen-ia32.h
  1568. A v8-read-only/src/ia32/disasm-ia32.cc
  1569. A v8-read-only/src/ia32/lithium-gap-resolver-ia32.h
  1570. A v8-read-only/src/ia32/simulator-ia32.h
  1571. A v8-read-only/src/ia32/debug-ia32.cc
  1572. A v8-read-only/src/ia32/cpu-ia32.cc
  1573. A v8-read-only/src/ia32/builtins-ia32.cc
  1574. A v8-read-only/src/ia32/deoptimizer-ia32.cc
  1575. A v8-read-only/src/ia32/ic-ia32.cc
  1576. A v8-read-only/src/simulator.h
  1577. A v8-read-only/src/flag-definitions.h
  1578. A v8-read-only/src/cached-powers.h
  1579. A v8-read-only/src/splay-tree.h
  1580. A v8-read-only/src/accessors.h
  1581. A v8-read-only/src/preparse-data.cc
  1582. A v8-read-only/src/interpreter-irregexp.h
  1583. A v8-read-only/src/diy-fp.h
  1584. A v8-read-only/src/deoptimizer.cc
  1585. A v8-read-only/src/ic.cc
  1586. A v8-read-only/src/heap-profiler.cc
  1587. A v8-read-only/src/deoptimizer.h
  1588. A v8-read-only/src/ic.h
  1589. A v8-read-only/src/platform-nullos.cc
  1590. A v8-read-only/src/regexp-stack.h
  1591. A v8-read-only/src/v8.h
  1592. A v8-read-only/src/char-predicates.h
  1593. A v8-read-only/src/regexp-macro-assembler.cc
  1594. A v8-read-only/src/json-parser.h
  1595. A v8-read-only/src/preparser.h
  1596. A v8-read-only/src/runtime-profiler.h
  1597. A v8-read-only/src/inspector.cc
  1598. A v8-read-only/src/property-details.h
  1599. A v8-read-only/src/compiler.cc
  1600. A v8-read-only/src/runtime.js
  1601. A v8-read-only/src/stub-cache.cc
  1602. A v8-read-only/src/frames.h
  1603. A v8-read-only/src/mark-compact.h
  1604. A v8-read-only/src/utils-inl.h
  1605. A v8-read-only/src/runtime.h
  1606. A v8-read-only/src/fixed-dtoa.h
  1607. A v8-read-only/src/unicode.h
  1608. A v8-read-only/src/incremental-marking.h
  1609. A v8-read-only/src/jsregexp.h
  1610. A v8-read-only/src/conversions-inl.h
  1611. A v8-read-only/src/atomicops_internals_arm_gcc.h
  1612. A v8-read-only/src/platform-freebsd.cc
  1613. A v8-read-only/src/d8-readline.cc
  1614. A v8-read-only/src/atomicops_internals_x86_macosx.h
  1615. A v8-read-only/src/messages.js
  1616. A v8-read-only/src/d8.js
  1617. A v8-read-only/src/store-buffer.cc
  1618. A v8-read-only/src/codegen.cc
  1619. A v8-read-only/src/array.js
  1620. A v8-read-only/src/optimizing-compiler-thread.h
  1621. A v8-read-only/src/factory.h
  1622. A v8-read-only/src/regexp-macro-assembler-irregexp-inl.h
  1623. A v8-read-only/src/preparser-api.cc
  1624. A v8-read-only/src/d8-posix.cc
  1625. A v8-read-only/src/double.h
  1626. A v8-read-only/src/compiler.h
  1627. A v8-read-only/src/hydrogen.cc
  1628. A v8-read-only/src/assembler.h
  1629. A v8-read-only/src/vm-state-inl.h
  1630. A v8-read-only/src/profile-generator.cc
  1631. A v8-read-only/src/func-name-inferrer.h
  1632. A v8-read-only/src/scanner.cc
  1633. A v8-read-only/src/v8.cc
  1634. A v8-read-only/src/regexp-stack.cc
  1635. A v8-read-only/src/compiler-intrinsics.h
  1636. A v8-read-only/src/isolate.cc
  1637. A v8-read-only/src/checks.cc
  1638. A v8-read-only/src/handles-inl.h
  1639. A v8-read-only/src/scanner-character-streams.h
  1640. A v8-read-only/src/interface.h
  1641. A v8-read-only/src/counters.h
  1642. A v8-read-only/src/full-codegen.h
  1643. A v8-read-only/src/ic-inl.h
  1644. A v8-read-only/src/frames.cc
  1645. A v8-read-only/src/objects-visiting.cc
  1646. A v8-read-only/src/lazy-instance.h
  1647. A v8-read-only/src/platform-macos.cc
  1648. A v8-read-only/src/preparse-data.h
  1649. A v8-read-only/src/string.js
  1650. A v8-read-only/src/x64
  1651. A v8-read-only/src/x64/macro-assembler-x64.cc
  1652. A v8-read-only/src/x64/lithium-x64.h
  1653. A v8-read-only/src/x64/assembler-x64.cc
  1654. A v8-read-only/src/x64/frames-x64.cc
  1655. A v8-read-only/src/x64/lithium-codegen-x64.cc
  1656. A v8-read-only/src/x64/macro-assembler-x64.h
  1657. A v8-read-only/src/x64/stub-cache-x64.cc
  1658. A v8-read-only/src/x64/lithium-gap-resolver-x64.cc
  1659. A v8-read-only/src/x64/simulator-x64.cc
  1660. A v8-read-only/src/x64/frames-x64.h
  1661. A v8-read-only/src/x64/lithium-codegen-x64.h
  1662. A v8-read-only/src/x64/assembler-x64.h
  1663. A v8-read-only/src/x64/disasm-x64.cc
  1664. A v8-read-only/src/x64/lithium-gap-resolver-x64.h
  1665. A v8-read-only/src/x64/simulator-x64.h
  1666. A v8-read-only/src/x64/debug-x64.cc
  1667. A v8-read-only/src/x64/cpu-x64.cc
  1668. A v8-read-only/src/x64/builtins-x64.cc
  1669. A v8-read-only/src/x64/deoptimizer-x64.cc
  1670. A v8-read-only/src/x64/ic-x64.cc
  1671. A v8-read-only/src/x64/assembler-x64-inl.h
  1672. A v8-read-only/src/x64/full-codegen-x64.cc
  1673. A v8-read-only/src/x64/regexp-macro-assembler-x64.cc
  1674. A v8-read-only/src/x64/codegen-x64.cc
  1675. A v8-read-only/src/x64/codegen-x64.h
  1676. A v8-read-only/src/x64/regexp-macro-assembler-x64.h
  1677. A v8-read-only/src/x64/code-stubs-x64.cc
  1678. A v8-read-only/src/x64/code-stubs-x64.h
  1679. A v8-read-only/src/x64/lithium-x64.cc
  1680. A v8-read-only/src/unbound-queue.h
  1681. A v8-read-only/src/elements-kind.cc
  1682. A v8-read-only/src/json.js
  1683. A v8-read-only/src/rewriter.cc
  1684. A v8-read-only/src/incremental-marking-inl.h
  1685. A v8-read-only/src/objects-printer.cc
  1686. A v8-read-only/src/type-info.cc
  1687. A v8-read-only/src/objects-inl.h
  1688. A v8-read-only/src/assembler.cc
  1689. A v8-read-only/src/mark-compact.cc
  1690. A v8-read-only/src/date.h
  1691. A v8-read-only/src/data-flow.h
  1692. A v8-read-only/src/handles.h
  1693. A v8-read-only/src/log.cc
  1694. A v8-read-only/src/token.h
  1695. A v8-read-only/src/isolate-inl.h
  1696. A v8-read-only/src/liveobjectlist.cc
  1697. A v8-read-only/src/regexp-macro-assembler-tracer.h
  1698. A v8-read-only/src/platform-posix.cc
  1699. A v8-read-only/src/ast.cc
  1700. A v8-read-only/src/arm
  1701. A v8-read-only/src/arm/stub-cache-arm.cc
  1702. A v8-read-only/src/arm/macro-assembler-arm.h
  1703. A v8-read-only/src/arm/constants-arm.h
  1704. A v8-read-only/src/arm/frames-arm.h
  1705. A v8-read-only/src/arm/lithium-gap-resolver-arm.cc
  1706. A v8-read-only/src/arm/lithium-codegen-arm.h
  1707. A v8-read-only/src/arm/simulator-arm.cc
  1708. A v8-read-only/src/arm/assembler-arm.h
  1709. A v8-read-only/src/arm/disasm-arm.cc
  1710. A v8-read-only/src/arm/lithium-gap-resolver-arm.h
  1711. A v8-read-only/src/arm/simulator-arm.h
  1712. A v8-read-only/src/arm/debug-arm.cc
  1713. A v8-read-only/src/arm/cpu-arm.cc
  1714. A v8-read-only/src/arm/builtins-arm.cc
  1715. A v8-read-only/src/arm/deoptimizer-arm.cc
  1716. A v8-read-only/src/arm/ic-arm.cc
  1717. A v8-read-only/src/arm/assembler-arm-inl.h
  1718. A v8-read-only/src/arm/regexp-macro-assembler-arm.cc
  1719. A v8-read-only/src/arm/codegen-arm.cc
  1720. A v8-read-only/src/arm/full-codegen-arm.cc
  1721. A v8-read-only/src/arm/regexp-macro-assembler-arm.h
  1722. A v8-read-only/src/arm/codegen-arm.h
  1723. A v8-read-only/src/arm/code-stubs-arm.cc
  1724. A v8-read-only/src/arm/code-stubs-arm.h
  1725. A v8-read-only/src/arm/lithium-arm.cc
  1726. A v8-read-only/src/arm/constants-arm.cc
  1727. A v8-read-only/src/arm/macro-assembler-arm.cc
  1728. A v8-read-only/src/arm/lithium-codegen-arm.cc
  1729. A v8-read-only/src/arm/frames-arm.cc
  1730. A v8-read-only/src/arm/lithium-arm.h
  1731. A v8-read-only/src/arm/assembler-arm.cc
  1732. A v8-read-only/src/scanner.h
  1733. A v8-read-only/src/scopes.h
  1734. A v8-read-only/src/v8preparserdll-main.cc
  1735. A v8-read-only/src/d8-debug.h
  1736. A v8-read-only/src/lithium-allocator-inl.h
  1737. A v8-read-only/src/type-info.h
  1738. A v8-read-only/src/win32-headers.h
  1739. A v8-read-only/src/elements.h
  1740. A v8-read-only/src/heap.h
  1741. A v8-read-only/src/transitions.h
  1742. A v8-read-only/src/disasm.h
  1743. A v8-read-only/src/hydrogen-instructions.h
  1744. A v8-read-only/src/bignum.h
  1745. A v8-read-only/src/mirror-debugger.js
  1746. A v8-read-only/src/platform-tls-mac.h
  1747. A v8-read-only/src/once.cc
  1748. A v8-read-only/src/debug-agent.h
  1749. A v8-read-only/src/scopeinfo.cc
  1750. A v8-read-only/src/dtoa.cc
  1751. A v8-read-only/src/snapshot-empty.cc
  1752. A v8-read-only/src/scopes.cc
  1753. A v8-read-only/src/execution.cc
  1754. A v8-read-only/src/liveedit.cc
  1755. A v8-read-only/src/inspector.h
  1756. A v8-read-only/src/string-search.cc
  1757. A v8-read-only/src/elements.cc
  1758. A v8-read-only/src/date.cc
  1759. A v8-read-only/src/misc-intrinsics.h
  1760. A v8-read-only/src/fast-dtoa.cc
  1761. A v8-read-only/src/platform-cygwin.cc
  1762. A v8-read-only/src/property.cc
  1763. A v8-read-only/src/version.cc
  1764. A v8-read-only/ChangeLog
  1765. A v8-read-only/DEPS
  1766. A v8-read-only/Makefile.android
  1767. A v8-read-only/build
  1768. A v8-read-only/build/common.gypi
  1769. A v8-read-only/build/standalone.gypi
  1770. A v8-read-only/build/all.gyp
  1771. A v8-read-only/build/android.gypi
  1772. A v8-read-only/build/README.txt
  1773. A v8-read-only/build/gyp_v8
  1774. A v8-read-only/tools
  1775. A v8-read-only/tools/oom_dump
  1776. A v8-read-only/tools/oom_dump/oom_dump.cc
  1777. A v8-read-only/tools/oom_dump/SConstruct
  1778. A v8-read-only/tools/oom_dump/README
  1779. A v8-read-only/tools/grokdump.py
  1780. A v8-read-only/tools/check-static-initializers.sh
  1781. A v8-read-only/tools/freebsd-tick-processor
  1782. A v8-read-only/tools/logreader.js
  1783. A v8-read-only/tools/splaytree.js
  1784. A v8-read-only/tools/merge-to-branch.sh
  1785. A v8-read-only/tools/csvparser.js
  1786. A v8-read-only/tools/gdb-v8-support.py
  1787. A v8-read-only/tools/js2c.py
  1788. A v8-read-only/tools/run-tests.py
  1789. A v8-read-only/tools/status-file-converter.py
  1790. A v8-read-only/tools/bash-completion.sh
  1791. A v8-read-only/tools/tickprocessor-driver.js
  1792. A v8-read-only/tools/run-valgrind.py
  1793. A v8-read-only/tools/test-wrapper-gypbuild.py
  1794. A v8-read-only/tools/presubmit.py
  1795. A v8-read-only/tools/android-ll-prof.sh
  1796. A v8-read-only/tools/tickprocessor.js
  1797. A v8-read-only/tools/common-includes.sh
  1798. A v8-read-only/tools/jsmin.py
  1799. A v8-read-only/tools/testrunner
  1800. A v8-read-only/tools/testrunner/server
  1801. A v8-read-only/tools/testrunner/server/constants.py
  1802. A v8-read-only/tools/testrunner/server/work_handler.py
  1803. A v8-read-only/tools/testrunner/server/__init__.py
  1804. A v8-read-only/tools/testrunner/server/status_handler.py
  1805. A v8-read-only/tools/testrunner/server/presence_handler.py
  1806. A v8-read-only/tools/testrunner/server/compression.py
  1807. A v8-read-only/tools/testrunner/server/daemon.py
  1808. A v8-read-only/tools/testrunner/server/signatures.py
  1809. A v8-read-only/tools/testrunner/server/main.py
  1810. A v8-read-only/tools/testrunner/server/local_handler.py
  1811. A v8-read-only/tools/testrunner/__init__.py
  1812. A v8-read-only/tools/testrunner/network
  1813. A v8-read-only/tools/testrunner/network/network_execution.py
  1814. A v8-read-only/tools/testrunner/network/__init__.py
  1815. A v8-read-only/tools/testrunner/network/endpoint.py
  1816. A v8-read-only/tools/testrunner/network/distro.py
  1817. A v8-read-only/tools/testrunner/network/perfdata.py
  1818. A v8-read-only/tools/testrunner/objects
  1819. A v8-read-only/tools/testrunner/objects/workpacket.py
  1820. A v8-read-only/tools/testrunner/objects/testcase.py
  1821. A v8-read-only/tools/testrunner/objects/peer.py
  1822. A v8-read-only/tools/testrunner/objects/__init__.py
  1823. A v8-read-only/tools/testrunner/objects/output.py
  1824. A v8-read-only/tools/testrunner/objects/context.py
  1825. A v8-read-only/tools/testrunner/local
  1826. A v8-read-only/tools/testrunner/local/testsuite.py
  1827. A v8-read-only/tools/testrunner/local/__init__.py
  1828. A v8-read-only/tools/testrunner/local/utils.py
  1829. A v8-read-only/tools/testrunner/local/commands.py
  1830. A v8-read-only/tools/testrunner/local/old_statusfile.py
  1831. A v8-read-only/tools/testrunner/local/execution.py
  1832. A v8-read-only/tools/testrunner/local/statusfile.py
  1833. A v8-read-only/tools/testrunner/local/progress.py
  1834. A v8-read-only/tools/testrunner/local/verbose.py
  1835. A v8-read-only/tools/testrunner/README
  1836. A v8-read-only/tools/profile.js
  1837. A v8-read-only/tools/codemap.js
  1838. A v8-read-only/tools/ll_prof.py
  1839. A v8-read-only/tools/process-heap-prof.py
  1840. A v8-read-only/tools/stats-viewer.py
  1841. A v8-read-only/tools/gen-postmortem-metadata.py
  1842. A v8-read-only/tools/android-build.sh
  1843. A v8-read-only/tools/utils.py
  1844. A v8-read-only/tools/v8.xcodeproj
  1845. A v8-read-only/tools/v8.xcodeproj/README.txt
  1846. A v8-read-only/tools/visual_studio
  1847. A v8-read-only/tools/visual_studio/README.txt
  1848. A v8-read-only/tools/gc-nvp-trace-processor.py
  1849. A v8-read-only/tools/gyp
  1850. A v8-read-only/tools/gyp/v8.gyp
  1851. A v8-read-only/tools/android-sync.sh
  1852. A v8-read-only/tools/linux-tick-processor
  1853. A v8-read-only/tools/windows-tick-processor.bat
  1854. A v8-read-only/tools/mac-tick-processor
  1855. A v8-read-only/tools/profile_view.js
  1856. A v8-read-only/tools/test.py
  1857. A v8-read-only/tools/gcmole
  1858. A v8-read-only/tools/gcmole/gcmole.lua
  1859. A v8-read-only/tools/gcmole/gccause.lua
  1860. A v8-read-only/tools/gcmole/gcmole.cc
  1861. A v8-read-only/tools/gcmole/README
  1862. A v8-read-only/tools/gcmole/Makefile
  1863. A v8-read-only/tools/disasm.py
  1864. A v8-read-only/tools/mac-nm
  1865. A v8-read-only/tools/fuzz-harness.sh
  1866. A v8-read-only/tools/android-run.py
  1867. A v8-read-only/tools/push-to-trunk.sh
  1868. A v8-read-only/tools/test-server.py
  1869. A v8-read-only/tools/consarray.js
  1870. A v8-read-only/tools/generate-ten-powers.scm
  1871. A v8-read-only/PRESUBMIT.py
  1872. A v8-read-only/preparser
  1873. A v8-read-only/preparser/preparser.gyp
  1874. A v8-read-only/preparser/preparser-process.cc
  1875. A v8-read-only/preparser/SConscript
  1876. A v8-read-only/samples
  1877. A v8-read-only/samples/count-hosts.js
  1878. A v8-read-only/samples/process.cc
  1879. A v8-read-only/samples/samples.gyp
  1880. A v8-read-only/samples/SConscript
  1881. A v8-read-only/samples/shell.cc
  1882. A v8-read-only/samples/lineprocessor.cc
  1883. A v8-read-only/.gitignore
  1884. A v8-read-only/SConstruct
  1885. A v8-read-only/LICENSE.strongtalk
  1886. A v8-read-only/benchmarks
  1887. A v8-read-only/benchmarks/run.js
  1888. A v8-read-only/benchmarks/spinning-balls
  1889. A v8-read-only/benchmarks/spinning-balls/splay-tree.js
  1890. A v8-read-only/benchmarks/spinning-balls/v.js
  1891. A v8-read-only/benchmarks/spinning-balls/index.html
  1892. A v8-read-only/benchmarks/revisions.html
  1893. A v8-read-only/benchmarks/base.js
  1894. A v8-read-only/benchmarks/raytrace.js
  1895. A v8-read-only/benchmarks/style.css
  1896. A v8-read-only/benchmarks/crypto.js
  1897. A v8-read-only/benchmarks/splay.js
  1898. A v8-read-only/benchmarks/regexp.js
  1899. A v8-read-only/benchmarks/navier-stokes.js
  1900. A v8-read-only/benchmarks/run.html
  1901. A v8-read-only/benchmarks/earley-boyer.js
  1902. A v8-read-only/benchmarks/richards.js
  1903. A v8-read-only/benchmarks/README.txt
  1904. A v8-read-only/benchmarks/deltablue.js
  1905. A v8-read-only/benchmarks/v8-logo.png
  1906. A v8-read-only/OWNERS
  1907. A v8-read-only/Makefile
  1908. A v8-read-only/LICENSE.v8
  1909. U v8-read-only
  1910. Checked out revision 12823.
  1911. # cd ./v8-read-only && svn update -r12823 && make dependencies && GYP_GENERATORS=make make GYPFLAGS="-Dcomponent=shared_library -Dv8_enable_extra_checks=0" -j 4 ia32.release
  1912. cd ./v8-read-only && svn update -r12823 && make dependencies && GYP_GENERATORS=make make ia32.release library=shared -j 2
  1913. Updating '.':
  1914. At revision 12823.
  1915. make[2]: Entering directory `/home/odroid/src/SilkJS/src/v8-read-only'
  1916. svn checkout --force http://gyp.googlecode.com/svn/trunk build/gyp \
  1917. --revision 1501
  1918. A build/gyp/pylib
  1919. A build/gyp/pylib/gyp
  1920. A build/gyp/pylib/gyp/common.py
  1921. A build/gyp/pylib/gyp/win_tool.py
  1922. A build/gyp/pylib/gyp/xcodeproj_file.py
  1923. A build/gyp/pylib/gyp/mac_tool.py
  1924. A build/gyp/pylib/gyp/MSVSVersion.py
  1925. A build/gyp/pylib/gyp/__init__.py
  1926. A build/gyp/pylib/gyp/input.py
  1927. A build/gyp/pylib/gyp/generator
  1928. A build/gyp/pylib/gyp/generator/msvs.py
  1929. A build/gyp/pylib/gyp/generator/gypsh.py
  1930. A build/gyp/pylib/gyp/generator/dump_dependency_json.py
  1931. A build/gyp/pylib/gyp/generator/make.py
  1932. A build/gyp/pylib/gyp/generator/ninja_test.py
  1933. A build/gyp/pylib/gyp/generator/__init__.py
  1934. A build/gyp/pylib/gyp/generator/ninja.py
  1935. A build/gyp/pylib/gyp/generator/android.py
  1936. A build/gyp/pylib/gyp/generator/xcode.py
  1937. A build/gyp/pylib/gyp/generator/gypd.py
  1938. A build/gyp/pylib/gyp/generator/eclipse.py
  1939. A build/gyp/pylib/gyp/generator/scons.py
  1940. A build/gyp/pylib/gyp/generator/msvs_test.py
  1941. A build/gyp/pylib/gyp/MSVSNew.py
  1942. A build/gyp/pylib/gyp/sun_tool.py
  1943. A build/gyp/pylib/gyp/ninja_syntax.py
  1944. A build/gyp/pylib/gyp/msvs_emulation.py
  1945. A build/gyp/pylib/gyp/xml_fix.py
  1946. A build/gyp/pylib/gyp/MSVSSettings_test.py
  1947. A build/gyp/pylib/gyp/MSVSSettings.py
  1948. A build/gyp/pylib/gyp/MSVSProject.py
  1949. A build/gyp/pylib/gyp/xcode_emulation.py
  1950. A build/gyp/pylib/gyp/easy_xml_test.py
  1951. A build/gyp/pylib/gyp/easy_xml.py
  1952. A build/gyp/pylib/gyp/system_test.py
  1953. A build/gyp/pylib/gyp/SCons.py
  1954. A build/gyp/pylib/gyp/MSVSToolFile.py
  1955. A build/gyp/pylib/gyp/MSVSUserFile.py
  1956. A build/gyp/pylib/gyp/common_test.py
  1957. A build/gyp/test
  1958. A build/gyp/test/actions-subdir
  1959. A build/gyp/test/actions-subdir/gyptest-action.py
  1960. A build/gyp/test/actions-subdir/src
  1961. A build/gyp/test/actions-subdir/src/make-file.py
  1962. A build/gyp/test/actions-subdir/src/subdir
  1963. A build/gyp/test/actions-subdir/src/subdir/subdir.gyp
  1964. A build/gyp/test/actions-subdir/src/subdir/make-subdir-file.py
  1965. A build/gyp/test/actions-subdir/src/none.gyp
  1966. A build/gyp/test/dependency-copy
  1967. A build/gyp/test/dependency-copy/src
  1968. A build/gyp/test/dependency-copy/src/copies.gyp
  1969. A build/gyp/test/dependency-copy/src/file1.c
  1970. A build/gyp/test/dependency-copy/src/file2.c
  1971. A build/gyp/test/dependency-copy/gyptest-copy.py
  1972. A build/gyp/test/dependencies
  1973. A build/gyp/test/dependencies/none_traversal.gyp
  1974. A build/gyp/test/dependencies/b
  1975. A build/gyp/test/dependencies/b/b.gyp
  1976. A build/gyp/test/dependencies/b/b.c
  1977. A build/gyp/test/dependencies/b/b3.c
  1978. A build/gyp/test/dependencies/a.c
  1979. A build/gyp/test/dependencies/c
  1980. A build/gyp/test/dependencies/c/c.gyp
  1981. A build/gyp/test/dependencies/c/c.c
  1982. A build/gyp/test/dependencies/c/d.c
  1983. A build/gyp/test/dependencies/gyptest-none-traversal.py
  1984. A build/gyp/test/dependencies/main.c
  1985. A build/gyp/test/dependencies/lib_only.gyp
  1986. A build/gyp/test/dependencies/double_dependency.gyp
  1987. A build/gyp/test/dependencies/gyptest-lib-only.py
  1988. A build/gyp/test/dependencies/gyptest-double-dependency.py
  1989. A build/gyp/test/dependencies/extra_targets.gyp
  1990. A build/gyp/test/dependencies/double_dependent.gyp
  1991. A build/gyp/test/dependencies/gyptest-extra-targets.py
  1992. A build/gyp/test/compiler-override
  1993. A build/gyp/test/compiler-override/test.c
  1994. A build/gyp/test/compiler-override/my_cc.py
  1995. A build/gyp/test/compiler-override/compiler-host.gyp
  1996. A build/gyp/test/compiler-override/gyptest-compiler-env.py
  1997. A build/gyp/test/compiler-override/cxxtest.cc
  1998. A build/gyp/test/compiler-override/compiler.gyp
  1999. A build/gyp/test/compiler-override/compiler-global-settings.gyp.in
  2000. A build/gyp/test/compiler-override/gyptest-compiler-global-settings.py
  2001. A build/gyp/test/compiler-override/my_ld.py
  2002. A build/gyp/test/compiler-override/my_cxx.py
  2003. A build/gyp/test/variants
  2004. A build/gyp/test/variants/src
  2005. A build/gyp/test/variants/src/variants.gyp
  2006. A build/gyp/test/variants/src/variants.c
  2007. A build/gyp/test/variants/gyptest-variants.py
  2008. A build/gyp/test/configurations
  2009. A build/gyp/test/configurations/x64
  2010. A build/gyp/test/configurations/x64/configurations.gyp
  2011. A build/gyp/test/configurations/x64/gyptest-x86.py
  2012. A build/gyp/test/configurations/x64/configurations.c
  2013. A build/gyp/test/configurations/basics
  2014. A build/gyp/test/configurations/basics/configurations.gyp
  2015. A build/gyp/test/configurations/basics/configurations.c
  2016. A build/gyp/test/configurations/basics/gyptest-configurations.py
  2017. A build/gyp/test/configurations/invalid
  2018. A build/gyp/test/configurations/invalid/type.gyp
  2019. A build/gyp/test/configurations/invalid/sources.gyp
  2020. A build/gyp/test/configurations/invalid/target_name.gyp
  2021. A build/gyp/test/configurations/invalid/dependencies.gyp
  2022. A build/gyp/test/configurations/invalid/configurations.gyp
  2023. A build/gyp/test/configurations/invalid/libraries.gyp
  2024. A build/gyp/test/configurations/invalid/link_settings.gyp
  2025. A build/gyp/test/configurations/invalid/all_dependent_settings.gyp
  2026. A build/gyp/test/configurations/invalid/actions.gyp
  2027. A build/gyp/test/configurations/invalid/direct_dependent_settings.gyp
  2028. A build/gyp/test/configurations/invalid/gyptest-configurations.py
  2029. A build/gyp/test/configurations/inheritance
  2030. A build/gyp/test/configurations/inheritance/configurations.gyp
  2031. A build/gyp/test/configurations/inheritance/configurations.c
  2032. A build/gyp/test/configurations/inheritance/gyptest-inheritance.py
  2033. A build/gyp/test/configurations/target_platform
  2034. A build/gyp/test/configurations/target_platform/configurations.gyp
  2035. A build/gyp/test/configurations/target_platform/front.c
  2036. A build/gyp/test/configurations/target_platform/left.c
  2037. A build/gyp/test/configurations/target_platform/right.c
  2038. A build/gyp/test/configurations/target_platform/gyptest-target_platform.py
  2039. A build/gyp/test/custom-generator
  2040. A build/gyp/test/custom-generator/gyptest-custom-generator.py
  2041. A build/gyp/test/custom-generator/mygenerator.py
  2042. A build/gyp/test/custom-generator/test.gyp
  2043. A build/gyp/test/builddir
  2044. A build/gyp/test/builddir/src
  2045. A build/gyp/test/builddir/src/func3.c
  2046. A build/gyp/test/builddir/src/func4.c
  2047. A build/gyp/test/builddir/src/func5.c
  2048. A build/gyp/test/builddir/src/builddir.gypi
  2049. A build/gyp/test/builddir/src/prog1.gyp
  2050. A build/gyp/test/builddir/src/prog1.c
  2051. A build/gyp/test/builddir/src/subdir2
  2052. A build/gyp/test/builddir/src/subdir2/prog2.gyp
  2053. A build/gyp/test/builddir/src/subdir2/prog2.c
  2054. A build/gyp/test/builddir/src/subdir2/subdir3
  2055. A build/gyp/test/builddir/src/subdir2/subdir3/prog3.gyp
  2056. A build/gyp/test/builddir/src/subdir2/subdir3/prog3.c
  2057. A build/gyp/test/builddir/src/subdir2/subdir3/subdir4
  2058. A build/gyp/test/builddir/src/subdir2/subdir3/subdir4/prog4.gyp
  2059. A build/gyp/test/builddir/src/subdir2/subdir3/subdir4/prog4.c
  2060. A build/gyp/test/builddir/src/subdir2/subdir3/subdir4/subdir5
  2061. A build/gyp/test/builddir/src/subdir2/subdir3/subdir4/subdir5/prog5.gyp
  2062. A build/gyp/test/builddir/src/subdir2/subdir3/subdir4/subdir5/prog5.c
  2063. A build/gyp/test/builddir/src/func1.c
  2064. A build/gyp/test/builddir/src/func2.c
  2065. A build/gyp/test/builddir/gyptest-default.py
  2066. A build/gyp/test/builddir/gyptest-all.py
  2067. A build/gyp/test/external-cross-compile
  2068. A build/gyp/test/external-cross-compile/src
  2069. A build/gyp/test/external-cross-compile/src/bogus2.c
  2070. A build/gyp/test/external-cross-compile/src/test2.c
  2071. A build/gyp/test/external-cross-compile/src/test4.c
  2072. A build/gyp/test/external-cross-compile/src/bogus1.cc
  2073. A build/gyp/test/external-cross-compile/src/test1.cc
  2074. A build/gyp/test/external-cross-compile/src/fake_cross.py
  2075. A build/gyp/test/external-cross-compile/src/test3.cc
  2076. A build/gyp/test/external-cross-compile/src/cross.gyp
  2077. A build/gyp/test/external-cross-compile/src/tochar.py
  2078. A build/gyp/test/external-cross-compile/src/cross_compile.gypi
  2079. A build/gyp/test/external-cross-compile/src/program.cc
  2080. A build/gyp/test/external-cross-compile/gyptest-cross.py
  2081. A build/gyp/test/mac
  2082. A build/gyp/test/mac/gyptest-xcode-gcc.py
  2083. A build/gyp/test/mac/gyptest-framework-dirs.py
  2084. A build/gyp/test/mac/gyptest-action-envvars.py
  2085. A build/gyp/test/mac/postbuild-copy-bundle
  2086. A build/gyp/test/mac/postbuild-copy-bundle/empty.c
  2087. A build/gyp/test/mac/postbuild-copy-bundle/Framework-Info.plist
  2088. A build/gyp/test/mac/postbuild-copy-bundle/postbuild-copy-framework.sh
  2089. A build/gyp/test/mac/postbuild-copy-bundle/TestApp-Info.plist
  2090. A build/gyp/test/mac/postbuild-copy-bundle/main.c
  2091. A build/gyp/test/mac/postbuild-copy-bundle/resource_file.sb
  2092. A build/gyp/test/mac/postbuild-copy-bundle/test.gyp
  2093. A build/gyp/test/mac/gyptest-type-envvars.py
  2094. A build/gyp/test/mac/postbuilds
  2095. A build/gyp/test/mac/postbuilds/file.c
  2096. A build/gyp/test/mac/postbuilds/copy.sh
  2097. A build/gyp/test/mac/postbuilds/script
  2098. A build/gyp/test/mac/postbuilds/script/shared_library_postbuild.sh
  2099. A build/gyp/test/mac/postbuilds/script/static_library_postbuild.sh
  2100. A build/gyp/test/mac/postbuilds/file_g.c
  2101. A build/gyp/test/mac/postbuilds/file_h.c
  2102. A build/gyp/test/mac/postbuilds/test.gyp
  2103. A build/gyp/test/mac/postbuilds/subdirectory
  2104. A build/gyp/test/mac/postbuilds/subdirectory/copied_file.txt
  2105. A build/gyp/test/mac/postbuilds/subdirectory/nested_target.gyp
  2106. A build/gyp/test/mac/gyptest-framework-headers.py
  2107. A build/gyp/test/mac/gyptest-installname.py
  2108. A build/gyp/test/mac/framework
  2109. A build/gyp/test/mac/framework/empty.c
  2110. A build/gyp/test/mac/framework/framework.gyp
  2111. A build/gyp/test/mac/framework/TestFramework
  2112. A build/gyp/test/mac/framework/TestFramework/ObjCVectorInternal.h
  2113. A build/gyp/test/mac/framework/TestFramework/TestFramework_Prefix.pch
  2114. A build/gyp/test/mac/framework/TestFramework/Info.plist
  2115. A build/gyp/test/mac/framework/TestFramework/ObjCVector.h
  2116. A build/gyp/test/mac/framework/TestFramework/ObjCVector.mm
  2117. A build/gyp/test/mac/framework/TestFramework/English.lproj
  2118. A build/gyp/test/mac/framework/TestFramework/English.lproj/InfoPlist.strings
  2119. A build/gyp/test/mac/gyptest-postbuild-defaults.py
  2120. A build/gyp/test/mac/action-envvars
  2121. A build/gyp/test/mac/action-envvars/action
  2122. A build/gyp/test/mac/action-envvars/action/action.sh
  2123. A build/gyp/test/mac/action-envvars/action/action.gyp
  2124. A build/gyp/test/mac/gyptest-missing-cfbundlesignature.py
  2125. A build/gyp/test/mac/archs
  2126. A build/gyp/test/mac/archs/test-no-archs.gyp
  2127. A build/gyp/test/mac/archs/test-archs-x86_64.gyp
  2128. A build/gyp/test/mac/archs/my_file.cc
  2129. A build/gyp/test/mac/archs/my_main_file.cc
  2130. A build/gyp/test/mac/gyptest-postbuild-fail.py
  2131. A build/gyp/test/mac/framework-headers
  2132. A build/gyp/test/mac/framework-headers/myframework.h
  2133. A build/gyp/test/mac/framework-headers/test.gyp
  2134. A build/gyp/test/mac/framework-headers/myframework.m
  2135. A build/gyp/test/mac/gyptest-framework.py
  2136. A build/gyp/test/mac/gyptest-global-settings.py
  2137. A build/gyp/test/mac/infoplist-process
  2138. A build/gyp/test/mac/infoplist-process/test2.gyp
  2139. A build/gyp/test/mac/infoplist-process/test3.gyp
  2140. A build/gyp/test/mac/infoplist-process/main.c
  2141. A build/gyp/test/mac/infoplist-process/Info.plist
  2142. A build/gyp/test/mac/infoplist-process/test1.gyp
  2143. A build/gyp/test/mac/gyptest-xcode-env-order.py
  2144. A build/gyp/test/mac/sdkroot
  2145. A build/gyp/test/mac/sdkroot/test_shorthand.sh
  2146. A build/gyp/test/mac/sdkroot/file.cc
  2147. A build/gyp/test/mac/sdkroot/test.gyp
  2148. A build/gyp/test/mac/rebuild
  2149. A build/gyp/test/mac/rebuild/empty.c
  2150. A build/gyp/test/mac/rebuild/TestApp-Info.plist
  2151. A build/gyp/test/mac/rebuild/main.c
  2152. A build/gyp/test/mac/rebuild/delay-touch.sh
  2153. A build/gyp/test/mac/rebuild/test.gyp
  2154. A build/gyp/test/mac/gyptest-postbuild-static-library.gyp
  2155. A build/gyp/test/mac/framework-dirs
  2156. A build/gyp/test/mac/framework-dirs/framework-dirs.gyp
  2157. A build/gyp/test/mac/framework-dirs/calculate.c
  2158. A build/gyp/test/mac/gyptest-copy-dylib.py
  2159. A build/gyp/test/mac/gyptest-libraries.py
  2160. A build/gyp/test/mac/gyptest-postbuild-copy-bundle.py
  2161. A build/gyp/test/mac/gyptest-postbuild-multiple-configurations.py
  2162. A build/gyp/test/mac/missing-cfbundlesignature
  2163. A build/gyp/test/mac/missing-cfbundlesignature/file.c
  2164. A build/gyp/test/mac/missing-cfbundlesignature/Other-Info.plist
  2165. A build/gyp/test/mac/missing-cfbundlesignature/Info.plist
  2166. A build/gyp/test/mac/missing-cfbundlesignature/test.gyp
  2167. A build/gyp/test/mac/missing-cfbundlesignature/Third-Info.plist
  2168. A build/gyp/test/mac/copy-dylib
  2169. A build/gyp/test/mac/copy-dylib/empty.c
  2170. A build/gyp/test/mac/copy-dylib/test.gyp
  2171. A build/gyp/test/mac/ldflags-libtool
  2172. A build/gyp/test/mac/ldflags-libtool/file.c
  2173. A build/gyp/test/mac/ldflags-libtool/test.gyp
  2174. A build/gyp/test/mac/depend-on-bundle
  2175. A build/gyp/test/mac/depend-on-bundle/executable.c
  2176. A build/gyp/test/mac/depend-on-bundle/Info.plist
  2177. A build/gyp/test/mac/depend-on-bundle/bundle.c
  2178. A build/gyp/test/mac/depend-on-bundle/test.gyp
  2179. A build/gyp/test/mac/depend-on-bundle/English.lproj
  2180. A build/gyp/test/mac/depend-on-bundle/English.lproj/InfoPlist.strings
  2181. A build/gyp/test/mac/gyptest-archs.py
  2182. A build/gyp/test/mac/type_envvars
  2183. A build/gyp/test/mac/type_envvars/file.c
  2184. A build/gyp/test/mac/type_envvars/test_bundle_executable.sh
  2185. A build/gyp/test/mac/type_envvars/test_nonbundle_loadable_module.sh
  2186. A build/gyp/test/mac/type_envvars/test_nonbundle_shared_library.sh
  2187. A build/gyp/test/mac/type_envvars/test_nonbundle_static_library.sh
  2188. A build/gyp/test/mac/type_envvars/test_bundle_loadable_module.sh
  2189. A build/gyp/test/mac/type_envvars/test_nonbundle_none.sh
  2190. A build/gyp/test/mac/type_envvars/test_bundle_shared_library.sh
  2191. A build/gyp/test/mac/type_envvars/test.gyp
  2192. A build/gyp/test/mac/type_envvars/test_nonbundle_executable.sh
  2193. A build/gyp/test/mac/loadable-module
  2194. A build/gyp/test/mac/loadable-module/Info.plist
  2195. A build/gyp/test/mac/loadable-module/module.c
  2196. A build/gyp/test/mac/loadable-module/test.gyp
  2197. A build/gyp/test/mac/gyptest-debuginfo.py
  2198. A build/gyp/test/mac/postbuild-multiple-configurations
  2199. A build/gyp/test/mac/postbuild-multiple-configurations/main.c
  2200. A build/gyp/test/mac/postbuild-multiple-configurations/postbuild-touch-file.sh
  2201. A build/gyp/test/mac/postbuild-multiple-configurations/test.gyp
  2202. A build/gyp/test/mac/app-bundle
  2203. A build/gyp/test/mac/app-bundle/empty.c
  2204. A build/gyp/test/mac/app-bundle/TestApp
  2205. A build/gyp/test/mac/app-bundle/TestApp/main.m
  2206. A build/gyp/test/mac/app-bundle/TestApp/TestAppAppDelegate.h
  2207. A build/gyp/test/mac/app-bundle/TestApp/TestApp-Info.plist
  2208. A build/gyp/test/mac/app-bundle/TestApp/TestAppAppDelegate.m
  2209. A build/gyp/test/mac/app-bundle/TestApp/English.lproj
  2210. A build/gyp/test/mac/app-bundle/TestApp/English.lproj/InfoPlist.strings
  2211. A build/gyp/test/mac/app-bundle/TestApp/English.lproj/MainMenu.xib
  2212. A build/gyp/test/mac/app-bundle/test.gyp
  2213. A build/gyp/test/mac/gyptest-objc-gc.py
  2214. A build/gyp/test/mac/gyptest-prefixheader.py
  2215. A build/gyp/test/mac/postbuild-static-library
  2216. A build/gyp/test/mac/postbuild-static-library/empty.c
  2217. A build/gyp/test/mac/postbuild-static-library/postbuild-touch-file.sh
  2218. A build/gyp/test/mac/postbuild-static-library/test.gyp
  2219. A build/gyp/test/mac/xcode-gcc
  2220. A build/gyp/test/mac/xcode-gcc/valid_mm.mm
  2221. A build/gyp/test/mac/xcode-gcc/valid_c.c
  2222. A build/gyp/test/mac/xcode-gcc/valid_m.m
  2223. A build/gyp/test/mac/xcode-gcc/warn_about_invalid_offsetof_macro.cc
  2224. A build/gyp/test/mac/xcode-gcc/valid_cc.cc
  2225. A build/gyp/test/mac/xcode-gcc/warn_about_missing_newline.c
  2226. A build/gyp/test/mac/xcode-gcc/test.gyp
  2227. A build/gyp/test/mac/non-strs-flattened-to-env
  2228. A build/gyp/test/mac/non-strs-flattened-to-env/main.c
  2229. A build/gyp/test/mac/non-strs-flattened-to-env/Info.plist
  2230. A build/gyp/test/mac/non-strs-flattened-to-env/test.gyp
  2231. A build/gyp/test/mac/strip
  2232. A build/gyp/test/mac/strip/file.c
  2233. A build/gyp/test/mac/strip/strip.saves
  2234. A build/gyp/test/mac/strip/test.gyp
  2235. A build/gyp/test/mac/strip/subdirectory
  2236. A build/gyp/test/mac/strip/subdirectory/nested_file.c
  2237. A build/gyp/test/mac/strip/subdirectory/nested_strip.saves
  2238. A build/gyp/test/mac/strip/subdirectory/test_reading_save_file_from_postbuild.sh
  2239. A build/gyp/test/mac/strip/subdirectory/subdirectory.gyp
  2240. A build/gyp/test/mac/xcode-env-order
  2241. A build/gyp/test/mac/xcode-env-order/file.ext1
  2242. A build/gyp/test/mac/xcode-env-order/file.ext2
  2243. A build/gyp/test/mac/xcode-env-order/file.ext3
  2244. A build/gyp/test/mac/xcode-env-order/main.c
  2245. A build/gyp/test/mac/xcode-env-order/Info.plist
  2246. A build/gyp/test/mac/xcode-env-order/test.gyp
  2247. A build/gyp/test/mac/debuginfo
  2248. A build/gyp/test/mac/debuginfo/file.c
  2249. A build/gyp/test/mac/debuginfo/test.gyp
  2250. A build/gyp/test/mac/gyptest-rpath.py
  2251. A build/gyp/test/mac/gyptest-depend-on-bundle.py
  2252. A build/gyp/test/mac/objc-gc
  2253. A build/gyp/test/mac/objc-gc/main.m
  2254. A build/gyp/test/mac/objc-gc/c-file.c
  2255. A build/gyp/test/mac/objc-gc/needs-gc.m
  2256. A build/gyp/test/mac/objc-gc/needs-gc-mm.mm
  2257. A build/gyp/test/mac/objc-gc/cc-file.cc
  2258. A build/gyp/test/mac/objc-gc/test.gyp
  2259. A build/gyp/test/mac/gyptest-sourceless-module.gyp
  2260. A build/gyp/test/mac/gyptest-copies.py
  2261. A build/gyp/test/mac/sourceless-module
  2262. A build/gyp/test/mac/sourceless-module/empty.c
  2263. A build/gyp/test/mac/sourceless-module/test.gyp
  2264. A build/gyp/test/mac/gyptest-rebuild.py
  2265. A build/gyp/test/mac/rpath
  2266. A build/gyp/test/mac/rpath/file.c
  2267. A build/gyp/test/mac/rpath/main.c
  2268. A build/gyp/test/mac/rpath/test.gyp
  2269. A build/gyp/test/mac/gyptest-non-strs-flattened-to-env.py
  2270. A build/gyp/test/mac/gyptest-cflags.py
  2271. A build/gyp/test/mac/gyptest-strip.py
  2272. A build/gyp/test/mac/gyptest-postbuild.py
  2273. A build/gyp/test/mac/global-settings
  2274. A build/gyp/test/mac/global-settings/src
  2275. A build/gyp/test/mac/global-settings/src/dir1
  2276. A build/gyp/test/mac/global-settings/src/dir1/dir1.gyp
  2277. A build/gyp/test/mac/global-settings/src/dir2
  2278. A build/gyp/test/mac/global-settings/src/dir2/file.txt
  2279. A build/gyp/test/mac/global-settings/src/dir2/dir2.gyp
  2280. A build/gyp/test/mac/cflags
  2281. A build/gyp/test/mac/cflags/mmfile.mm
  2282. A build/gyp/test/mac/cflags/cfile.c
  2283. A build/gyp/test/mac/cflags/cxxfile.cxx
  2284. A build/gyp/test/mac/cflags/cppfile.cpp
  2285. A build/gyp/test/mac/cflags/ccfile_withcflags.cc
  2286. A build/gyp/test/mac/cflags/mfile.m
  2287. A build/gyp/test/mac/cflags/ccfile.cc
  2288. A build/gyp/test/mac/cflags/mmfile_withcflags.mm
  2289. A build/gyp/test/mac/cflags/test.gyp
  2290. A build/gyp/test/mac/cflags/cppfile_withcflags.cpp
  2291. A build/gyp/test/mac/cflags/cxxfile_withcflags.cxx
  2292. A build/gyp/test/mac/gyptest-ldflags-passed-to-libtool.py
  2293. A build/gyp/test/mac/gyptest-ldflags.py
  2294. A build/gyp/test/mac/gyptest-app.py
  2295. A build/gyp/test/mac/prefixheader
  2296. A build/gyp/test/mac/prefixheader/file.c
  2297. A build/gyp/test/mac/prefixheader/file.cc
  2298. A build/gyp/test/mac/prefixheader/file.mm
  2299. A build/gyp/test/mac/prefixheader/file.m
  2300. A build/gyp/test/mac/prefixheader/test.gyp
  2301. A build/gyp/test/mac/prefixheader/header.h
  2302. A build/gyp/test/mac/gyptest-infoplist-process.py
  2303. A build/gyp/test/mac/installname
  2304. A build/gyp/test/mac/installname/file.c
  2305. A build/gyp/test/mac/installname/main.c
  2306. A build/gyp/test/mac/installname/Info.plist
  2307. A build/gyp/test/mac/installname/test.gyp
  2308. A build/gyp/test/mac/gyptest-sdkroot.py
  2309. A build/gyp/test/mac/postbuild-defaults
  2310. A build/gyp/test/mac/postbuild-defaults/postbuild-defaults.sh
  2311. A build/gyp/test/mac/postbuild-defaults/main.c
  2312. A build/gyp/test/mac/postbuild-defaults/Info.plist
  2313. A build/gyp/test/mac/postbuild-defaults/test.gyp
  2314. A build/gyp/test/mac/gyptest-loadable-module.py
  2315. A build/gyp/test/mac/ldflags
  2316. A build/gyp/test/mac/ldflags/subdirectory
  2317. A build/gyp/test/mac/ldflags/subdirectory/file.c
  2318. A build/gyp/test/mac/ldflags/subdirectory/Info.plist
  2319. A build/gyp/test/mac/ldflags/subdirectory/symbol_list.def
  2320. A build/gyp/test/mac/ldflags/subdirectory/test.gyp
  2321. A build/gyp/test/mac/libraries
  2322. A build/gyp/test/mac/libraries/subdir
  2323. A build/gyp/test/mac/libraries/subdir/hello.cc
  2324. A build/gyp/test/mac/libraries/subdir/README.txt
  2325. A build/gyp/test/mac/libraries/subdir/mylib.c
  2326. A build/gyp/test/mac/libraries/subdir/test.gyp
  2327. A build/gyp/test/mac/postbuild-fail
  2328. A build/gyp/test/mac/postbuild-fail/file.c
  2329. A build/gyp/test/mac/postbuild-fail/touch-static.sh
  2330. A build/gyp/test/mac/postbuild-fail/postbuild-fail.sh
  2331. A build/gyp/test/mac/postbuild-fail/touch-dynamic.sh
  2332. A build/gyp/test/mac/postbuild-fail/test.gyp
  2333. A build/gyp/test/restat
  2334. A build/gyp/test/restat/gyptest-restat.py
  2335. A build/gyp/test/restat/src
  2336. A build/gyp/test/restat/src/restat.gyp
  2337. A build/gyp/test/restat/src/create_intermediate.py
  2338. A build/gyp/test/restat/src/touch.py
  2339. A build/gyp/test/many-actions
  2340. A build/gyp/test/many-actions/file0
  2341. A build/gyp/test/many-actions/many-actions.gyp
  2342. A build/gyp/test/many-actions/file1
  2343. A build/gyp/test/many-actions/many-actions-unsorted.gyp
  2344. A build/gyp/test/many-actions/file2
  2345. A build/gyp/test/many-actions/file3
  2346. A build/gyp/test/many-actions/file4
  2347. A build/gyp/test/many-actions/gyptest-many-actions.py
  2348. A build/gyp/test/many-actions/gyptest-many-actions-unsorted.py
  2349. A build/gyp/test/scons_tools
  2350. A build/gyp/test/scons_tools/tools.c
  2351. A build/gyp/test/scons_tools/gyptest-tools.py
  2352. A build/gyp/test/scons_tools/site_scons
  2353. A build/gyp/test/scons_tools/site_scons/site_tools
  2354. A build/gyp/test/scons_tools/site_scons/site_tools/this_tool.py
  2355. A build/gyp/test/scons_tools/tools.gyp
  2356. A build/gyp/test/toplevel-dir
  2357. A build/gyp/test/toplevel-dir/src
  2358. A build/gyp/test/toplevel-dir/src/sub1
  2359. A build/gyp/test/toplevel-dir/src/sub1/main.gyp
  2360. A build/gyp/test/toplevel-dir/src/sub1/prog1.c
  2361. A build/gyp/test/toplevel-dir/src/sub2
  2362. A build/gyp/test/toplevel-dir/src/sub2/prog2.gyp
  2363. A build/gyp/test/toplevel-dir/src/sub2/prog2.c
  2364. A build/gyp/test/toplevel-dir/gyptest-toplevel-dir.py
  2365. A build/gyp/test/actions-bare
  2366. A build/gyp/test/actions-bare/src
  2367. A build/gyp/test/actions-bare/src/bare.py
  2368. A build/gyp/test/actions-bare/src/bare.gyp
  2369. A build/gyp/test/actions-bare/gyptest-bare.py
  2370. A build/gyp/test/variables
  2371. A build/gyp/test/variables/commands
  2372. A build/gyp/test/variables/commands/commands.gyp
  2373. A build/gyp/test/variables/commands/commands.gyp.stdout
  2374. A build/gyp/test/variables/commands/commands-repeated.gypd.golden
  2375. A build/gyp/test/variables/commands/gyptest-commands.py
  2376. A build/gyp/test/variables/commands/commands-repeated.gyp
  2377. A build/gyp/test/variables/commands/test.py
  2378. A build/gyp/test/variables/commands/commands-repeated.gyp.stdout
  2379. A build/gyp/test/variables/commands/commands.gyp.ignore-env.stdout
  2380. A build/gyp/test/variables/commands/commands.gypi
  2381. A build/gyp/test/variables/commands/update_golden
  2382. A build/gyp/test/variables/commands/commands.gypd.golden
  2383. A build/gyp/test/variables/commands/gyptest-commands-repeated.py
  2384. A build/gyp/test/variables/commands/gyptest-commands-ignore-env.py
  2385. A build/gyp/test/variables/variable-in-path
  2386. A build/gyp/test/variables/variable-in-path/variable-in-path.gyp
  2387. A build/gyp/test/variables/variable-in-path/C1
  2388. A build/gyp/test/variables/variable-in-path/C1/hello.cc
  2389. A build/gyp/test/variables/variable-in-path/gyptest-variable-in-path.py
  2390. A build/gyp/test/variables/latelate
  2391. A build/gyp/test/variables/latelate/gyptest-latelate.py
  2392. A build/gyp/test/variables/latelate/src
  2393. A build/gyp/test/variables/latelate/src/latelate.gyp
  2394. A build/gyp/test/variables/latelate/src/program.cc
  2395. A build/gyp/test/variables/filelist
  2396. A build/gyp/test/variables/filelist/gyptest-filelist.py
  2397. A build/gyp/test/variables/filelist/filelist.gypd.golden
  2398. A build/gyp/test/variables/filelist/src
  2399. A build/gyp/test/variables/filelist/src/filelist.gyp
  2400. A build/gyp/test/variables/filelist/update_golden
  2401. A build/gyp/test/variables/filelist/filelist.gyp.stdout
  2402. A build/gyp/test/no-output
  2403. A build/gyp/test/no-output/src
  2404. A build/gyp/test/no-output/src/nooutput.gyp
  2405. A build/gyp/test/no-output/gyptest-no-output.py
  2406. A build/gyp/test/make
  2407. A build/gyp/test/make/gyptest-noload.py
  2408. A build/gyp/test/make/dependencies.gyp
  2409. A build/gyp/test/make/main.cc
  2410. A build/gyp/test/make/gyptest-dependencies.py
  2411. A build/gyp/test/make/main.h
  2412. A build/gyp/test/make/noload
  2413. A build/gyp/test/make/noload/main.c
  2414. A build/gyp/test/make/noload/all.gyp
  2415. A build/gyp/test/make/noload/lib
  2416. A build/gyp/test/make/noload/lib/shared.gyp
  2417. A build/gyp/test/make/noload/lib/shared.c
  2418. A build/gyp/test/make/noload/lib/shared.h
  2419. A build/gyp/test/cxxflags
  2420. A build/gyp/test/cxxflags/cxxflags.cc
  2421. A build/gyp/test/cxxflags/gyptest-cxxflags.py
  2422. A build/gyp/test/cxxflags/cxxflags.gyp
  2423. A build/gyp/test/same-rule-output-file-name
  2424. A build/gyp/test/same-rule-output-file-name/src
  2425. A build/gyp/test/same-rule-output-file-name/src/subdirs.gyp
  2426. A build/gyp/test/same-rule-output-file-name/src/subdir1
  2427. A build/gyp/test/same-rule-output-file-name/src/subdir1/subdir1.gyp
  2428. A build/gyp/test/same-rule-output-file-name/src/touch.py
  2429. A build/gyp/test/same-rule-output-file-name/src/subdir2
  2430. A build/gyp/test/same-rule-output-file-name/src/subdir2/subdir2.gyp
  2431. A build/gyp/test/same-rule-output-file-name/gyptest-all.py
  2432. A build/gyp/test/same-target-name
  2433. A build/gyp/test/same-target-name/src
  2434. A build/gyp/test/same-target-name/src/executable1.gyp
  2435. A build/gyp/test/same-target-name/src/executable2.gyp
  2436. A build/gyp/test/same-target-name/src/all.gyp
  2437. A build/gyp/test/same-target-name/gyptest-same-target-name.py
  2438. A build/gyp/test/msvs
  2439. A build/gyp/test/msvs/uldi2010
  2440. A build/gyp/test/msvs/uldi2010/hello.gyp
  2441. A build/gyp/test/msvs/uldi2010/hello.c
  2442. A build/gyp/test/msvs/uldi2010/hello2.c
  2443. A build/gyp/test/msvs/uldi2010/gyptest-all.py
  2444. A build/gyp/test/msvs/config_attrs
  2445. A build/gyp/test/msvs/config_attrs/hello.gyp
  2446. A build/gyp/test/msvs/config_attrs/hello.c
  2447. A build/gyp/test/msvs/config_attrs/gyptest-config_attrs.py
  2448. A build/gyp/test/msvs/precompiled
  2449. A build/gyp/test/msvs/props
  2450. A build/gyp/test/msvs/props/hello.gyp
  2451. A build/gyp/test/msvs/props/AppName.props
  2452. A build/gyp/test/msvs/props/hello.c
  2453. A build/gyp/test/msvs/props/gyptest-props.py
  2454. A build/gyp/test/msvs/props/AppName.vsprops
  2455. A build/gyp/test/msvs/shared_output
  2456. A build/gyp/test/msvs/shared_output/common.gypi
  2457. A build/gyp/test/msvs/shared_output/hello.gyp
  2458. A build/gyp/test/msvs/shared_output/hello.c
  2459. A build/gyp/test/msvs/shared_output/there
  2460. A build/gyp/test/msvs/shared_output/there/there.gyp
  2461. A build/gyp/test/msvs/shared_output/there/there.c
  2462. A build/gyp/test/msvs/shared_output/gyptest-shared_output.py
  2463. A build/gyp/test/msvs/list_excluded
  2464. A build/gyp/test/msvs/list_excluded/hello.cpp
  2465. A build/gyp/test/msvs/list_excluded/hello_mac.cpp
  2466. A build/gyp/test/msvs/list_excluded/hello_exclude.gyp
  2467. A build/gyp/test/msvs/list_excluded/gyptest-all.py
  2468. A build/gyp/test/msvs/express
  2469. A build/gyp/test/msvs/express/express.gyp
  2470. A build/gyp/test/msvs/express/base
  2471. A build/gyp/test/msvs/express/base/base.gyp
  2472. A build/gyp/test/msvs/express/gyptest-express.py
  2473. A build/gyp/test/msvs/missing_sources
  2474. A build/gyp/test/msvs/missing_sources/hello_missing.gyp
  2475. A build/gyp/test/msvs/missing_sources/gyptest-missing.py
  2476. A build/gyp/test/actions-multiple
  2477. A build/gyp/test/actions-multiple/src
  2478. A build/gyp/test/actions-multiple/src/copy.py
  2479. A build/gyp/test/actions-multiple/src/foo.c
  2480. A build/gyp/test/actions-multiple/src/main.c
  2481. A build/gyp/test/actions-multiple/src/filter.py
  2482. A build/gyp/test/actions-multiple/src/input.txt
  2483. A build/gyp/test/actions-multiple/src/actions.gyp
  2484. A build/gyp/test/actions-multiple/gyptest-all.py
  2485. A build/gyp/test/rules
  2486. A build/gyp/test/rules/gyptest-input-root.py
  2487. A build/gyp/test/rules/src
  2488. A build/gyp/test/rules/src/an_asm.S
  2489. A build/gyp/test/rules/src/somefile.ext
  2490. A build/gyp/test/rules/src/external
  2491. A build/gyp/test/rules/src/external/external.gyp
  2492. A build/gyp/test/rules/src/external/file1.in
  2493. A build/gyp/test/rules/src/external/file2.in
  2494. A build/gyp/test/rules/src/special-variables.gyp
  2495. A build/gyp/test/rules/src/as.bat
  2496. A build/gyp/test/rules/src/subdir1
  2497. A build/gyp/test/rules/src/subdir1/executable.gyp
  2498. A build/gyp/test/rules/src/subdir1/program.c
  2499. A build/gyp/test/rules/src/subdir1/function1.in
  2500. A build/gyp/test/rules/src/subdir1/function2.in
  2501. A build/gyp/test/rules/src/noaction
  2502. A build/gyp/test/rules/src/noaction/file1.in
  2503. A build/gyp/test/rules/src/noaction/no_action_with_rules_fails.gyp
  2504. A build/gyp/test/rules/src/subdir2
  2505. A build/gyp/test/rules/src/subdir2/file1.in
  2506. A build/gyp/test/rules/src/subdir2/file2.in
  2507. A build/gyp/test/rules/src/subdir2/no_action.gyp
  2508. A build/gyp/test/rules/src/subdir2/no_inputs.gyp
  2509. A build/gyp/test/rules/src/subdir2/never_used.gyp
  2510. A build/gyp/test/rules/src/subdir2/none.gyp
  2511. A build/gyp/test/rules/src/subdir3
  2512. A build/gyp/test/rules/src/subdir3/executable2.gyp
  2513. A build/gyp/test/rules/src/subdir3/program.c
  2514. A build/gyp/test/rules/src/subdir3/function3.in
  2515. A build/gyp/test/rules/src/subdir4
  2516. A build/gyp/test/rules/src/subdir4/asm-function.asm
  2517. A build/gyp/test/rules/src/subdir4/program.c
  2518. A build/gyp/test/rules/src/subdir4/build-asm.gyp
  2519. A build/gyp/test/rules/src/input-root.gyp
  2520. A build/gyp/test/rules/src/actions.gyp
  2521. A build/gyp/test/rules/src/copy-file.py
  2522. A build/gyp/test/rules/src/rule.py
  2523. A build/gyp/test/rules/gyptest-default.py
  2524. A build/gyp/test/rules/gyptest-special-variables.py
  2525. A build/gyp/test/rules/gyptest-all.py
  2526. A build/gyp/test/win
  2527. A build/gyp/test/win/gyptest-link-outputfile.py
  2528. A build/gyp/test/win/gyptest-link-opt-icf.py
  2529. A build/gyp/test/win/gyptest-link-additional-options.py
  2530. A build/gyp/test/win/gyptest-link-additional-deps.py
  2531. A build/gyp/test/win/gyptest-link-entrypointsymbol.py
  2532. A build/gyp/test/win/asm-files
  2533. A build/gyp/test/win/asm-files/b.s
  2534. A build/gyp/test/win/asm-files/c.S
  2535. A build/gyp/test/win/asm-files/hello.cc
  2536. A build/gyp/test/win/asm-files/asm-files.gyp
  2537. A build/gyp/test/win/gyptest-cl-additional-options.py
  2538. A build/gyp/test/win/gyptest-rc-build.py
  2539. A build/gyp/test/win/gyptest-link-fixed-base.py
  2540. A build/gyp/test/win/gyptest-cl-pdbname.py
  2541. A build/gyp/test/win/gyptest-link-delay-load-dlls.py
  2542. A build/gyp/test/win/gyptest-cl-optimizations.py
  2543. A build/gyp/test/win/gyptest-macro-projectname.py
  2544. A build/gyp/test/win/gyptest-cl-warning-level.py
  2545. A build/gyp/test/win/gyptest-macros-containing-gyp.py
  2546. A build/gyp/test/win/gyptest-link-library-directories.py
  2547. A build/gyp/test/win/gyptest-command-quote.py
  2548. A build/gyp/test/win/uldi
  2549. A build/gyp/test/win/uldi/a.cc
  2550. A build/gyp/test/win/uldi/b.cc
  2551. A build/gyp/test/win/uldi/main.cc
  2552. A build/gyp/test/win/uldi/uldi.gyp
  2553. A build/gyp/test/win/gyptest-cl-exception-handling.py
  2554. A build/gyp/test/win/rc-build
  2555. A build/gyp/test/win/rc-build/hello.gyp
  2556. A build/gyp/test/win/rc-build/small.ico
  2557. A build/gyp/test/win/rc-build/hello.cpp
  2558. A build/gyp/test/win/rc-build/hello.rc
  2559. A build/gyp/test/win/rc-build/subdir
  2560. A build/gyp/test/win/rc-build/subdir/hello2.rc
  2561. A build/gyp/test/win/rc-build/subdir/include.h
  2562. A build/gyp/test/win/rc-build/targetver.h
  2563. A build/gyp/test/win/rc-build/hello.h
  2564. A build/gyp/test/win/rc-build/hello.ico
  2565. A build/gyp/test/win/rc-build/Resource.h
  2566. A build/gyp/test/win/gyptest-cl-runtime-checks.py
  2567. A build/gyp/test/win/precompiled
  2568. A build/gyp/test/win/precompiled/hello.gyp
  2569. A build/gyp/test/win/precompiled/hello.c
  2570. A build/gyp/test/win/precompiled/precomp.c
  2571. A build/gyp/test/win/precompiled/hello2.c
  2572. A build/gyp/test/win/precompiled/gyptest-all.py
  2573. A build/gyp/test/win/compiler-flags
  2574. A build/gyp/test/win/compiler-flags/warning-level2.cc
  2575. A build/gyp/test/win/compiler-flags/rtti-on.cc
  2576. A build/gyp/test/win/compiler-flags/function-level-linking.gyp
  2577. A build/gyp/test/win/compiler-flags/warning-level4.cc
  2578. A build/gyp/test/win/compiler-flags/character-set.gyp
  2579. A build/gyp/test/win/compiler-flags/runtime-library.gyp
  2580. A build/gyp/test/win/compiler-flags/additional-options.cc
  2581. A build/gyp/test/win/compiler-flags/hello.cc
  2582. A build/gyp/test/win/compiler-flags/buffer-security-check.gyp
  2583. A build/gyp/test/win/compiler-flags/subdir
  2584. A build/gyp/test/win/compiler-flags/subdir/header.h
  2585. A build/gyp/test/win/compiler-flags/character-set-mbcs.cc
  2586. A build/gyp/test/win/compiler-flags/runtime-library-mtd.cc
  2587. A build/gyp/test/win/compiler-flags/character-set-unicode.cc
  2588. A build/gyp/test/win/compiler-flags/additional-options.gyp
  2589. A build/gyp/test/win/compiler-flags/pdbname.gyp
  2590. A build/gyp/test/win/compiler-flags/runtime-checks.cc
  2591. A build/gyp/test/win/compiler-flags/runtime-library-md.cc
  2592. A build/gyp/test/win/compiler-flags/warning-level.gyp
  2593. A build/gyp/test/win/compiler-flags/debug-format.gyp
  2594. A build/gyp/test/win/compiler-flags/exception-handling-on.cc
  2595. A build/gyp/test/win/compiler-flags/runtime-checks.gyp
  2596. A build/gyp/test/win/compiler-flags/warning-level1.cc
  2597. A build/gyp/test/win/compiler-flags/rtti.gyp
  2598. A build/gyp/test/win/compiler-flags/warning-as-error.cc
  2599. A build/gyp/test/win/compiler-flags/warning-level3.cc
  2600. A build/gyp/test/win/compiler-flags/additional-include-dirs.gyp
  2601. A build/gyp/test/win/compiler-flags/runtime-library-mt.cc
  2602. A build/gyp/test/win/compiler-flags/pdbname.cc
  2603. A build/gyp/test/win/compiler-flags/warning-as-error.gyp
  2604. A build/gyp/test/win/compiler-flags/buffer-security.cc
  2605. A build/gyp/test/win/compiler-flags/optimizations.gyp
  2606. A build/gyp/test/win/compiler-flags/function-level-linking.cc
  2607. A build/gyp/test/win/compiler-flags/runtime-library-mdd.cc
  2608. A build/gyp/test/win/compiler-flags/additional-include-dirs.cc
  2609. A build/gyp/test/win/compiler-flags/exception-handling.gyp
  2610. A build/gyp/test/win/gyptest-cl-character-set.py
  2611. A build/gyp/test/win/gyptest-cl-runtime-library.py
  2612. A build/gyp/test/win/gyptest-cl-additional-include-dirs.py
  2613. A build/gyp/test/win/gyptest-link-nxcompat.py
  2614. A build/gyp/test/win/gyptest-quoting-commands.py
  2615. A build/gyp/test/win/batch-file-action
  2616. A build/gyp/test/win/batch-file-action/infile
  2617. A build/gyp/test/win/batch-file-action/batch-file-action.gyp
  2618. A build/gyp/test/win/batch-file-action/somecmd.bat
  2619. A build/gyp/test/win/gyptest-cl-buffer-security-check.py
  2620. A build/gyp/test/win/vs-macros
  2621. A build/gyp/test/win/vs-macros/input.S
  2622. A build/gyp/test/win/vs-macros/do_stuff.py
  2623. A build/gyp/test/win/vs-macros/containing-gyp.gyp
  2624. A build/gyp/test/win/vs-macros/projectname.gyp
  2625. A build/gyp/test/win/vs-macros/test_exists.py
  2626. A build/gyp/test/win/vs-macros/hello.cc
  2627. A build/gyp/test/win/vs-macros/as.py
  2628. A build/gyp/test/win/vs-macros/vcinstalldir.gyp
  2629. A build/gyp/test/win/vs-macros/stuff.blah
  2630. A build/gyp/test/win/vs-macros/input-output-macros.gyp
  2631. A build/gyp/test/win/gyptest-link-library-adjust.py
  2632. A build/gyp/test/win/gyptest-link-uldi.py
  2633. A build/gyp/test/win/gyptest-link-deffile.py
  2634. A build/gyp/test/win/gyptest-link-subsystem.py
  2635. A build/gyp/test/win/gyptest-cl-warning-as-error.py
  2636. A build/gyp/test/win/linker-flags
  2637. A build/gyp/test/win/linker-flags/deffile-multiple.gyp
  2638. A build/gyp/test/win/linker-flags/additional-deps.cc
  2639. A build/gyp/test/win/linker-flags/opt-icf.cc
  2640. A build/gyp/test/win/linker-flags/entrypointsymbol.cc
  2641. A build/gyp/test/win/linker-flags/hello.cc
  2642. A build/gyp/test/win/linker-flags/subdir
  2643. A build/gyp/test/win/linker-flags/subdir/library.gyp
  2644. A build/gyp/test/win/linker-flags/library-adjust.gyp
  2645. A build/gyp/test/win/linker-flags/library-directories-define.cc
  2646. A build/gyp/test/win/linker-flags/subsystem.gyp
  2647. A build/gyp/test/win/linker-flags/deffile.gyp
  2648. A build/gyp/test/win/linker-flags/library-directories-reference.cc
  2649. A build/gyp/test/win/linker-flags/entrypointsymbol.gyp
  2650. A build/gyp/test/win/linker-flags/additional-deps.gyp
  2651. A build/gyp/test/win/linker-flags/opt-icf.gyp
  2652. A build/gyp/test/win/linker-flags/additional-options.gyp
  2653. A build/gyp/test/win/linker-flags/fixed-base.gyp
  2654. A build/gyp/test/win/linker-flags/delay-load-dlls.gyp
  2655. A build/gyp/test/win/linker-flags/nodefaultlib.gyp
  2656. A build/gyp/test/win/linker-flags/extra2.manifest
  2657. A build/gyp/test/win/linker-flags/opt-ref.gyp
  2658. A build/gyp/test/win/linker-flags/library-adjust.cc
  2659. A build/gyp/test/win/linker-flags/deffile.cc
  2660. A build/gyp/test/win/linker-flags/nxcompat.gyp
  2661. A build/gyp/test/win/linker-flags/extra.manifest
  2662. A build/gyp/test/win/linker-flags/deffile.def
  2663. A build/gyp/test/win/linker-flags/generate-manifest.gyp
  2664. A build/gyp/test/win/linker-flags/nodefaultlib.cc
  2665. A build/gyp/test/win/linker-flags/outputfile.gyp
  2666. A build/gyp/test/win/linker-flags/incremental.gyp
  2667. A build/gyp/test/win/linker-flags/delay-load.cc
  2668. A build/gyp/test/win/linker-flags/default-libs.cc
  2669. A build/gyp/test/win/linker-flags/aslr.gyp
  2670. A build/gyp/test/win/linker-flags/opt-ref.cc
  2671. A build/gyp/test/win/linker-flags/default-libs.gyp
  2672. A build/gyp/test/win/linker-flags/subsystem-windows.cc
  2673. A build/gyp/test/win/linker-flags/library-directories.gyp
  2674. A build/gyp/test/win/linker-flags/debug-info.gyp
  2675. A build/gyp/test/win/gyptest-link-restat-importlib.py
  2676. A build/gyp/test/win/gyptest-link-incremental.py
  2677. A build/gyp/test/win/gyptest-link-aslr.py
  2678. A build/gyp/test/win/gyptest-macro-vcinstalldir.py
  2679. A build/gyp/test/win/gyptest-long-command-line.py
  2680. A build/gyp/test/win/gyptest-link-nodefaultlib.py
  2681. A build/gyp/test/win/gyptest-link-default-libs.py
  2682. A build/gyp/test/win/gyptest-link-opt-ref.py
  2683. A build/gyp/test/win/gyptest-cl-debug-format.py
  2684. A build/gyp/test/win/gyptest-link-debug-info.py
  2685. A build/gyp/test/win/long-command-line
  2686. A build/gyp/test/win/long-command-line/hello.cc
  2687. A build/gyp/test/win/long-command-line/function.cc
  2688. A build/gyp/test/win/long-command-line/long-command-line.gyp
  2689. A build/gyp/test/win/idl-rules
  2690. A build/gyp/test/win/idl-rules/history_indexer_user.cc
  2691. A build/gyp/test/win/idl-rules/basic-idl.gyp
  2692. A build/gyp/test/win/idl-rules/history_indexer.idl
  2693. A build/gyp/test/win/importlib
  2694. A build/gyp/test/win/importlib/importlib.gyp
  2695. A build/gyp/test/win/importlib/has-exports.cc
  2696. A build/gyp/test/win/importlib/hello.cc
  2697. A build/gyp/test/win/gyptest-midl-rules.py
  2698. A build/gyp/test/win/gyptest-cl-rtti.py
  2699. A build/gyp/test/win/gyptest-cl-function-level-linking.py
  2700. A build/gyp/test/win/gyptest-asm-files.py
  2701. A build/gyp/test/win/command-quote
  2702. A build/gyp/test/win/command-quote/a.S
  2703. A build/gyp/test/win/command-quote/bat with spaces.bat
  2704. A build/gyp/test/win/command-quote/command-quote.gyp
  2705. A build/gyp/test/win/command-quote/subdir
  2706. A build/gyp/test/win/command-quote/subdir/and
  2707. A build/gyp/test/win/command-quote/subdir/and/another
  2708. A build/gyp/test/win/command-quote/subdir/and/another/in-subdir.gyp
  2709. A build/gyp/test/win/command-quote/go.bat
  2710. A build/gyp/test/win/gyptest-macros-in-inputs-and-outputs.py
  2711. A build/gyp/test/win/gyptest-link-generate-manifest.py
  2712. A build/gyp/test/actions-none
  2713. A build/gyp/test/actions-none/gyptest-none.py
  2714. A build/gyp/test/actions-none/src
  2715. A build/gyp/test/actions-none/src/fake_cross.py
  2716. A build/gyp/test/actions-none/src/foo.cc
  2717. A build/gyp/test/actions-none/src/none_with_source_files.gyp
  2718. A build/gyp/test/same-target-name-different-directory
  2719. A build/gyp/test/same-target-name-different-directory/src
  2720. A build/gyp/test/same-target-name-different-directory/src/subdirs.gyp
  2721. A build/gyp/test/same-target-name-different-directory/src/subdir1
  2722. A build/gyp/test/same-target-name-different-directory/src/subdir1/subdir1.gyp
  2723. A build/gyp/test/same-target-name-different-directory/src/touch.py
  2724. A build/gyp/test/same-target-name-different-directory/src/subdir2
  2725. A build/gyp/test/same-target-name-different-directory/src/subdir2/subdir2.gyp
  2726. A build/gyp/test/same-target-name-different-directory/gyptest-all.py
  2727. A build/gyp/test/ninja
  2728. A build/gyp/test/ninja/solibs_avoid_relinking
  2729. A build/gyp/test/ninja/solibs_avoid_relinking/gyptest-solibs-avoid-relinking.py
  2730. A build/gyp/test/ninja/solibs_avoid_relinking/main.cc
  2731. A build/gyp/test/ninja/solibs_avoid_relinking/solib.cc
  2732. A build/gyp/test/ninja/solibs_avoid_relinking/solibs_avoid_relinking.gyp
  2733. A build/gyp/test/ninja/action_dependencies
  2734. A build/gyp/test/ninja/action_dependencies/gyptest-action-dependencies.py
  2735. A build/gyp/test/ninja/action_dependencies/src
  2736. A build/gyp/test/ninja/action_dependencies/src/action_dependencies.gyp
  2737. A build/gyp/test/ninja/action_dependencies/src/a.c
  2738. A build/gyp/test/ninja/action_dependencies/src/b.c
  2739. A build/gyp/test/ninja/action_dependencies/src/c.c
  2740. A build/gyp/test/ninja/action_dependencies/src/emit.py
  2741. A build/gyp/test/ninja/action_dependencies/src/a.h
  2742. A build/gyp/test/ninja/action_dependencies/src/b.h
  2743. A build/gyp/test/ninja/action_dependencies/src/c.h
  2744. A build/gyp/test/ninja/chained-dependency
  2745. A build/gyp/test/ninja/chained-dependency/chained-dependency.gyp
  2746. A build/gyp/test/ninja/chained-dependency/gyptest-chained-dependency.py
  2747. A build/gyp/test/ninja/chained-dependency/chained.c
  2748. A build/gyp/test/ninja/normalize-paths-win
  2749. A build/gyp/test/ninja/normalize-paths-win/gyptest-normalize-paths.py
  2750. A build/gyp/test/ninja/normalize-paths-win/hello.cc
  2751. A build/gyp/test/ninja/normalize-paths-win/normalize-paths.gyp
  2752. A build/gyp/test/same-gyp-name
  2753. A build/gyp/test/same-gyp-name/src
  2754. A build/gyp/test/same-gyp-name/src/all.gyp
  2755. A build/gyp/test/same-gyp-name/src/subdir1
  2756. A build/gyp/test/same-gyp-name/src/subdir1/executable.gyp
  2757. A build/gyp/test/same-gyp-name/src/subdir1/main1.cc
  2758. A build/gyp/test/same-gyp-name/src/subdir2
  2759. A build/gyp/test/same-gyp-name/src/subdir2/executable.gyp
  2760. A build/gyp/test/same-gyp-name/src/subdir2/main2.cc
  2761. A build/gyp/test/same-gyp-name/gyptest-default.py
  2762. A build/gyp/test/same-gyp-name/gyptest-all.py
  2763. A build/gyp/test/include_dirs
  2764. A build/gyp/test/include_dirs/src
  2765. A build/gyp/test/include_dirs/src/inc.h
  2766. A build/gyp/test/include_dirs/src/includes.gyp
  2767. A build/gyp/test/include_dirs/src/shadow1
  2768. A build/gyp/test/include_dirs/src/shadow1/shadow.h
  2769. A build/gyp/test/include_dirs/src/shadow2
  2770. A build/gyp/test/include_dirs/src/shadow2/shadow.h
  2771. A build/gyp/test/include_dirs/src/includes.c
  2772. A build/gyp/test/include_dirs/src/subdir
  2773. A build/gyp/test/include_dirs/src/subdir/inc.h
  2774. A build/gyp/test/include_dirs/src/subdir/subdir_includes.c
  2775. A build/gyp/test/include_dirs/src/subdir/inc2
  2776. A build/gyp/test/include_dirs/src/subdir/inc2/include2.h
  2777. A build/gyp/test/include_dirs/src/subdir/subdir_includes.gyp
  2778. A build/gyp/test/include_dirs/src/inc1
  2779. A build/gyp/test/include_dirs/src/inc1/include1.h
  2780. A build/gyp/test/include_dirs/gyptest-default.py
  2781. A build/gyp/test/include_dirs/gyptest-all.py
  2782. A build/gyp/test/defines-escaping
  2783. A build/gyp/test/defines-escaping/defines-escaping.gyp
  2784. A build/gyp/test/defines-escaping/defines-escaping.c
  2785. A build/gyp/test/defines-escaping/gyptest-defines-escaping.py
  2786. A build/gyp/test/build-option
  2787. A build/gyp/test/build-option/hello.gyp
  2788. A build/gyp/test/build-option/gyptest-build.py
  2789. A build/gyp/test/build-option/hello.c
  2790. A build/gyp/test/small
  2791. A build/gyp/test/small/gyptest-small.py
  2792. A build/gyp/test/gyp-defines
  2793. A build/gyp/test/gyp-defines/echo.py
  2794. A build/gyp/test/gyp-defines/gyptest-regyp.py
  2795. A build/gyp/test/gyp-defines/defines.gyp
  2796. A build/gyp/test/gyp-defines/gyptest-multiple-values.py
  2797. A build/gyp/test/hard_dependency
  2798. A build/gyp/test/hard_dependency/gyptest-no-exported-hard-dependency.py
  2799. A build/gyp/test/hard_dependency/gyptest-exported-hard-dependency.py
  2800. A build/gyp/test/hard_dependency/src
  2801. A build/gyp/test/hard_dependency/src/a.c
  2802. A build/gyp/test/hard_dependency/src/b.c
  2803. A build/gyp/test/hard_dependency/src/c.c
  2804. A build/gyp/test/hard_dependency/src/d.c
  2805. A build/gyp/test/hard_dependency/src/emit.py
  2806. A build/gyp/test/hard_dependency/src/a.h
  2807. A build/gyp/test/hard_dependency/src/b.h
  2808. A build/gyp/test/hard_dependency/src/c.h
  2809. A build/gyp/test/hard_dependency/src/hard_dependency.gyp
  2810. A build/gyp/test/subdirectory
  2811. A build/gyp/test/subdirectory/gyptest-SYMROOT-default.py
  2812. A build/gyp/test/subdirectory/gyptest-subdir-all.py
  2813. A build/gyp/test/subdirectory/gyptest-SYMROOT-all.py
  2814. A build/gyp/test/subdirectory/src
  2815. A build/gyp/test/subdirectory/src/symroot.gypi
  2816. A build/gyp/test/subdirectory/src/prog1.gyp
  2817. A build/gyp/test/subdirectory/src/subdir
  2818. A build/gyp/test/subdirectory/src/subdir/prog2.gyp
  2819. A build/gyp/test/subdirectory/src/subdir/prog2.c
  2820. A build/gyp/test/subdirectory/src/subdir/subdir2
  2821. A build/gyp/test/subdirectory/src/subdir/subdir2/prog3.gyp
  2822. A build/gyp/test/subdirectory/src/subdir/subdir2/prog3.c
  2823. A build/gyp/test/subdirectory/src/prog1.c
  2824. A build/gyp/test/subdirectory/gyptest-top-default.py
  2825. A build/gyp/test/subdirectory/gyptest-subdir2-deep.py
  2826. A build/gyp/test/subdirectory/gyptest-top-all.py
  2827. A build/gyp/test/subdirectory/gyptest-subdir-default.py
  2828. A build/gyp/test/assembly
  2829. A build/gyp/test/assembly/gyptest-assembly.py
  2830. A build/gyp/test/assembly/src
  2831. A build/gyp/test/assembly/src/program.c
  2832. A build/gyp/test/assembly/src/lib1.c
  2833. A build/gyp/test/assembly/src/lib1.S
  2834. A build/gyp/test/assembly/src/as.bat
  2835. A build/gyp/test/assembly/src/assembly.gyp
  2836. A build/gyp/test/additional-targets
  2837. A build/gyp/test/additional-targets/src
  2838. A build/gyp/test/additional-targets/src/dir1
  2839. A build/gyp/test/additional-targets/src/dir1/emit.py
  2840. A build/gyp/test/additional-targets/src/dir1/lib1.c
  2841. A build/gyp/test/additional-targets/src/dir1/actions.gyp
  2842. A build/gyp/test/additional-targets/src/all.gyp
  2843. A build/gyp/test/additional-targets/gyptest-additional.py
  2844. A build/gyp/test/copies
  2845. A build/gyp/test/copies/gyptest-updir.py
  2846. A build/gyp/test/copies/src
  2847. A build/gyp/test/copies/src/copies.gyp
  2848. A build/gyp/test/copies/src/file1
  2849. A build/gyp/test/copies/src/copies-updir.gyp
  2850. A build/gyp/test/copies/src/file2
  2851. A build/gyp/test/copies/src/directory
  2852. A build/gyp/test/copies/src/directory/file3
  2853. A build/gyp/test/copies/src/directory/file4
  2854. A build/gyp/test/copies/src/directory/subdir
  2855. A build/gyp/test/copies/src/directory/subdir/file5
  2856. A build/gyp/test/copies/src/copies-slash.gyp
  2857. A build/gyp/test/copies/src/parentdir
  2858. A build/gyp/test/copies/src/parentdir/subdir
  2859. A build/gyp/test/copies/src/parentdir/subdir/file6
  2860. A build/gyp/test/copies/gyptest-default.py
  2861. A build/gyp/test/copies/gyptest-all.py
  2862. A build/gyp/test/copies/gyptest-slash.py
  2863. A build/gyp/test/link-objects
  2864. A build/gyp/test/link-objects/link-objects.gyp
  2865. A build/gyp/test/link-objects/extra.c
  2866. A build/gyp/test/link-objects/base.c
  2867. A build/gyp/test/link-objects/gyptest-all.py
  2868. A build/gyp/test/generator-output
  2869. A build/gyp/test/generator-output/actions
  2870. A build/gyp/test/generator-output/actions/build
  2871. A build/gyp/test/generator-output/actions/build/README.txt
  2872. A build/gyp/test/generator-output/actions/subdir1
  2873. A build/gyp/test/generator-output/actions/subdir1/build
  2874. A build/gyp/test/generator-output/actions/subdir1/build/README.txt
  2875. A build/gyp/test/generator-output/actions/subdir1/executable.gyp
  2876. A build/gyp/test/generator-output/actions/subdir1/actions-out
  2877. A build/gyp/test/generator-output/actions/subdir1/actions-out/README.txt
  2878. A build/gyp/test/generator-output/actions/subdir1/program.c
  2879. A build/gyp/test/generator-output/actions/subdir1/make-prog1.py
  2880. A build/gyp/test/generator-output/actions/subdir1/make-prog2.py
  2881. A build/gyp/test/generator-output/actions/subdir2
  2882. A build/gyp/test/generator-output/actions/subdir2/build
  2883. A build/gyp/test/generator-output/actions/subdir2/build/README.txt
  2884. A build/gyp/test/generator-output/actions/subdir2/make-file.py
  2885. A build/gyp/test/generator-output/actions/subdir2/actions-out
  2886. A build/gyp/test/generator-output/actions/subdir2/actions-out/README.txt
  2887. A build/gyp/test/generator-output/actions/subdir2/none.gyp
  2888. A build/gyp/test/generator-output/actions/actions.gyp
  2889. A build/gyp/test/generator-output/copies
  2890. A build/gyp/test/generator-output/copies/build
  2891. A build/gyp/test/generator-output/copies/build/README.txt
  2892. A build/gyp/test/generator-output/copies/copies.gyp
  2893. A build/gyp/test/generator-output/copies/file1
  2894. A build/gyp/test/generator-output/copies/file2
  2895. A build/gyp/test/generator-output/copies/copies-out
  2896. A build/gyp/test/generator-output/copies/copies-out/README.txt
  2897. A build/gyp/test/generator-output/copies/subdir
  2898. A build/gyp/test/generator-output/copies/subdir/build
  2899. A build/gyp/test/generator-output/copies/subdir/build/README.txt
  2900. A build/gyp/test/generator-output/copies/subdir/file3
  2901. A build/gyp/test/generator-output/copies/subdir/file4
  2902. A build/gyp/test/generator-output/copies/subdir/subdir.gyp
  2903. A build/gyp/test/generator-output/copies/subdir/copies-out
  2904. A build/gyp/test/generator-output/copies/subdir/copies-out/README.txt
  2905. A build/gyp/test/generator-output/gyptest-relocate.py
  2906. A build/gyp/test/generator-output/gyptest-actions.py
  2907. A build/gyp/test/generator-output/gyptest-copies.py
  2908. A build/gyp/test/generator-output/mac-bundle
  2909. A build/gyp/test/generator-output/mac-bundle/main.c
  2910. A build/gyp/test/generator-output/mac-bundle/Info.plist
  2911. A build/gyp/test/generator-output/mac-bundle/app.order
  2912. A build/gyp/test/generator-output/mac-bundle/resource.sb
  2913. A build/gyp/test/generator-output/mac-bundle/test.gyp
  2914. A build/gyp/test/generator-output/mac-bundle/header.h
  2915. A build/gyp/test/generator-output/src
  2916. A build/gyp/test/generator-output/src/build
  2917. A build/gyp/test/generator-output/src/build/README.txt
  2918. A build/gyp/test/generator-output/src/inc.h
  2919. A build/gyp/test/generator-output/src/symroot.gypi
  2920. A build/gyp/test/generator-output/src/prog1.gyp
  2921. A build/gyp/test/generator-output/src/prog1.c
  2922. A build/gyp/test/generator-output/src/inc1
  2923. A build/gyp/test/generator-output/src/inc1/include1.h
  2924. A build/gyp/test/generator-output/src/subdir2
  2925. A build/gyp/test/generator-output/src/subdir2/build
  2926. A build/gyp/test/generator-output/src/subdir2/build/README.txt
  2927. A build/gyp/test/generator-output/src/subdir2/deeper
  2928. A build/gyp/test/generator-output/src/subdir2/deeper/build
  2929. A build/gyp/test/generator-output/src/subdir2/deeper/build/README.txt
  2930. A build/gyp/test/generator-output/src/subdir2/deeper/deeper.gyp
  2931. A build/gyp/test/generator-output/src/subdir2/deeper/deeper.c
  2932. A build/gyp/test/generator-output/src/subdir2/deeper/deeper.h
  2933. A build/gyp/test/generator-output/src/subdir2/prog2.gyp
  2934. A build/gyp/test/generator-output/src/subdir2/prog2.c
  2935. A build/gyp/test/generator-output/src/subdir2/inc2
  2936. A build/gyp/test/generator-output/src/subdir2/inc2/include2.h
  2937. A build/gyp/test/generator-output/src/subdir3
  2938. A build/gyp/test/generator-output/src/subdir3/build
  2939. A build/gyp/test/generator-output/src/subdir3/build/README.txt
  2940. A build/gyp/test/generator-output/src/subdir3/prog3.gyp
  2941. A build/gyp/test/generator-output/src/subdir3/prog3.c
  2942. A build/gyp/test/generator-output/src/subdir3/inc3
  2943. A build/gyp/test/generator-output/src/subdir3/inc3/include3.h
  2944. A build/gyp/test/generator-output/gyptest-subdir2-deep.py
  2945. A build/gyp/test/generator-output/rules
  2946. A build/gyp/test/generator-output/rules/build
  2947. A build/gyp/test/generator-output/rules/build/README.txt
  2948. A build/gyp/test/generator-output/rules/rules.gyp
  2949. A build/gyp/test/generator-output/rules/subdir1
  2950. A build/gyp/test/generator-output/rules/subdir1/build
  2951. A build/gyp/test/generator-output/rules/subdir1/build/README.txt
  2952. A build/gyp/test/generator-output/rules/subdir1/executable.gyp
  2953. A build/gyp/test/generator-output/rules/subdir1/define3.in0
  2954. A build/gyp/test/generator-output/rules/subdir1/define4.in0
  2955. A build/gyp/test/generator-output/rules/subdir1/program.c
  2956. A build/gyp/test/generator-output/rules/subdir1/function1.in1
  2957. A build/gyp/test/generator-output/rules/subdir1/function2.in1
  2958. A build/gyp/test/generator-output/rules/subdir2
  2959. A build/gyp/test/generator-output/rules/subdir2/build
  2960. A build/gyp/test/generator-output/rules/subdir2/build/README.txt
  2961. A build/gyp/test/generator-output/rules/subdir2/rules-out
  2962. A build/gyp/test/generator-output/rules/subdir2/rules-out/README.txt
  2963. A build/gyp/test/generator-output/rules/subdir2/file1.in0
  2964. A build/gyp/test/generator-output/rules/subdir2/file2.in0
  2965. A build/gyp/test/generator-output/rules/subdir2/file3.in1
  2966. A build/gyp/test/generator-output/rules/subdir2/file4.in1
  2967. A build/gyp/test/generator-output/rules/subdir2/none.gyp
  2968. A build/gyp/test/generator-output/rules/copy-file.py
  2969. A build/gyp/test/generator-output/gyptest-mac-bundle.py
  2970. A build/gyp/test/generator-output/gyptest-top-all.py
  2971. A build/gyp/test/generator-output/gyptest-rules.py
  2972. A build/gyp/test/sibling
  2973. A build/gyp/test/sibling/gyptest-relocate.py
  2974. A build/gyp/test/sibling/src
  2975. A build/gyp/test/sibling/src/build
  2976. A build/gyp/test/sibling/src/build/all.gyp
  2977. A build/gyp/test/sibling/src/prog1
  2978. A build/gyp/test/sibling/src/prog1/prog1.gyp
  2979. A build/gyp/test/sibling/src/prog1/prog1.c
  2980. A build/gyp/test/sibling/src/prog2
  2981. A build/gyp/test/sibling/src/prog2/prog2.gyp
  2982. A build/gyp/test/sibling/src/prog2/prog2.c
  2983. A build/gyp/test/sibling/gyptest-all.py
  2984. A build/gyp/test/escaping
  2985. A build/gyp/test/escaping/colon
  2986. A build/gyp/test/escaping/colon/test.gyp
  2987. A build/gyp/test/escaping/gyptest-colon.py
  2988. A build/gyp/test/rules-variables
  2989. A build/gyp/test/rules-variables/gyptest-rules-variables.py
  2990. A build/gyp/test/rules-variables/src
  2991. A build/gyp/test/rules-variables/src/input_name
  2992. A build/gyp/test/rules-variables/src/input_name/test.c
  2993. A build/gyp/test/rules-variables/src/input_ext.c
  2994. A build/gyp/test/rules-variables/src/test.input_root.c
  2995. A build/gyp/test/rules-variables/src/variables.gyp
  2996. A build/gyp/test/rules-variables/src/subdir
  2997. A build/gyp/test/rules-variables/src/subdir/input_dirname.c
  2998. A build/gyp/test/rules-variables/src/subdir/test.c
  2999. A build/gyp/test/rules-variables/src/input_path
  3000. A build/gyp/test/rules-variables/src/input_path/subdir
  3001. A build/gyp/test/rules-variables/src/input_path/subdir/test.c
  3002. A build/gyp/test/library
  3003. A build/gyp/test/library/gyptest-shared-obj-install-path.py
  3004. A build/gyp/test/library/src
  3005. A build/gyp/test/library/src/library.gyp
  3006. A build/gyp/test/library/src/lib1_moveable.c
  3007. A build/gyp/test/library/src/shared_dependency.gyp
  3008. A build/gyp/test/library/src/lib2_moveable.c
  3009. A build/gyp/test/library/src/program.c
  3010. A build/gyp/test/library/src/lib1.c
  3011. A build/gyp/test/library/src/lib2.c
  3012. A build/gyp/test/library/gyptest-shared.py
  3013. A build/gyp/test/library/gyptest-static.py
  3014. A build/gyp/test/lib
  3015. A build/gyp/test/lib/TestCommon.py
  3016. A build/gyp/test/lib/TestGyp.py
  3017. A build/gyp/test/lib/TestCmd.py
  3018. A build/gyp/test/lib/README.txt
  3019. A build/gyp/test/rules-dirname
  3020. A build/gyp/test/rules-dirname/gyptest-dirname.py
  3021. A build/gyp/test/rules-dirname/src
  3022. A build/gyp/test/rules-dirname/src/subdir
  3023. A build/gyp/test/rules-dirname/src/subdir/input-rule-dirname.gyp
  3024. A build/gyp/test/rules-dirname/src/subdir/printvars.py
  3025. A build/gyp/test/rules-dirname/src/subdir/a
  3026. A build/gyp/test/rules-dirname/src/subdir/a/b
  3027. A build/gyp/test/rules-dirname/src/subdir/a/b/c.gencc
  3028. A build/gyp/test/rules-dirname/src/subdir/a/b/c.printvars
  3029. A build/gyp/test/rules-dirname/src/subdir/foo
  3030. A build/gyp/test/rules-dirname/src/subdir/foo/bar
  3031. A build/gyp/test/rules-dirname/src/subdir/foo/bar/baz.printvars
  3032. A build/gyp/test/rules-dirname/src/subdir/foo/bar/baz.gencc
  3033. A build/gyp/test/rules-dirname/src/subdir/main.cc
  3034. A build/gyp/test/rules-dirname/src/actions.gyp
  3035. A build/gyp/test/rules-dirname/src/copy-file.py
  3036. A build/gyp/test/rename
  3037. A build/gyp/test/rename/gyptest-filecase.py
  3038. A build/gyp/test/rename/filecase
  3039. A build/gyp/test/rename/filecase/test-casesensitive.gyp
  3040. A build/gyp/test/rename/filecase/file.c
  3041. A build/gyp/test/rename/filecase/test.gyp
  3042. A build/gyp/test/compilable
  3043. A build/gyp/test/compilable/gyptest-headers.py
  3044. A build/gyp/test/compilable/src
  3045. A build/gyp/test/compilable/src/lib1.cpp
  3046. A build/gyp/test/compilable/src/program.cpp
  3047. A build/gyp/test/compilable/src/headers.gyp
  3048. A build/gyp/test/compilable/src/lib1.hpp
  3049. A build/gyp/test/exclusion
  3050. A build/gyp/test/exclusion/hello.c
  3051. A build/gyp/test/exclusion/exclusion.gyp
  3052. A build/gyp/test/exclusion/gyptest-exclusion.py
  3053. A build/gyp/test/relative
  3054. A build/gyp/test/relative/foo
  3055. A build/gyp/test/relative/foo/a
  3056. A build/gyp/test/relative/foo/a/c
  3057. A build/gyp/test/relative/foo/a/c/c.gyp
  3058. A build/gyp/test/relative/foo/a/c/c.cc
  3059. A build/gyp/test/relative/foo/a/a.cc
  3060. A build/gyp/test/relative/foo/a/a.gyp
  3061. A build/gyp/test/relative/foo/b
  3062. A build/gyp/test/relative/foo/b/b.gyp
  3063. A build/gyp/test/relative/foo/b/b.cc
  3064. A build/gyp/test/relative/gyptest-default.py
  3065. A build/gyp/test/home_dot_gyp
  3066. A build/gyp/test/home_dot_gyp/gyptest-home-includes.py
  3067. A build/gyp/test/home_dot_gyp/gyptest-home-includes-regyp.py
  3068. A build/gyp/test/home_dot_gyp/src
  3069. A build/gyp/test/home_dot_gyp/src/printfoo.c
  3070. A build/gyp/test/home_dot_gyp/src/all.gyp
  3071. A build/gyp/test/home_dot_gyp/home
  3072. A build/gyp/test/home_dot_gyp/home/.gyp
  3073. A build/gyp/test/home_dot_gyp/home/.gyp/include.gypi
  3074. A build/gyp/test/home_dot_gyp/home2
  3075. A build/gyp/test/home_dot_gyp/home2/.gyp
  3076. A build/gyp/test/home_dot_gyp/home2/.gyp/include.gypi
  3077. A build/gyp/test/same-source-file-name
  3078. A build/gyp/test/same-source-file-name/gyptest-fail.py
  3079. A build/gyp/test/same-source-file-name/src
  3080. A build/gyp/test/same-source-file-name/src/all.gyp
  3081. A build/gyp/test/same-source-file-name/src/double.gyp
  3082. A build/gyp/test/same-source-file-name/src/subdir1
  3083. A build/gyp/test/same-source-file-name/src/subdir1/func.c
  3084. A build/gyp/test/same-source-file-name/src/prog1.c
  3085. A build/gyp/test/same-source-file-name/src/prog2.c
  3086. A build/gyp/test/same-source-file-name/src/subdir2
  3087. A build/gyp/test/same-source-file-name/src/subdir2/func.c
  3088. A build/gyp/test/same-source-file-name/src/func.c
  3089. A build/gyp/test/same-source-file-name/gyptest-default.py
  3090. A build/gyp/test/same-source-file-name/gyptest-all.py
  3091. A build/gyp/test/rules-rebuild
  3092. A build/gyp/test/rules-rebuild/src
  3093. A build/gyp/test/rules-rebuild/src/main.c
  3094. A build/gyp/test/rules-rebuild/src/make-sources.py
  3095. A build/gyp/test/rules-rebuild/src/same_target.gyp
  3096. A build/gyp/test/rules-rebuild/src/prog1.in
  3097. A build/gyp/test/rules-rebuild/src/prog2.in
  3098. A build/gyp/test/rules-rebuild/gyptest-default.py
  3099. A build/gyp/test/rules-rebuild/gyptest-all.py
  3100. A build/gyp/test/product
  3101. A build/gyp/test/product/hello.c
  3102. A build/gyp/test/product/gyptest-product.py
  3103. A build/gyp/test/product/product.gyp
  3104. A build/gyp/test/module
  3105. A build/gyp/test/module/src
  3106. A build/gyp/test/module/src/module.gyp
  3107. A build/gyp/test/module/src/program.c
  3108. A build/gyp/test/module/src/lib1.c
  3109. A build/gyp/test/module/src/lib2.c
  3110. A build/gyp/test/module/gyptest-default.py
  3111. A build/gyp/test/standalone
  3112. A build/gyp/test/standalone/standalone.gyp
  3113. A build/gyp/test/standalone/gyptest-standalone.py
  3114. A build/gyp/test/sanitize-rule-names
  3115. A build/gyp/test/sanitize-rule-names/gyptest-sanitize-rule-names.py
  3116. A build/gyp/test/sanitize-rule-names/blah.S
  3117. A build/gyp/test/sanitize-rule-names/hello.cc
  3118. A build/gyp/test/sanitize-rule-names/sanitize-rule-names.gyp
  3119. A build/gyp/test/sanitize-rule-names/script.py
  3120. A build/gyp/test/cflags
  3121. A build/gyp/test/cflags/cflags.c
  3122. A build/gyp/test/cflags/gyptest-cflags.py
  3123. A build/gyp/test/cflags/cflags.gyp
  3124. A build/gyp/test/actions
  3125. A build/gyp/test/actions/gyptest-errors.py
  3126. A build/gyp/test/actions/src
  3127. A build/gyp/test/actions/src/action_missing_name.gyp
  3128. A build/gyp/test/actions/src/subdir1
  3129. A build/gyp/test/actions/src/subdir1/executable.gyp
  3130. A build/gyp/test/actions/src/subdir1/counter.py
  3131. A build/gyp/test/actions/src/subdir1/program.c
  3132. A build/gyp/test/actions/src/subdir1/make-prog1.py
  3133. A build/gyp/test/actions/src/subdir1/make-prog2.py
  3134. A build/gyp/test/actions/src/confirm-dep-files.py
  3135. A build/gyp/test/actions/src/subdir2
  3136. A build/gyp/test/actions/src/subdir2/make-file.py
  3137. A build/gyp/test/actions/src/subdir2/none.gyp
  3138. A build/gyp/test/actions/src/subdir3
  3139. A build/gyp/test/actions/src/subdir3/generate_main.py
  3140. A build/gyp/test/actions/src/subdir3/null_input.gyp
  3141. A build/gyp/test/actions/src/actions.gyp
  3142. A build/gyp/test/actions/gyptest-default.py
  3143. A build/gyp/test/actions/gyptest-all.py
  3144. A build/gyp/test/multiple-targets
  3145. A build/gyp/test/multiple-targets/src
  3146. A build/gyp/test/multiple-targets/src/multiple.gyp
  3147. A build/gyp/test/multiple-targets/src/common.c
  3148. A build/gyp/test/multiple-targets/src/prog1.c
  3149. A build/gyp/test/multiple-targets/src/prog2.c
  3150. A build/gyp/test/multiple-targets/gyptest-default.py
  3151. A build/gyp/test/multiple-targets/gyptest-all.py
  3152. A build/gyp/test/hello
  3153. A build/gyp/test/hello/hello.gyp
  3154. A build/gyp/test/hello/hello2.gyp
  3155. A build/gyp/test/hello/hello.c
  3156. A build/gyp/test/hello/hello2.c
  3157. A build/gyp/test/hello/gyptest-default.py
  3158. A build/gyp/test/hello/gyptest-target.py
  3159. A build/gyp/test/hello/gyptest-regyp.py
  3160. A build/gyp/test/hello/gyptest-disable-regyp.py
  3161. A build/gyp/test/hello/gyptest-all.py
  3162. A build/gyp/test/intermediate_dir
  3163. A build/gyp/test/intermediate_dir/src
  3164. A build/gyp/test/intermediate_dir/src/test2.gyp
  3165. A build/gyp/test/intermediate_dir/src/shared_infile.txt
  3166. A build/gyp/test/intermediate_dir/src/script.py
  3167. A build/gyp/test/intermediate_dir/src/test.gyp
  3168. A build/gyp/test/intermediate_dir/gyptest-intermediate-dir.py
  3169. A build/gyp/test/toolsets
  3170. A build/gyp/test/toolsets/gyptest-toolsets.py
  3171. A build/gyp/test/toolsets/toolsets.cc
  3172. A build/gyp/test/toolsets/main.cc
  3173. A build/gyp/test/toolsets/toolsets.gyp
  3174. A build/gyp/test/errors
  3175. A build/gyp/test/errors/missing_dep.gyp
  3176. A build/gyp/test/errors/duplicate_rule.gyp
  3177. A build/gyp/test/errors/missing_targets.gyp
  3178. A build/gyp/test/errors/gyptest-errors.py
  3179. A build/gyp/test/errors/duplicate_targets.gyp
  3180. A build/gyp/test/errors/duplicate_basenames.gyp
  3181. A build/gyp/test/errors/duplicate_node.gyp
  3182. A build/gyp/test/defines
  3183. A build/gyp/test/defines/defines-env.gyp
  3184. A build/gyp/test/defines/gyptest-defines.py
  3185. A build/gyp/test/defines/gyptest-defines-env.py
  3186. A build/gyp/test/defines/gyptest-define-override.py
  3187. A build/gyp/test/defines/defines.gyp
  3188. A build/gyp/test/defines/gyptest-defines-env-regyp.py
  3189. A build/gyp/test/defines/defines.c
  3190. A build/gyp/LICENSE
  3191. A build/gyp/AUTHORS
  3192. A build/gyp/gyptest.py
  3193. A build/gyp/setup.py
  3194. A build/gyp/gyp_dummy.c
  3195. A build/gyp/codereview.settings
  3196. A build/gyp/DEPS
  3197. A build/gyp/gyp
  3198. A build/gyp/tools
  3199. A build/gyp/tools/graphviz.py
  3200. A build/gyp/tools/pretty_vcproj.py
  3201. A build/gyp/tools/Xcode
  3202. A build/gyp/tools/Xcode/Specifications
  3203. A build/gyp/tools/Xcode/Specifications/gyp.xclangspec
  3204. A build/gyp/tools/Xcode/Specifications/gyp.pbfilespec
  3205. A build/gyp/tools/Xcode/README
  3206. A build/gyp/tools/emacs
  3207. A build/gyp/tools/emacs/testdata
  3208. A build/gyp/tools/emacs/testdata/media.gyp.fontified
  3209. A build/gyp/tools/emacs/testdata/media.gyp
  3210. A build/gyp/tools/emacs/run-unit-tests.sh
  3211. A build/gyp/tools/emacs/README
  3212. A build/gyp/tools/emacs/gyp.el
  3213. A build/gyp/tools/emacs/gyp-tests.el
  3214. A build/gyp/tools/pretty_sln.py
  3215. A build/gyp/tools/pretty_gyp.py
  3216. A build/gyp/tools/README
  3217. A build/gyp/PRESUBMIT.py
  3218. A build/gyp/gyp.bat
  3219. A build/gyp/pylintrc
  3220. A build/gyp/buildbot
  3221. A build/gyp/buildbot/buildbot_run.py
  3222. A build/gyp/samples
  3223. A build/gyp/samples/samples
  3224. A build/gyp/samples/samples.bat
  3225. A build/gyp/.gitignore
  3226. A build/gyp/MANIFEST
  3227. A build/gyp/OWNERS
  3228. Checked out revision 1501.
  3229. make[2]: Leaving directory `/home/odroid/src/SilkJS/src/v8-read-only'
  3230. make[2]: Entering directory `/home/odroid/src/SilkJS/src/v8-read-only'
  3231. GYP_GENERATORS=make \
  3232. build/gyp/gyp --generator-output="out" build/all.gyp \
  3233. -Ibuild/standalone.gypi --depth=. \
  3234. -Dv8_target_arch=ia32 \
  3235. -S.ia32 -Dcomponent=shared_library -Dv8_can_use_vfp3_instructions=true
  3236. make[3]: Entering directory `/home/odroid/src/SilkJS/src/v8-read-only/out'
  3237. CXX(target) /home/odroid/src/SilkJS/src/v8-read-only/out/ia32.release/obj.target/preparser_lib/src/allocation.o
  3238. CXX(target) /home/odroid/src/SilkJS/src/v8-read-only/out/ia32.release/obj.target/preparser_lib/src/atomicops_internals_x86_gcc.o
  3239. In file included from ../src/allocation.h:31:0,
  3240. from ../src/allocation.cc:28:
  3241. ../src/globals.h:113:2: error: #error Target architecture ia32 is only supported on ia32 host
  3242. #error Target architecture ia32 is only supported on ia32 host
  3243. ^
  3244. In file included from ../src/atomicops.h:52:0,
  3245. from ../src/atomicops_internals_x86_gcc.cc:33:
  3246. ../src/globals.h:113:2: error: #error Target architecture ia32 is only supported on ia32 host
  3247. #error Target architecture ia32 is only supported on ia32 host
  3248. ^
  3249. make[3]: *** [/home/odroid/src/SilkJS/src/v8-read-only/out/ia32.release/obj.target/preparser_lib/src/allocation.o] Error 1
  3250. make[3]: *** Waiting for unfinished jobs....
  3251. make[3]: *** [/home/odroid/src/SilkJS/src/v8-read-only/out/ia32.release/obj.target/preparser_lib/src/atomicops_internals_x86_gcc.o] Error 1
  3252. make[3]: Leaving directory `/home/odroid/src/SilkJS/src/v8-read-only/out'
  3253. make[2]: *** [ia32.release] Error 2
  3254. make[2]: Leaving directory `/home/odroid/src/SilkJS/src/v8-read-only'
  3255. make[1]: *** [v8-read-only/out/ia32.release/obj.target/tools/gyp/libv8_base.a] Error 2
  3256. make[1]: Leaving directory `/home/odroid/src/SilkJS/src'
  3257. make: *** [all] Error 2
  3258. odroid@odroid:~/src/SilkJS$
Add Comment
Please, Sign In to add comment