Guest User

Untitled

a guest
Feb 23rd, 2014
194
0
Never
Not a member of Pastebin yet? Sign Up, it unlocks many cool features!
text 13.62 KB | None | 0 0
  1. 18:41:19: Running steps for project boost_test...
  2. 18:41:19: Starting: "/usr/bin/qmake" /home/vladimir/boost_test/boost_test.pro -r -spec linux-g++-64 CONFIG+=debug CONFIG+=declarative_debug CONFIG+=qml_debug
  3. 18:41:19: The process "/usr/bin/qmake" exited normally.
  4. 18:41:19: Starting: "/usr/bin/make"
  5. g++ -c -m64 -pipe -g -std=c++0x -Wall -W -fPIE -DQT_QML_DEBUG -DQT_DECLARATIVE_DEBUG -I/usr/share/qt5/mkspecs/linux-g++-64 -I../boost_test -I. -o main.o ../boost_test/main.cpp
  6. In file included from /usr/include/x86_64-linux-gnu/c++/4.8/bits/c++allocator.h:33:0,
  7. from /usr/include/c++/4.8/bits/allocator.h:46,
  8. from /usr/include/c++/4.8/string:41,
  9. from /usr/include/c++/4.8/bits/locale_classes.h:40,
  10. from /usr/include/c++/4.8/bits/ios_base.h:41,
  11. from /usr/include/c++/4.8/ios:42,
  12. from /usr/include/c++/4.8/ostream:38,
  13. from /usr/include/c++/4.8/iostream:39,
  14. from ../boost_test/main.cpp:11:
  15. /usr/include/c++/4.8/ext/new_allocator.h: In instantiation of 'void __gnu_cxx::new_allocator<_Tp>::construct(_Up*, _Args&& ...) [with _Up = client; _Args = {const client&}; _Tp = client]':
  16. /usr/include/c++/4.8/bits/alloc_traits.h:254:4: required from 'static typename std::enable_if<std::allocator_traits<_Alloc>::__construct_helper<_Tp, _Args>::value, void>::type std::allocator_traits<_Alloc>::_S_construct(_Alloc&, _Tp*, _Args&& ...) [with _Tp = client; _Args = {const client&}; _Alloc = std::allocator<client>; typename std::enable_if<std::allocator_traits<_Alloc>::__construct_helper<_Tp, _Args>::value, void>::type = void]'
  17. /usr/include/c++/4.8/bits/alloc_traits.h:393:57: required from 'static decltype (_S_construct(__a, __p, (forward<_Args>)(std::allocator_traits::construct::__args)...)) std::allocator_traits<_Alloc>::construct(_Alloc&, _Tp*, _Args&& ...) [with _Tp = client; _Args = {const client&}; _Alloc = std::allocator<client>; decltype (_S_construct(__a, __p, (forward<_Args>)(std::allocator_traits::construct::__args)...)) = <type error>]'
  18. /usr/include/c++/4.8/bits/stl_vector.h:906:34: required from 'void std::vector<_Tp, _Alloc>::push_back(const value_type&) [with _Tp = client; _Alloc = std::allocator<client>; std::vector<_Tp, _Alloc>::value_type = client]'
  19. ../boost_test/main.cpp:197:20: required from here
  20. /usr/include/c++/4.8/ext/new_allocator.h:120:4: error: use of deleted function 'client::client(const client&)'
  21. { ::new((void *)__p) _Up(std::forward<_Args>(__args)...); }
  22. ^
  23. ../boost_test/main.cpp:20:7: note: 'client::client(const client&)' is implicitly deleted because the default definition would be ill-formed:
  24. class client
  25. ^
  26. ../boost_test/main.cpp:20:7: error: use of deleted function 'boost::asio::ip::basic_resolver<boost::asio::ip::tcp>::basic_resolver(const boost::asio::ip::basic_resolver<boost::asio::ip::tcp>&)'
  27. In file included from /usr/include/boost/asio.hpp:54:0,
  28. from ../boost_test/main.cpp:15:
  29. /usr/include/boost/asio/ip/basic_resolver.hpp:44:7: note: 'boost::asio::ip::basic_resolver<boost::asio::ip::tcp>::basic_resolver(const boost::asio::ip::basic_resolver<boost::asio::ip::tcp>&)' is implicitly deleted because the default definition would be ill-formed:
  30. class basic_resolver
  31. ^
  32. In file included from /usr/include/boost/asio/basic_socket.hpp:19:0,
  33. from /usr/include/boost/asio/basic_datagram_socket.hpp:20,
  34. from /usr/include/boost/asio.hpp:20,
  35. from ../boost_test/main.cpp:15:
  36. /usr/include/boost/asio/basic_io_object.hpp:163:3: error: 'boost::asio::basic_io_object<IoObjectService, Movable>::basic_io_object(const boost::asio::basic_io_object<IoObjectService, Movable>&) [with IoObjectService = boost::asio::ip::resolver_service<boost::asio::ip::tcp>; bool Movable = false]' is private
  37. basic_io_object(const basic_io_object&);
  38. ^
  39. In file included from /usr/include/boost/asio.hpp:54:0,
  40. from ../boost_test/main.cpp:15:
  41. /usr/include/boost/asio/ip/basic_resolver.hpp:44:7: error: within this context
  42. class basic_resolver
  43. ^
  44. ../boost_test/main.cpp:20:7: error: use of deleted function 'boost::asio::basic_stream_socket<boost::asio::ip::tcp>::basic_stream_socket(const boost::asio::basic_stream_socket<boost::asio::ip::tcp>&)'
  45. class client
  46. ^
  47. In file included from /usr/include/boost/asio.hpp:30:0,
  48. from ../boost_test/main.cpp:15:
  49. /usr/include/boost/asio/basic_stream_socket.hpp:45:7: note: 'boost::asio::basic_stream_socket<boost::asio::ip::tcp>::basic_stream_socket(const boost::asio::basic_stream_socket<boost::asio::ip::tcp>&)' is implicitly declared as deleted because 'boost::asio::basic_stream_socket<boost::asio::ip::tcp>' declares a move constructor or move assignment operator
  50. class basic_stream_socket
  51. ^
  52. ../boost_test/main.cpp:20:7: error: use of deleted function 'boost::asio::basic_streambuf<>::basic_streambuf(const boost::asio::basic_streambuf<>&)'
  53. class client
  54. ^
  55. In file included from /usr/include/boost/asio.hpp:31:0,
  56. from ../boost_test/main.cpp:15:
  57. /usr/include/boost/asio/basic_streambuf.hpp:111:7: note: 'boost::asio::basic_streambuf<>::basic_streambuf(const boost::asio::basic_streambuf<>&)' is implicitly deleted because the default definition would be ill-formed:
  58. class basic_streambuf
  59. ^
  60. In file included from /usr/include/c++/4.8/ios:43:0,
  61. from /usr/include/c++/4.8/ostream:38,
  62. from /usr/include/c++/4.8/iostream:39,
  63. from ../boost_test/main.cpp:11:
  64. /usr/include/c++/4.8/streambuf:802:7: error: 'std::basic_streambuf<_CharT, _Traits>::basic_streambuf(const std::basic_streambuf<_CharT, _Traits>&) [with _CharT = char; _Traits = std::char_traits<char>]' is private
  65. basic_streambuf(const basic_streambuf& __sb)
  66. ^
  67. In file included from /usr/include/boost/asio.hpp:31:0,
  68. from ../boost_test/main.cpp:15:
  69. /usr/include/boost/asio/basic_streambuf.hpp:111:7: error: within this context
  70. class basic_streambuf
  71. ^
  72. In file included from /usr/include/boost/asio/detail/noncopyable.hpp:19:0,
  73. from /usr/include/boost/asio/io_service.hpp:22,
  74. from /usr/include/boost/asio/basic_io_object.hpp:19,
  75. from /usr/include/boost/asio/basic_socket.hpp:19,
  76. from /usr/include/boost/asio/basic_datagram_socket.hpp:20,
  77. from /usr/include/boost/asio.hpp:20,
  78. from ../boost_test/main.cpp:15:
  79. /usr/include/boost/noncopyable.hpp:27:7: error: 'boost::noncopyable_::noncopyable::noncopyable(const boost::noncopyable_::noncopyable&)' is private
  80. noncopyable( const noncopyable& );
  81. ^
  82. In file included from /usr/include/boost/asio.hpp:31:0,
  83. from ../boost_test/main.cpp:15:
  84. /usr/include/boost/asio/basic_streambuf.hpp:111:7: error: within this context
  85. class basic_streambuf
  86. ^
  87. ../boost_test/main.cpp:20:7: error: use of deleted function 'boost::asio::basic_streambuf<>::basic_streambuf(const boost::asio::basic_streambuf<>&)'
  88. class client
  89. ^
  90. In file included from /usr/include/c++/4.8/vector:62:0,
  91. from /usr/include/boost/asio/detail/impl/service_registry.ipp:20,
  92. from /usr/include/boost/asio/detail/service_registry.hpp:161,
  93. from /usr/include/boost/asio/impl/io_service.hpp:19,
  94. from /usr/include/boost/asio/io_service.hpp:767,
  95. from /usr/include/boost/asio/basic_io_object.hpp:19,
  96. from /usr/include/boost/asio/basic_socket.hpp:19,
  97. from /usr/include/boost/asio/basic_datagram_socket.hpp:20,
  98. from /usr/include/boost/asio.hpp:20,
  99. from ../boost_test/main.cpp:15:
  100. /usr/include/c++/4.8/bits/stl_construct.h: In instantiation of 'void std::_Construct(_T1*, _Args&& ...) [with _T1 = client; _Args = {client}]':
  101. /usr/include/c++/4.8/bits/stl_uninitialized.h:75:53: required from 'static _ForwardIterator std::__uninitialized_copy<_TrivialValueTypes>::__uninit_copy(_InputIterator, _InputIterator, _ForwardIterator) [with _InputIterator = std::move_iterator<client*>; _ForwardIterator = client*; bool _TrivialValueTypes = false]'
  102. /usr/include/c++/4.8/bits/stl_uninitialized.h:117:41: required from '_ForwardIterator std::uninitialized_copy(_InputIterator, _InputIterator, _ForwardIterator) [with _InputIterator = std::move_iterator<client*>; _ForwardIterator = client*]'
  103. /usr/include/c++/4.8/bits/stl_uninitialized.h:258:63: required from '_ForwardIterator std::__uninitialized_copy_a(_InputIterator, _InputIterator, _ForwardIterator, std::allocator<_Tp>&) [with _InputIterator = std::move_iterator<client*>; _ForwardIterator = client*; _Tp = client]'
  104. /usr/include/c++/4.8/bits/stl_uninitialized.h:281:69: required from '_ForwardIterator std::__uninitialized_move_if_noexcept_a(_InputIterator, _InputIterator, _ForwardIterator, _Allocator&) [with _InputIterator = client*; _ForwardIterator = client*; _Allocator = std::allocator<client>]'
  105. /usr/include/c++/4.8/bits/vector.tcc:415:43: required from 'void std::vector<_Tp, _Alloc>::_M_emplace_back_aux(_Args&& ...) [with _Args = {const client&}; _Tp = client; _Alloc = std::allocator<client>]'
  106. /usr/include/c++/4.8/bits/stl_vector.h:911:27: required from 'void std::vector<_Tp, _Alloc>::push_back(const value_type&) [with _Tp = client; _Alloc = std::allocator<client>; std::vector<_Tp, _Alloc>::value_type = client]'
  107. ../boost_test/main.cpp:197:20: required from here
  108. /usr/include/c++/4.8/bits/stl_construct.h:75:7: error: use of deleted function 'client::client(client&&)'
  109. { ::new(static_cast<void*>(__p)) _T1(std::forward<_Args>(__args)...); }
  110. ^
  111. ../boost_test/main.cpp:20:7: note: 'client::client(client&&)' is implicitly deleted because the default definition would be ill-formed:
  112. class client
  113. ^
  114. ../boost_test/main.cpp:20:7: error: use of deleted function 'boost::asio::ip::basic_resolver<boost::asio::ip::tcp>::basic_resolver(boost::asio::ip::basic_resolver<boost::asio::ip::tcp>&&)'
  115. In file included from /usr/include/boost/asio.hpp:54:0,
  116. from ../boost_test/main.cpp:15:
  117. /usr/include/boost/asio/ip/basic_resolver.hpp:44:7: note: 'boost::asio::ip::basic_resolver<boost::asio::ip::tcp>::basic_resolver(boost::asio::ip::basic_resolver<boost::asio::ip::tcp>&&)' is implicitly deleted because the default definition would be ill-formed:
  118. class basic_resolver
  119. ^
  120. In file included from /usr/include/boost/asio/basic_socket.hpp:19:0,
  121. from /usr/include/boost/asio/basic_datagram_socket.hpp:20,
  122. from /usr/include/boost/asio.hpp:20,
  123. from ../boost_test/main.cpp:15:
  124. /usr/include/boost/asio/basic_io_object.hpp:163:3: error: 'boost::asio::basic_io_object<IoObjectService, Movable>::basic_io_object(const boost::asio::basic_io_object<IoObjectService, Movable>&) [with IoObjectService = boost::asio::ip::resolver_service<boost::asio::ip::tcp>; bool Movable = false]' is private
  125. basic_io_object(const basic_io_object&);
  126. ^
  127. In file included from /usr/include/boost/asio.hpp:54:0,
  128. from ../boost_test/main.cpp:15:
  129. /usr/include/boost/asio/ip/basic_resolver.hpp:44:7: error: within this context
  130. class basic_resolver
  131. ^
  132. ../boost_test/main.cpp:20:7: error: use of deleted function 'boost::asio::basic_streambuf<>::basic_streambuf(boost::asio::basic_streambuf<>&&)'
  133. class client
  134. ^
  135. In file included from /usr/include/boost/asio.hpp:31:0,
  136. from ../boost_test/main.cpp:15:
  137. /usr/include/boost/asio/basic_streambuf.hpp:111:7: note: 'boost::asio::basic_streambuf<>::basic_streambuf(boost::asio::basic_streambuf<>&&)' is implicitly deleted because the default definition would be ill-formed:
  138. class basic_streambuf
  139. ^
  140. In file included from /usr/include/c++/4.8/ios:43:0,
  141. from /usr/include/c++/4.8/ostream:38,
  142. from /usr/include/c++/4.8/iostream:39,
  143. from ../boost_test/main.cpp:11:
  144. /usr/include/c++/4.8/streambuf:802:7: error: 'std::basic_streambuf<_CharT, _Traits>::basic_streambuf(const std::basic_streambuf<_CharT, _Traits>&) [with _CharT = char; _Traits = std::char_traits<char>]' is private
  145. basic_streambuf(const basic_streambuf& __sb)
  146. ^
  147. In file included from /usr/include/boost/asio.hpp:31:0,
  148. from ../boost_test/main.cpp:15:
  149. /usr/include/boost/asio/basic_streambuf.hpp:111:7: error: within this context
  150. class basic_streambuf
  151. ^
  152. In file included from /usr/include/boost/asio/detail/noncopyable.hpp:19:0,
  153. from /usr/include/boost/asio/io_service.hpp:22,
  154. from /usr/include/boost/asio/basic_io_object.hpp:19,
  155. from /usr/include/boost/asio/basic_socket.hpp:19,
  156. from /usr/include/boost/asio/basic_datagram_socket.hpp:20,
  157. from /usr/include/boost/asio.hpp:20,
  158. from ../boost_test/main.cpp:15:
  159. /usr/include/boost/noncopyable.hpp:27:7: error: 'boost::noncopyable_::noncopyable::noncopyable(const boost::noncopyable_::noncopyable&)' is private
  160. noncopyable( const noncopyable& );
  161. ^
  162. In file included from /usr/include/boost/asio.hpp:31:0,
  163. from ../boost_test/main.cpp:15:
  164. /usr/include/boost/asio/basic_streambuf.hpp:111:7: error: within this context
  165. class basic_streambuf
  166. ^
  167. ../boost_test/main.cpp:20:7: error: use of deleted function 'boost::asio::basic_streambuf<>::basic_streambuf(boost::asio::basic_streambuf<>&&)'
  168. class client
  169. ^
  170. make: *** [main.o] Error 1
  171. 18:41:20: The process "/usr/bin/make" exited with code 2.
  172. Error while building/deploying project boost_test (kit: Desktop)
  173. When executing step 'Make'
  174. 18:41:20: Elapsed time: 00:02.
Advertisement
Add Comment
Please, Sign In to add comment