Want more features on Pastebin? Sign Up, it's FREE!
Guest

Untitled

By: a guest on May 22nd, 2013  |  syntax: None  |  size: 102.77 KB  |  views: 45  |  expires: Never
download  |  raw  |  embed  |  report abuse  |  print
Text below is selected. Please press Ctrl+C to copy to your clipboard. (⌘+C on Mac)
  1. $ makepkg
  2. ==> Making package: tilemill 0.10.1-3 (Wed May 22 11:35:08 CEST 2013)
  3. ==> Checking runtime dependencies...
  4. ==> Checking buildtime dependencies...
  5. ==> Retrieving sources...
  6.   -> Found tilemill-0.10.1.tgz
  7.   -> Found tilemill.png
  8.   -> Found tilemill.desktop
  9.   -> Found tilemill.install
  10. ==> Validating source files with sha1sums...
  11.     tilemill-0.10.1.tgz ... Passed
  12.     tilemill.png ... Passed
  13.     tilemill.desktop ... Passed
  14.     tilemill.install ... Passed
  15. ==> Extracting sources...
  16. ==> Starting build()...
  17. ==> Entering fakeroot environment...
  18. ==> Starting package()...
  19. npm http GET https://registry.npmjs.org/glob
  20. npm http GET https://registry.npmjs.org/generic-pool
  21. npm http GET https://registry.npmjs.org/backbone-dirty
  22. npm http GET https://registry.npmjs.org/chrono
  23. npm http GET https://registry.npmjs.org/JSV
  24. npm http GET https://registry.npmjs.org/bones
  25. npm http GET https://registry.npmjs.org/sax
  26. npm http GET https://registry.npmjs.org/step
  27. npm http GET https://registry.npmjs.org/mapnik
  28. npm http GET https://registry.npmjs.org/mbtiles
  29. npm http GET https://registry.npmjs.org/request
  30. npm http GET https://registry.npmjs.org/tilelive-mapnik
  31. npm http GET https://registry.npmjs.org/tilelive
  32. npm http GET https://registry.npmjs.org/carto/0.9.3
  33. npm http GET https://registry.npmjs.org/millstone
  34. npm http GET https://registry.npmjs.org/sphericalmercator
  35. npm http GET https://registry.npmjs.org/wax/6.4.2
  36. npm http GET https://registry.npmjs.org/underscore
  37. npm http GET https://registry.npmjs.org/node-markdown/0.1.0
  38. npm http GET https://registry.npmjs.org/sqlite3
  39. npm http GET https://registry.npmjs.org/passport
  40. npm http GET https://registry.npmjs.org/passport-oauth
  41. npm http GET https://registry.npmjs.org/modestmaps/3.3.5
  42. npm http GET https://registry.npmjs.org/semver
  43. npm http GET https://registry.npmjs.org/optimist
  44. npm http GET https://registry.npmjs.org/npm
  45. npm http GET https://registry.npmjs.org/mkdirp
  46. npm http GET https://registry.npmjs.org/topcube/0.1.3
  47. npm http 304 https://registry.npmjs.org/chrono
  48. npm http 304 https://registry.npmjs.org/bones
  49. npm http 304 https://registry.npmjs.org/glob
  50. npm http 304 https://registry.npmjs.org/generic-pool
  51. npm http 304 https://registry.npmjs.org/sax
  52. npm http 304 https://registry.npmjs.org/step
  53. npm http 304 https://registry.npmjs.org/mapnik
  54. npm http 304 https://registry.npmjs.org/backbone-dirty
  55. npm http 304 https://registry.npmjs.org/mbtiles
  56. npm http 304 https://registry.npmjs.org/request
  57. npm http 304 https://registry.npmjs.org/JSV
  58. npm http 304 https://registry.npmjs.org/tilelive-mapnik
  59. npm http 304 https://registry.npmjs.org/tilelive
  60. npm http 304 https://registry.npmjs.org/carto/0.9.3
  61. npm http 304 https://registry.npmjs.org/millstone
  62. npm http 304 https://registry.npmjs.org/sphericalmercator
  63. npm http 304 https://registry.npmjs.org/wax/6.4.2
  64. npm http 304 https://registry.npmjs.org/node-markdown/0.1.0
  65. npm WARN deprecated node-markdown@0.1.0: highlight is deprecated in favor of "highliht.js"
  66. npm http 304 https://registry.npmjs.org/underscore
  67. npm http 304 https://registry.npmjs.org/passport
  68. npm http 304 https://registry.npmjs.org/passport-oauth
  69. npm http 304 https://registry.npmjs.org/modestmaps/3.3.5
  70. npm http 304 https://registry.npmjs.org/semver
  71. npm http 304 https://registry.npmjs.org/npm
  72. npm http 304 https://registry.npmjs.org/mkdirp
  73. npm http 304 https://registry.npmjs.org/topcube/0.1.3
  74. npm http 200 https://registry.npmjs.org/sqlite3
  75. npm http 200 https://registry.npmjs.org/optimist
  76.  
  77. > topcube@0.1.3 preinstall /tmp/tilemill/pkg/tilemill/usr/lib/node_modules/tilemill/node_modules/topcube
  78. > node package.js
  79.  
  80. npm http GET https://registry.npmjs.org/pkginfo
  81. npm http GET https://registry.npmjs.org/minimatch
  82. npm http GET https://registry.npmjs.org/dirty
  83. npm http GET https://registry.npmjs.org/oauth
  84. npm http GET https://registry.npmjs.org/wordwrap
  85. npm http GET https://registry.npmjs.org/graceful-fs
  86. npm http GET https://registry.npmjs.org/mapnik-reference
  87. npm http GET https://registry.npmjs.org/inherits
  88. npm http GET https://registry.npmjs.org/pause/0.0.1
  89. npm http GET https://registry.npmjs.org/xml2js
  90. npm http GET https://registry.npmjs.org/express
  91. npm http GET https://registry.npmjs.org/backbone/0.3.3
  92. npm http GET https://registry.npmjs.org/jquery
  93. npm http GET https://registry.npmjs.org/mirror
  94. npm http 304 https://registry.npmjs.org/pkginfo
  95. npm http 304 https://registry.npmjs.org/wordwrap
  96.  
  97. Nothing to clean (project not configured)
  98. Checking for program g++ or c++          : /usr/bin/g++
  99. Checking for program cpp                 : /usr/bin/cpp
  100. Checking for program ar                  : /usr/bin/ar
  101. Checking for program ranlib              : /usr/bin/ranlib
  102. Checking for g++                         : ok  
  103. Checking for gtk+-2.0                    : yes
  104. Checking for glib-2.0                    : yes
  105. Checking for webkit-1.0                  : yes
  106. 'configure' finished successfully (0.277s)
  107. Waf: Entering directory `/tmp/tilemill/pkg/tilemill/usr/lib/node_modules/tilemill/node_modules/topcube/build'
  108. [1/2] cxx: topcube.cpp -> build/Release/topcube_1.o
  109. [2/2] cxx_link: build/Release/topcube_1.o -> build/Release/topcube
  110. Waf: Leaving directory `/tmp/tilemill/pkg/tilemill/usr/lib/node_modules/tilemill/node_modules/topcube/build'
  111. 'build' finished successfully (2.628s)
  112.  
  113. npm http 304 https://registry.npmjs.org/mapnik-reference
  114. npm http 304 https://registry.npmjs.org/graceful-fs
  115. npm http 304 https://registry.npmjs.org/oauth
  116. npm http GET https://registry.npmjs.org/eio
  117.  
  118. > mapnik@0.7.22 install /tmp/tilemill/pkg/tilemill/usr/lib/node_modules/tilemill/node_modules/mapnik
  119. > node-waf -v configure build
  120.  
  121. npm http 304 https://registry.npmjs.org/xml2js
  122. npm http 304 https://registry.npmjs.org/inherits
  123. npm http 304 https://registry.npmjs.org/pause/0.0.1
  124. npm http 304 https://registry.npmjs.org/minimatch
  125. npm http 304 https://registry.npmjs.org/dirty
  126. npm http 304 https://registry.npmjs.org/mirror
  127. npm http 304 https://registry.npmjs.org/eio
  128. npm http 304 https://registry.npmjs.org/backbone/0.3.3
  129. npm http 304 https://registry.npmjs.org/jquery
  130. Setting srcdir to                        : /tmp/tilemill/pkg/tilemill/usr/lib/node_modules/tilemill/node_modules/mapnik
  131. Setting blddir to                        : /tmp/tilemill/pkg/tilemill/usr/lib/node_modules/tilemill/node_modules/mapnik/build
  132. Checking for program g++ or c++          : /usr/bin/g++
  133. Checking for program cpp                 : /usr/bin/cpp
  134. Checking for program ar                  : /usr/bin/ar
  135. npm Checking for program ranlib              : /usr/bin/ranlib
  136. WARN package.json jquery@1.6.3 No README.md file found!
  137. Checking for g++                         : ok  
  138. Checking for node path                   : not found
  139. Checking for node prefix                 : ok /usr
  140. Checking for program mapnik-config       : /usr/bin/mapnik-config
  141. Sweet, found compatible mapnik version 2.1.0 (via mapnik-config)
  142. Sweet, found cairo library, will attempt to compile with cairo support for pdf/svg output
  143. 'configure' finished successfully (0.154s)
  144. Waf: Entering directory `/tmp/tilemill/pkg/tilemill/usr/lib/node_modules/tilemill/node_modules/mapnik/build'
  145. [ 1/20] cxx: src/node_mapnik.cpp -> build/Release/src/node_mapnik_1.o
  146. 11:36:25 runner system command -> ['/usr/bin/g++', '-march=x86-64', '-mtune=generic', '-O2', '-pipe', '-fstack-protector', '--param=ssp-buffer-size=4', '-g', '-O3', '-D_FILE_OFFSET_BITS=64', '-D_LARGEFILE_SOURCE', '-fPIC', '-DPIC', '-I/usr/include', '-I/usr/include', '-I/usr/include/freetype2', '-I/usr/include/libxml2', '-DHAVE_JPEG', '-DBOOST_REGEX_HAS_ICU', '-ansi', '-Wall', '-pthread', '-ftemplate-depth-300', '-DLINUX', '-DBOOST_SPIRIT_THREADSAFE', '-DMAPNIK_THREADSAFE', '-O3', '-fno-strict-aliasing', '-finline-functions', '-Wno-inline', '-Wno-parentheses', '-Wno-char-subscripts', '-DNDEBUG', '-DHAVE_CAIRO', '-DHAVE_LIBXML2', '-I/usr/include/cairomm-1.0', '-I/usr/lib/cairomm-1.0/include', '-I/usr/include/cairo', '-I/usr/include/glib-2.0', '-I/usr/lib/glib-2.0/include', '-I/usr/include/pixman-1', '-I/usr/include/libdrm', '-I/usr/include/libpng16', '-I/usr/include/sigc++-2.0', '-I/usr/lib/sigc++-2.0/include', '-D_LARGEFILE_SOURCE', '-D_FILE_OFFSET_BITS=64', '-D_FORTIFY_SOURCE=2', '-D_GNU_SOURCE', '-I/usr/include/node', '../src/node_mapnik.cpp', '-c', '-o', 'Release/src/node_mapnik_1.o']
  147. [ 2/20] cxx: src/mapnik_map.cpp -> build/Release/src/mapnik_map_1.o
  148. 11:36:25 runner system command -> ['/usr/bin/g++', '-march=x86-64', '-mtune=generic', '-O2', '-pipe', '-fstack-protector', '--param=ssp-buffer-size=4', '-g', '-O3', '-D_FILE_OFFSET_BITS=64', '-D_LARGEFILE_SOURCE', '-fPIC', '-DPIC', '-I/usr/include', '-I/usr/include', '-I/usr/include/freetype2', '-I/usr/include/libxml2', '-DHAVE_JPEG', '-DBOOST_REGEX_HAS_ICU', '-ansi', '-Wall', '-pthread', '-ftemplate-depth-300', '-DLINUX', '-DBOOST_SPIRIT_THREADSAFE', '-DMAPNIK_THREADSAFE', '-O3', '-fno-strict-aliasing', '-finline-functions', '-Wno-inline', '-Wno-parentheses', '-Wno-char-subscripts', '-DNDEBUG', '-DHAVE_CAIRO', '-DHAVE_LIBXML2', '-I/usr/include/cairomm-1.0', '-I/usr/lib/cairomm-1.0/include', '-I/usr/include/cairo', '-I/usr/include/glib-2.0', '-I/usr/lib/glib-2.0/include', '-I/usr/include/pixman-1', '-I/usr/include/libdrm', '-I/usr/include/libpng16', '-I/usr/include/sigc++-2.0', '-I/usr/lib/sigc++-2.0/include', '-D_LARGEFILE_SOURCE', '-D_FILE_OFFSET_BITS=64', '-D_FORTIFY_SOURCE=2', '-D_GNU_SOURCE', '-I/usr/include/node', '../src/mapnik_map.cpp', '-c', '-o', 'Release/src/mapnik_map_1.o']
  149. [ 3/20] cxx: src/mapnik_color.cpp -> build/Release/src/mapnik_color_1.o
  150. 11:36:25 runner system command -> ['/usr/bin/g++', '-march=x86-64', '-mtune=generic', '-O2', '-pipe', '-fstack-protector', '--param=ssp-buffer-size=4', '-g', '-O3', '-D_FILE_OFFSET_BITS=64', '-D_LARGEFILE_SOURCE', '-fPIC', '-DPIC', '-I/usr/include', '-I/usr/include', '-I/usr/include/freetype2', '-I/usr/include/libxml2', '-DHAVE_JPEG', '-DBOOST_REGEX_HAS_ICU', '-ansi', '-Wall', '-pthread', '-ftemplate-depth-300', '-DLINUX', '-DBOOST_SPIRIT_THREADSAFE', '-DMAPNIK_THREADSAFE', '-O3', '-fno-strict-aliasing', '-finline-functions', '-Wno-inline', '-Wno-parentheses', '-Wno-char-subscripts', '-DNDEBUG', '-DHAVE_CAIRO', '-DHAVE_LIBXML2', '-I/usr/include/cairomm-1.0', '-I/usr/lib/cairomm-1.0/include', '-I/usr/include/cairo', '-I/usr/include/glib-2.0', '-I/usr/lib/glib-2.0/include', '-I/usr/include/pixman-1', '-I/usr/include/libdrm', '-I/usr/include/libpng16', '-I/usr/include/sigc++-2.0', '-I/usr/lib/sigc++-2.0/include', '-D_LARGEFILE_SOURCE', '-D_FILE_OFFSET_BITS=64', '-D_FORTIFY_SOURCE=2', '-D_GNU_SOURCE', '-I/usr/include/node', '../src/mapnik_color.cpp', '-c', '-o', 'Release/src/mapnik_color_1.o']
  151. [ 4/20] cxx: src/mapnik_geometry.cpp -> build/Release/src/mapnik_geometry_1.o
  152. 11:36:26 runner system command -> ['/usr/bin/g++', '-march=x86-64', '-mtune=generic', '-O2', '-pipe', '-fstack-protector', '--param=ssp-buffer-size=4', '-g', '-O3', '-D_FILE_OFFSET_BITS=64', '-D_LARGEFILE_SOURCE', '-fPIC', '-DPIC', '-I/usr/include', '-I/usr/include', '-I/usr/include/freetype2', '-I/usr/include/libxml2', '-DHAVE_JPEG', '-DBOOST_REGEX_HAS_ICU', '-ansi', '-Wall', '-pthread', '-ftemplate-depth-300', '-DLINUX', '-DBOOST_SPIRIT_THREADSAFE', '-DMAPNIK_THREADSAFE', '-O3', '-fno-strict-aliasing', '-finline-functions', '-Wno-inline', '-Wno-parentheses', '-Wno-char-subscripts', '-DNDEBUG', '-DHAVE_CAIRO', '-DHAVE_LIBXML2', '-I/usr/include/cairomm-1.0', '-I/usr/lib/cairomm-1.0/include', '-I/usr/include/cairo', '-I/usr/include/glib-2.0', '-I/usr/lib/glib-2.0/include', '-I/usr/include/pixman-1', '-I/usr/include/libdrm', '-I/usr/include/libpng16', '-I/usr/include/sigc++-2.0', '-I/usr/lib/sigc++-2.0/include', '-D_LARGEFILE_SOURCE', '-D_FILE_OFFSET_BITS=64', '-D_FORTIFY_SOURCE=2', '-D_GNU_SOURCE', '-I/usr/include/node', '../src/mapnik_geometry.cpp', '-c', '-o', 'Release/src/mapnik_geometry_1.o']
  153. npm http 200 https://registry.npmjs.org/express
  154. npm http GET https://registry.npmjs.org/lru-cache
  155. npm http GET https://registry.npmjs.org/sigmund
  156. npm http GET https://registry.npmjs.org/uglify-js/1.0.2
  157. npm http GET https://registry.npmjs.org/connect
  158. npm http GET https://registry.npmjs.org/mime/1.2.4
  159. npm http GET https://registry.npmjs.org/htmlparser
  160. npm http GET https://registry.npmjs.org/qs
  161. npm http GET https://registry.npmjs.org/jsdom
  162. npm http GET https://registry.npmjs.org/mkdirp/0.3.0
  163. npm http 304 https://registry.npmjs.org/lru-cache
  164. npm http 304 https://registry.npmjs.org/sigmund
  165.  
  166. > sqlite3@2.1.7 install /tmp/tilemill/pkg/tilemill/usr/lib/node_modules/tilemill/node_modules/sqlite3
  167. > node-gyp rebuild
  168.  
  169. npm http 304 https://registry.npmjs.org/qs
  170. npm http 304 https://registry.npmjs.org/htmlparser
  171. npm http 304 https://registry.npmjs.org/mkdirp/0.3.0
  172. npm http 200 https://registry.npmjs.org/uglify-js/1.0.2
  173. npm http GET https://registry.npmjs.org/uglify-js/-/uglify-js-1.0.2.tgz
  174. npm http 304 https://registry.npmjs.org/mime/1.2.4
  175. npm http GET https://registry.npmjs.org/generic-pool
  176. npm http GET https://registry.npmjs.org/srs
  177. npm http GET https://registry.npmjs.org/zipfile
  178. npm http GET https://registry.npmjs.org/mime
  179. npm http GET https://registry.npmjs.org/request
  180. npm http 200 https://registry.npmjs.org/uglify-js/-/uglify-js-1.0.2.tgz
  181. npm http 200 https://registry.npmjs.org/jsdom
  182. npm http GET https://registry.npmjs.org/jsdom/-/jsdom-0.6.5.tgz
  183. npm http 200 https://registry.npmjs.org/connect
  184. npm http 304 https://registry.npmjs.org/srs
  185. npm http 304 https://registry.npmjs.org/zipfile
  186. npm http 304 https://registry.npmjs.org/mime
  187. npm WARN package.json connect@1.9.2 No README.md file found!
  188. npm http 304 https://registry.npmjs.org/generic-pool
  189. npm http 304 https://registry.npmjs.org/request
  190. make: Entering directory `/tmp/tilemill/pkg/tilemill/usr/lib/node_modules/tilemill/node_modules/sqlite3/build'
  191.   CC(target) Release/obj.target/sqlite3/deps/sqlite3/sqlite3.o
  192. npm http 200 https://registry.npmjs.org/jsdom/-/jsdom-0.6.5.tgz
  193. ../deps/sqlite3/sqlite3.c: In function 'porter_stemmer':
  194. ../deps/sqlite3/sqlite3.c:125485:41: warning: value computed is not used [-Wunused-value]
  195.       stem(&z, "lanoita", "ate", m_gt_0) ||
  196.                                          ^
  197. ../deps/sqlite3/sqlite3.c:125489:39: warning: value computed is not used [-Wunused-value]
  198.       stem(&z, "icne", "ence", m_gt_0) ||
  199.                                        ^
  200. ../deps/sqlite3/sqlite3.c:125502:35: warning: value computed is not used [-Wunused-value]
  201.       stem(&z, "ile", "e", m_gt_0) ||
  202.                                    ^
  203. ../deps/sqlite3/sqlite3.c:125507:39: warning: value computed is not used [-Wunused-value]
  204.       stem(&z, "noita", "ate", m_gt_0) ||
  205.                                        ^
  206. ../deps/sqlite3/sqlite3.c:125513:41: warning: value computed is not used [-Wunused-value]
  207.       stem(&z, "ssenluf", "ful", m_gt_0) ||
  208.                                          ^
  209. ../deps/sqlite3/sqlite3.c:125518:39: warning: value computed is not used [-Wunused-value]
  210.       stem(&z, "itivi", "ive", m_gt_0) ||
  211.                                        ^
  212. ../deps/sqlite3/sqlite3.c:125527:38: warning: value computed is not used [-Wunused-value]
  213.       stem(&z, "evita", "", m_gt_0)   ||
  214.                                       ^
  215. ../deps/sqlite3/sqlite3.c:125534:37: warning: value computed is not used [-Wunused-value]
  216.       stem(&z, "laci", "ic", m_gt_0) ||
  217.                                      ^
  218. ../deps/sqlite3/sqlite3.c:125577:39: warning: value computed is not used [-Wunused-value]
  219.           stem(&z, "tnem", "", m_gt_1) ||
  220.                                        ^
  221. ../deps/sqlite3/sqlite3.c:125597:34: warning: value computed is not used [-Wunused-value]
  222.       stem(&z, "eta", "", m_gt_1) ||
  223.                                   ^
  224. npm http GET https://registry.npmjs.org/formidable
  225. npm http 304 https://registry.npmjs.org/formidable
  226.  
  227. > zipfile@0.3.4 install /tmp/tilemill/pkg/tilemill/usr/lib/node_modules/tilemill/node_modules/millstone/node_modules/zipfile
  228. > node-waf configure build
  229.  
  230. virtual memory exhausted: Cannot allocate memory
  231. Setting srcdir to                        : /tmp/tilemill/pkg/tilemill/usr/lib/node_modules/tilemill/node_modules/millstone/node_modules/zipfile
  232. Setting blddir to                        : /tmp/tilemill/pkg/tilemill/usr/lib/node_modules/tilemill/node_modules/millstone/node_modules/zipfile/build
  233. Checking for program g++ or c++          : /usr/bin/g++
  234. Checking for program cpp                 : /usr/bin/cpp
  235. Checking for program ar                  : /usr/bin/ar
  236. Checking for program ranlib              : /usr/bin/ranlib
  237. Checking for g++                         : ok  
  238. Checking for node path                   : not found
  239. Checking for node prefix                 : ok /usr
  240. configuring internal libzip dep
  241. libzip-0.10/m4/libtool.m4
  242. libzip-0.10/m4/ltoptions.m4
  243. libzip-0.10/m4/ltsugar.m4
  244. libzip-0.10/m4/ltversion.m4
  245. libzip-0.10/m4/lt~obsolete.m4
  246. libzip-0.10/README
  247. libzip-0.10/configure.ac
  248. libzip-0.10/aclocal.m4
  249. libzip-0.10/Makefile.am
  250. libzip-0.10/Makefile.in
  251. libzip-0.10/config.h.in
  252. libzip-0.10/libzip-uninstalled.pc.in
  253. libzip-0.10/libzip.pc.in
  254. libzip-0.10/configure
  255. libzip-0.10/AUTHORS
  256. libzip-0.10/INSTALL
  257. libzip-0.10/NEWS
  258. libzip-0.10/THANKS
  259. libzip-0.10/TODO
  260. libzip-0.10/compile
  261. libzip-0.10/config.guess
  262. libzip-0.10/config.sub
  263. libzip-0.10/depcomp
  264. libzip-0.10/install-sh
  265. libzip-0.10/ltmain.sh
  266. libzip-0.10/missing
  267. libzip-0.10/mkinstalldirs
  268. libzip-0.10/LICENSE
  269. libzip-0.10/CMakeLists.txt
  270. libzip-0.10/cmake-config.h.in
  271. libzip-0.10/cmake-zipconf.h.in
  272. libzip-0.10/lib/zip.h
  273. libzip-0.10/lib/zipconf.h
  274. libzip-0.10/lib/zipint.h
  275. libzip-0.10/lib/Makefile.am
  276. libzip-0.10/lib/Makefile.in
  277. libzip-0.10/lib/mkstemp.c
  278. libzip-0.10/lib/zip_add.c
  279. libzip-0.10/lib/zip_add_dir.c
  280. libzip-0.10/lib/zip_close.c
  281. libzip-0.10/lib/zip_delete.c
  282. libzip-0.10/lib/zip_dirent.c
  283. libzip-0.10/lib/zip_entry_free.c
  284. libzip-0.10/lib/zip_entry_new.c
  285. libzip-0.10/lib/zip_err_str.c
  286. libzip-0.10/lib/zip_error.c
  287. libzip-0.10/lib/zip_error_clear.c
  288. libzip-0.10/lib/zip_error_get.c
  289. libzip-0.10/lib/zip_error_get_sys_type.c
  290. libzip-0.10/lib/zip_error_strerror.c
  291. libzip-0.10/lib/zip_error_to_str.c
  292. libzip-0.10/lib/zip_fclose.c
  293. libzip-0.10/lib/zip_fdopen.c
  294. libzip-0.10/lib/zip_file_error_clear.c
  295. libzip-0.10/lib/zip_file_error_get.c
  296. libzip-0.10/lib/zip_file_get_offset.c
  297. libzip-0.10/lib/zip_file_strerror.c
  298. libzip-0.10/lib/zip_filerange_crc.c
  299. libzip-0.10/lib/zip_fopen.c
  300. libzip-0.10/lib/zip_fopen_encrypted.c
  301. libzip-0.10/lib/zip_fopen_index.c
  302. libzip-0.10/lib/zip_fopen_index_encrypted.c
  303. libzip-0.10/lib/zip_fread.c
  304. libzip-0.10/lib/zip_free.c
  305. libzip-0.10/lib/zip_get_archive_comment.c
  306. libzip-0.10/lib/zip_get_archive_flag.c
  307. libzip-0.10/lib/zip_get_compression_implementation.c
  308. libzip-0.10/lib/zip_get_file_comment.c
  309. libzip-0.10/lib/zip_get_encryption_implementation.c
  310. libzip-0.10/lib/zip_get_file_extra.c
  311. libzip-0.10/lib/zip_get_num_entries.c
  312. libzip-0.10/lib/zip_get_num_files.c
  313. libzip-0.10/lib/zip_get_name.c
  314. libzip-0.10/lib/zip_memdup.c
  315. libzip-0.10/lib/zip_name_locate.c
  316. libzip-0.10/lib/zip_new.c
  317. libzip-0.10/lib/zip_open.c
  318. libzip-0.10/lib/zip_rename.c
  319. libzip-0.10/lib/zip_replace.c
  320. libzip-0.10/lib/zip_set_archive_comment.c
  321. libzip-0.10/lib/zip_set_archive_flag.c
  322. libzip-0.10/lib/zip_set_default_password.c
  323. libzip-0.10/lib/zip_set_file_comment.c
  324. libzip-0.10/lib/zip_set_file_extra.c
  325. libzip-0.10/lib/zip_source_buffer.c
  326. libzip-0.10/lib/zip_source_close.c
  327. libzip-0.10/lib/zip_source_crc.c
  328. libzip-0.10/lib/zip_source_deflate.c
  329. libzip-0.10/lib/zip_source_error.c
  330. libzip-0.10/lib/zip_source_file.c
  331. libzip-0.10/lib/zip_source_filep.c
  332. libzip-0.10/lib/zip_source_free.c
  333. libzip-0.10/lib/zip_source_function.c
  334. libzip-0.10/lib/zip_source_layered.c
  335. libzip-0.10/lib/zip_source_open.c
  336. libzip-0.10/lib/zip_source_pkware.c
  337. libzip-0.10/lib/zip_source_pop.c
  338. libzip-0.10/lib/zip_source_read.c
  339. libzip-0.10/lib/zip_source_stat.c
  340. libzip-0.10/lib/zip_source_zip.c
  341. libzip-0.10/lib/zip_set_name.c
  342. libzip-0.10/lib/zip_stat.c
  343. libzip-0.10/lib/zip_stat_index.c
  344. libzip-0.10/lib/zip_stat_init.c
  345. libzip-0.10/lib/zip_strerror.c
  346. libzip-0.10/lib/zip_unchange.c
  347. libzip-0.10/lib/zip_unchange_all.c
  348. libzip-0.10/lib/zip_unchange_archive.c
  349. libzip-0.10/lib/zip_unchange_data.c
  350. libzip-0.10/lib/CMakeLists.txt
  351. libzip-0.10/lib/make_zip_err_str.sh
  352. libzip-0.10/lib/make_zipconf.sh
  353. libzip-0.10/src/Makefile.am
  354. libzip-0.10/src/Makefile.in
  355. libzip-0.10/src/zipcmp.c
  356. libzip-0.10/src/zipmerge.c
  357. libzip-0.10/src/ziptorrent.c
  358. libzip-0.10/src/CMakeLists.txt
  359. libzip-0.10/src/getopt.c
  360. libzip-0.10/src/getopt.h
  361. libzip-0.10/man/Makefile.am
  362. libzip-0.10/man/Makefile.in
  363. libzip-0.10/man/zipcmp.mdoc
  364. libzip-0.10/man/zipmerge.mdoc
  365. libzip-0.10/man/ziptorrent.mdoc
  366. libzip-0.10/man/libzip.mdoc
  367. libzip-0.10/man/zip_add.mdoc
  368. libzip-0.10/man/zip_add_dir.mdoc
  369. libzip-0.10/man/zip_close.mdoc
  370. libzip-0.10/man/zip_delete.mdoc
  371. libzip-0.10/man/zip_error_clear.mdoc
  372. libzip-0.10/man/zip_error_get.mdoc
  373. libzip-0.10/man/zip_error_get_sys_type.mdoc
  374. libzip-0.10/man/zip_error_to_str.mdoc
  375. libzip-0.10/man/zip_errors.mdoc
  376. libzip-0.10/man/zip_fclose.mdoc
  377. libzip-0.10/man/zip_fdopen.mdoc
  378. libzip-0.10/man/zip_file_strerror.mdoc
  379. libzip-0.10/man/zip_fopen.mdoc
  380. libzip-0.10/man/zip_fopen_encrypted.mdoc
  381. libzip-0.10/man/zip_fread.mdoc
  382. libzip-0.10/man/zip_get_archive_comment.mdoc
  383. libzip-0.10/man/zip_get_archive_flag.mdoc
  384. libzip-0.10/man/zip_get_file_comment.mdoc
  385. libzip-0.10/man/zip_get_file_extra.mdoc
  386. libzip-0.10/man/zip_get_name.mdoc
  387. libzip-0.10/man/zip_get_num_entries.mdoc
  388. libzip-0.10/man/zip_get_num_files.mdoc
  389. libzip-0.10/man/zip_name_locate.mdoc
  390. libzip-0.10/man/zip_open.mdoc
  391. libzip-0.10/man/zip_rename.mdoc
  392. libzip-0.10/man/zip_set_archive_comment.mdoc
  393. libzip-0.10/man/zip_set_archive_flag.mdoc
  394. libzip-0.10/man/zip_set_default_password.mdoc
  395. libzip-0.10/man/zip_set_file_comment.mdoc
  396. libzip-0.10/man/zip_set_file_extra.mdoc
  397. libzip-0.10/man/zip_source_buffer.mdoc
  398. libzip-0.10/man/zip_source_file.mdoc
  399. libzip-0.10/man/zip_source_filep.mdoc
  400. libzip-0.10/man/zip_source_free.mdoc
  401. libzip-0.10/man/zip_source_function.mdoc
  402. libzip-0.10/man/zip_source_zip.mdoc
  403. libzip-0.10/man/zip_stat.mdoc
  404. libzip-0.10/man/zip_stat_init.mdoc
  405. libzip-0.10/man/zip_unchange.mdoc
  406. libzip-0.10/man/zip_unchange_all.mdoc
  407. libzip-0.10/man/zip_unchange_archive.mdoc
  408. libzip-0.10/man/zipcmp.man
  409. libzip-0.10/man/zipmerge.man
  410. libzip-0.10/man/ziptorrent.man
  411. libzip-0.10/man/libzip.man
  412. libzip-0.10/man/zip_add.man
  413. libzip-0.10/man/zip_add_dir.man
  414. libzip-0.10/man/zip_close.man
  415. libzip-0.10/man/zip_delete.man
  416. libzip-0.10/man/zip_error_clear.man
  417. libzip-0.10/man/zip_error_get.man
  418. libzip-0.10/man/zip_error_get_sys_type.man
  419. libzip-0.10/man/zip_error_to_str.man
  420. libzip-0.10/man/zip_errors.man
  421. libzip-0.10/man/zip_fclose.man
  422. libzip-0.10/man/zip_fdopen.man
  423. libzip-0.10/man/zip_file_strerror.man
  424. libzip-0.10/man/zip_fopen.man
  425. libzip-0.10/man/zip_fopen_encrypted.man
  426. libzip-0.10/man/zip_fread.man
  427. libzip-0.10/man/zip_get_archive_comment.man
  428. libzip-0.10/man/zip_get_archive_flag.man
  429. libzip-0.10/man/zip_get_file_comment.man
  430. libzip-0.10/man/zip_get_file_extra.man
  431. libzip-0.10/man/zip_get_name.man
  432. libzip-0.10/man/zip_get_num_entries.man
  433. libzip-0.10/man/zip_get_num_files.man
  434. libzip-0.10/man/zip_name_locate.man
  435. libzip-0.10/man/zip_open.man
  436. libzip-0.10/man/zip_rename.man
  437. libzip-0.10/man/zip_set_archive_comment.man
  438. libzip-0.10/man/zip_set_archive_flag.man
  439. libzip-0.10/man/zip_set_default_password.man
  440. libzip-0.10/man/zip_set_file_comment.man
  441. libzip-0.10/man/zip_set_file_extra.man
  442. libzip-0.10/man/zip_source_buffer.man
  443. libzip-0.10/man/zip_source_file.man
  444. libzip-0.10/man/zip_source_filep.man
  445. libzip-0.10/man/zip_source_free.man
  446. libzip-0.10/man/zip_source_function.man
  447. libzip-0.10/man/zip_source_zip.man
  448. libzip-0.10/man/zip_stat.man
  449. libzip-0.10/man/zip_stat_init.man
  450. libzip-0.10/man/zip_unchange.man
  451. libzip-0.10/man/zip_unchange_all.man
  452. libzip-0.10/man/zip_unchange_archive.man
  453. libzip-0.10/man/CMakeLists.txt
  454. libzip-0.10/regress/Makefile.am
  455. libzip-0.10/regress/Makefile.in
  456. libzip-0.10/regress/TODO
  457. libzip-0.10/regress/add_dir.c
  458. libzip-0.10/regress/add_from_buffer.c
  459. libzip-0.10/regress/add_from_file.c
  460. libzip-0.10/regress/add_from_filep.c
  461. libzip-0.10/regress/add_from_zip.c
  462. libzip-0.10/regress/deltest.c
  463. libzip-0.10/regress/encrypt.c
  464. libzip-0.10/regress/fread.c
  465. libzip-0.10/regress/get_comment.c
  466. libzip-0.10/regress/name_locate.c
  467. libzip-0.10/regress/set_comment_all.c
  468. libzip-0.10/regress/set_comment_localonly.c
  469. libzip-0.10/regress/set_comment_removeglobal.c
  470. libzip-0.10/regress/set_comment_revert.c
  471. libzip-0.10/regress/tryopen.c
  472. libzip-0.10/regress/ziptest.c
  473. libzip-0.10/regress/CMakeLists.txt
  474. libzip-0.10/regress/runtest
  475. libzip-0.10/regress/add_dir.test
  476. libzip-0.10/regress/add_from_buffer.test
  477. libzip-0.10/regress/add_from_file.test
  478. libzip-0.10/regress/add_from_filep.test
  479. libzip-0.10/regress/add_from_zip.test
  480. libzip-0.10/regress/encrypt.test
  481. libzip-0.10/regress/fread.test
  482. libzip-0.10/regress/get_comment.test
  483. libzip-0.10/regress/name_locate.test
  484. libzip-0.10/regress/open_many_ok.test
  485. libzip-0.10/regress/open_new_but_exists.test
  486. libzip-0.10/regress/open_new_ok.test
  487. libzip-0.10/regress/open_nonarchive.test
  488. libzip-0.10/regress/open_nosuchfile.test
  489. libzip-0.10/regress/open_ok.test
  490. libzip-0.10/regress/set_comment_all.test
  491. libzip-0.10/regress/set_comment_localonly.test
  492. libzip-0.10/regress/set_comment_removeglobal.test
  493. libzip-0.10/regress/set_comment_revert.test
  494. libzip-0.10/regress/torrent-already.test
  495. libzip-0.10/regress/torrent-new.test
  496. libzip-0.10/regress/broken.zip
  497. libzip-0.10/regress/encrypt.zip
  498. libzip-0.10/regress/manyfiles.zip
  499. libzip-0.10/regress/test.zip
  500. libzip-0.10/regress/testbuffer.zip
  501. libzip-0.10/regress/testdir.zip
  502. libzip-0.10/regress/testchanged.zip
  503. libzip-0.10/regress/testchangedlocal.zip
  504. libzip-0.10/regress/testcomment.zip
  505. libzip-0.10/regress/testcommentremoved.zip
  506. libzip-0.10/regress/testfile.txt
  507. libzip-0.10/regress/testfile.zip
  508. libzip-0.10/regress/testnottorrent.zip
  509. libzip-0.10/regress/teststored.zip
  510. libzip-0.10/regress/testtorrent.tzip
  511. npm http GET https://registry.npmjs.org/htmlparser2
  512. npm http GET https://registry.npmjs.org/nwmatcher
  513. npm http GET https://registry.npmjs.org/cssom
  514. npm http GET https://registry.npmjs.org/contextify
  515. npm http GET https://registry.npmjs.org/cssstyle
  516. checking for a BSD-compatible install... /usr/bin/install -c
  517. checking whether build environment is sane... npm http 408 https://registry.npmjs.org/contextify
  518. npm ERR! registry error parsing json
  519. yes
  520. npm http 408 https://registry.npmjs.org/htmlparser2
  521. npm ERR! registry error parsing json
  522. checking for a thread-safe mkdir -p... /usr/bin/mkdir -p
  523. checking for gawk... gawk
  524. checking whether make sets $(MAKE)... yes
  525. checking for gcc... gcc
  526. npm http GET https://registry.npmjs.org/contextify
  527. npm http GET https://registry.npmjs.org/htmlparser2
  528. npm http 408 https://registry.npmjs.org/cssom
  529. npm ERR! registry error parsing json
  530. npm http 408 https://registry.npmjs.org/nwmatcher
  531. npm ERR! registry error parsing json
  532. npm http 408 https://registry.npmjs.org/cssstyle
  533. npm ERR! registry error parsing json
  534. npm http GET https://registry.npmjs.org/cssom
  535. checking whether the C compiler works... npm http 304 https://registry.npmjs.org/htmlparser2
  536. npm http 304 https://registry.npmjs.org/contextify
  537. yes
  538. checking for C compiler default output file name... a.out
  539. checking for suffix of executables... npm http 304 https://registry.npmjs.org/cssom
  540. npm WARN package.json cssom@0.2.5 No README.md file found!
  541.  
  542. checking whether we are cross compiling...
  543. > srs@0.2.20 install /tmp/tilemill/pkg/tilemill/usr/lib/node_modules/tilemill/node_modules/millstone/node_modules/srs
  544. > node-waf -v configure build
  545.  
  546. no
  547. checking for suffix of object files... o
  548. checking whether we are using the GNU C compiler... yes
  549. checking whether gcc accepts -g... yes
  550. checking for gcc option to accept ISO C89... none needed
  551. checking for style of include used by make... GNU
  552. checking dependency style of gcc... none
  553. checking whether gcc and cc understand -c and -o together... yes
  554. npm http GET https://registry.npmjs.org/nwmatcher
  555. checking for main in -lz... yes
  556. checking new ZLIB version... Setting srcdir to                        : /tmp/tilemill/pkg/tilemill/usr/lib/node_modules/tilemill/node_modules/millstone/node_modules/srs
  557. Setting blddir to                        : /tmp/tilemill/pkg/tilemill/usr/lib/node_modules/tilemill/node_modules/millstone/node_modules/srs/build
  558. Checking for program g++ or c++          : /usr/bin/g++
  559. yes
  560. Checking for program cpp                 : /usr/bin/cpp
  561. Checking for program ar                  : /usr/bin/ar
  562. Checking for program ranlib              : /usr/bin/ranlib
  563. checking build system type... Checking for g++                         : ok  
  564. Checking for node path                   : not found
  565. Checking for node prefix                 : ok /usr
  566. 'configure' finished successfully (0.304s)
  567. Waf: Entering directory `/tmp/tilemill/pkg/tilemill/usr/lib/node_modules/tilemill/node_modules/millstone/node_modules/srs/build'
  568. [1/3] /tmp/tilemill/pkg/tilemill/usr/lib/node_modules/tilemill/node_modules/millstone/node_modules/srs/tools/scons/scons.py -C ../deps/osr: deps/osr/SConstruct
  569. 11:39:24 runner system command ->  /tmp/tilemill/pkg/tilemill/usr/lib/node_modules/tilemill/node_modules/millstone/node_modules/srs/tools/scons/scons.py -C ../deps/osr
  570. npm http 304 https://registry.npmjs.org/nwmatcher
  571. npm WARN package.json nwmatcher@1.3.1 No README.md file found!
  572. x86_64-unknown-linux-gnu
  573. checking host system type... x86_64-unknown-linux-gnu
  574. checking for a sed that does not truncate output... /usr/bin/sed
  575. checking for grep that handles long lines and -e... /usr/bin/grep
  576. checking for egrep... /usr/bin/grep -E
  577. checking for fgrep... /usr/bin/grep -F
  578. checking for ld used by gcc... /usr/bin/ld
  579. checking if the linker (/usr/bin/ld) is GNU ld... yes
  580. checking for BSD- or MS-compatible name lister (nm)... /usr/bin/nm -B
  581. checking the name lister (/usr/bin/nm -B) interface... BSD nm
  582. checking whether ln -s works... yes
  583. checking the maximum length of command line arguments... 1572864
  584. checking whether the shell understands some XSI constructs... yes
  585. checking whether the shell understands "+="... yes
  586. checking for /usr/bin/ld option to reload object files... -r
  587. checking for objdump... objdump
  588. checking how to recognize dependent libraries... pass_all
  589. checking for ar... ar
  590. checking for strip... strip
  591. checking for ranlib... ranlib
  592. checking command to parse /usr/bin/nm -B output from gcc object... ok
  593. checking how to run the C preprocessor... gcc -E
  594. scons: Reading SConscript files ...
  595. checking for ANSI C header files... yes
  596. checking for sys/types.h... scons: done reading SConscript files.
  597. scons: Building targets ...
  598. g++ -o ogr/ogr_srs_erm.o -c -march=x86-64 -mtune=generic -O2 -pipe -fstack-protector --param=ssp-buffer-size=4 -Iport -Iogr -O3 -Wall -DNDEBUG -fPIC -fno-exceptions -DCPL_LSB ogr/ogr_srs_erm.cpp
  599. yes
  600. checking for sys/stat.h... yes
  601. checking for stdlib.h... yes
  602. checking for string.h... g++ -o ogr/ogr_srs_panorama.o -c -march=x86-64 -mtune=generic -O2 -pipe -fstack-protector --param=ssp-buffer-size=4 -Iport -Iogr -O3 -Wall -DNDEBUG -fPIC -fno-exceptions -DCPL_LSB ogr/ogr_srs_panorama.cpp
  603. yes
  604. checking for memory.h... npm http GET https://registry.npmjs.org/cssstyle
  605. yes
  606. checking for strings.h... yes
  607. checking for inttypes.h... npm http 304 https://registry.npmjs.org/cssstyle
  608. yes
  609. checking for stdint.h... yes
  610. checking for unistd.h... g++ -o ogr/ogr_srs_xml.o -c -march=x86-64 -mtune=generic -O2 -pipe -fstack-protector --param=ssp-buffer-size=4 -Iport -Iogr -O3 -Wall -DNDEBUG -fPIC -fno-exceptions -DCPL_LSB ogr/ogr_srs_xml.cpp
  611. npm http GET https://registry.npmjs.org/bindings
  612. yes
  613. checking for dlfcn.h... npm http GET https://registry.npmjs.org/domhandler
  614. npm http GET https://registry.npmjs.org/domutils
  615. npm http GET https://registry.npmjs.org/domelementtype
  616. npm http GET https://registry.npmjs.org/readable-stream
  617. yes
  618. checking for objdir... .libs
  619. ogr/ogr_srs_xml.cpp: In function 'void addGMLId(CPLXMLNode*)':
  620. ogr/ogr_srs_xml.cpp:245:17: warning: variable 'psId' set but not used [-Wunused-but-set-variable]
  621.      CPLXMLNode *psId;
  622.                  ^
  623. checking if gcc supports -fno-rtti -fno-exceptions... npm http 304 https://registry.npmjs.org/bindings
  624. no
  625. checking for gcc option to produce PIC... -fPIC -DPIC
  626. checking if gcc PIC flag -fPIC -DPIC works... npm http 304 https://registry.npmjs.org/domutils
  627. npm http 304 https://registry.npmjs.org/domelementtype
  628. npm http 304 https://registry.npmjs.org/domhandler
  629.  
  630. > contextify@0.1.5 install /tmp/tilemill/pkg/tilemill/usr/lib/node_modules/tilemill/node_modules/bones/node_modules/jquery/node_modules/jsdom/node_modules/contextify
  631. > node-gyp rebuild
  632.  
  633. yes
  634. checking if gcc static flag -static works... npm http 304 https://registry.npmjs.org/readable-stream
  635. g++ -o ogr/ogr_srs_validate.o -c -march=x86-64 -mtune=generic -O2 -pipe -fstack-protector --param=ssp-buffer-size=4 -Iport -Iogr -O3 -Wall -DNDEBUG -fPIC -fno-exceptions -DCPL_LSB ogr/ogr_srs_validate.cpp
  636. yes
  637. checking if gcc supports -c -o file.o... yes
  638. checking if gcc supports -c -o file.o... (cached) yes
  639. checking whether the gcc linker (/usr/bin/ld -m elf_x86_64) supports shared libraries... yes
  640. checking dynamic linker characteristics... GNU/Linux ld.so
  641. checking how to hardcode library paths into programs... immediate
  642. checking whether stripping libraries is possible... yes
  643. checking if libtool supports shared libraries... yes
  644. checking whether to build shared libraries... no
  645. checking whether to build static libraries... yes
  646. checking for _open... no
  647. checking for _snprintf... g++ -o ogr/ogr_srs_dict.o -c -march=x86-64 -mtune=generic -O2 -pipe -fstack-protector --param=ssp-buffer-size=4 -Iport -Iogr -O3 -Wall -DNDEBUG -fPIC -fno-exceptions -DCPL_LSB ogr/ogr_srs_dict.cpp
  648. no
  649. checking for _strcmpi... g++ -o ogr/ogr_srs_proj4.o -c -march=x86-64 -mtune=generic -O2 -pipe -fstack-protector --param=ssp-buffer-size=4 -Iport -Iogr -O3 -Wall -DNDEBUG -fPIC -fno-exceptions -DCPL_LSB ogr/ogr_srs_proj4.cpp
  650. no
  651. checking for _strdup... no
  652. checking for _stricmp... ogr/ogr_srs_proj4.cpp: In member function 'OGRErr OGRSpatialReference::importFromProj4(const char*)':
  653. ogr/ogr_srs_proj4.cpp:423:12: warning: variable 'nPMCode' set but not used [-Wunused-but-set-variable]
  654.      int    nPMCode = -1;
  655.             ^
  656. no
  657. checking for fseeko... make: Entering directory `/tmp/tilemill/pkg/tilemill/usr/lib/node_modules/tilemill/node_modules/bones/node_modules/jquery/node_modules/jsdom/node_modules/contextify/build'
  658.   CXX(target) Release/obj.target/contextify/src/contextify.o
  659. yes
  660. checking for ftello... yes
  661. checking for getopt... yes
  662. checking for open... yes
  663. checking for snprintf... ^[[Cyes
  664. checking for strcasecmp... {standard input}: Assembler messages:
  665. {standard input}:4006: Warning: end of file not at end of a line; newline inserted
  666. {standard input}:4137: Error: unbalanced parenthesis in operand 1.
  667. {standard input}: Error: open CFI at the end of file; missing .cfi_endproc directive
  668. g++: internal compiler error: Killed (program cc1plus)
  669. Please submit a full bug report,
  670. with preprocessed source if appropriate.
  671. See <https://bugs.archlinux.org/> for instructions.
  672. yes
  673. checking for strdup... g++ -o ogr/ogr_srs_pci.o -c -march=x86-64 -mtune=generic -O2 -pipe -fstack-protector --param=ssp-buffer-size=4 -Iport -Iogr -O3 -Wall -DNDEBUG -fPIC -fno-exceptions -DCPL_LSB ogr/ogr_srs_pci.cpp
  674.   SOLINK_MODULE(target) Release/obj.target/contextify.node
  675. yes
  676. checking for mkstemp...   SOLINK_MODULE(target) Release/obj.target/contextify.node: Finished
  677.   COPY Release/contextify.node
  678. make: Leaving directory `/tmp/tilemill/pkg/tilemill/usr/lib/node_modules/tilemill/node_modules/bones/node_modules/jquery/node_modules/jsdom/node_modules/contextify/build'
  679. yes
  680. checking MoveFileExA... no
  681. checking for unistd.h... (cached) yes
  682. checking for int8_t... ogr/ogr_srs_pci.cpp: In member function 'OGRErr OGRSpatialReference::exportToPCI(char**, char**, double**) const':
  683. ogr/ogr_srs_pci.cpp:816:12: warning: variable 'dfFromGreenwich' set but not used [-Wunused-but-set-variable]
  684.      double dfFromGreenwich = 0.0;
  685.             ^
  686. yes
  687. checking for int16_t... yes
  688. checking for int32_t... yes
  689. checking for int64_t... yes
  690. checking for uint8_t... yes
  691. checking for uint16_t... yes
  692. checking for uint32_t... g++ -o ogr/ogr_srs_ozi.o -c -march=x86-64 -mtune=generic -O2 -pipe -fstack-protector --param=ssp-buffer-size=4 -Iport -Iogr -O3 -Wall -DNDEBUG -fPIC -fno-exceptions -DCPL_LSB ogr/ogr_srs_ozi.cpp
  693. yes
  694. checking for uint64_t... yes
  695. checking size of short... g++ -o ogr/ogr_srsnode.o -c -march=x86-64 -mtune=generic -O2 -pipe -fstack-protector --param=ssp-buffer-size=4 -Iport -Iogr -O3 -Wall -DNDEBUG -fPIC -fno-exceptions -DCPL_LSB ogr/ogr_srsnode.cpp
  696. 2
  697. checking size of int... 4
  698. checking size of long... g++ -o ogr/ogr_srs_usgs.o -c -march=x86-64 -mtune=generic -O2 -pipe -fstack-protector --param=ssp-buffer-size=4 -Iport -Iogr -O3 -Wall -DNDEBUG -fPIC -fno-exceptions -DCPL_LSB ogr/ogr_srs_usgs.cpp
  699. 8
  700. checking size of long long... 8
  701. checking whether struct tm is in sys/time.h or time.h... time.h
  702. checking for struct tm.tm_zone... yes
  703. configure: creating ./config.status
  704. g++ -o ogr/ogr_srs_esri.o -c -march=x86-64 -mtune=generic -O2 -pipe -fstack-protector --param=ssp-buffer-size=4 -Iport -Iogr -O3 -Wall -DNDEBUG -fPIC -fno-exceptions -DCPL_LSB ogr/ogr_srs_esri.cpp
  705. config.status: creating Makefile
  706. config.status: creating libzip.pc
  707. config.status: creating libzip-uninstalled.pc
  708. config.status: creating man/Makefile
  709. config.status: creating lib/Makefile
  710. config.status: creating regress/Makefile
  711. config.status: creating src/Makefile
  712. config.status: creating config.h
  713. config.status: executing depfiles commands
  714. config.status: executing libtool commands
  715. 'configure' finished successfully (7m2.815s)
  716. Waf: Entering directory `/tmp/tilemill/pkg/tilemill/usr/lib/node_modules/tilemill/node_modules/millstone/node_modules/zipfile/build'
  717. make  all-recursive
  718. make[1]: Entering directory `/tmp/tilemill/pkg/tilemill/usr/lib/node_modules/tilemill/node_modules/millstone/node_modules/zipfile/deps/libzip-0.10'
  719. Making all in lib
  720. make[2]: Entering directory `/tmp/tilemill/pkg/tilemill/usr/lib/node_modules/tilemill/node_modules/millstone/node_modules/zipfile/deps/libzip-0.10/lib'
  721. sh ./make_zipconf.sh ../config.h zipconf.h
  722. make  all-am
  723. make[3]: Entering directory `/tmp/tilemill/pkg/tilemill/usr/lib/node_modules/tilemill/node_modules/millstone/node_modules/zipfile/deps/libzip-0.10/lib'
  724. /bin/sh ../libtool --tag=CC   --mode=compile gcc -DHAVE_CONFIG_H -I. -I..   -D_FORTIFY_SOURCE=2  -march=x86-64 -mtune=generic -O2 -pipe -fstack-protector --param=ssp-buffer-size=4 -march=x86-64 -mtune=generic -O2 -pipe -fstack-protector --param=ssp-buffer-size=4 -fPIC -O3 -DNDEBUG -Wall -c -o zip_add.lo zip_add.c
  725. libtool: compile:  gcc -DHAVE_CONFIG_H -I. -I.. -D_FORTIFY_SOURCE=2 -march=x86-64 -mtune=generic -O2 -pipe -fstack-protector --param=ssp-buffer-size=4 -march=x86-64 -mtune=generic -O2 -pipe -fstack-protector --param=ssp-buffer-size=4 -fPIC -O3 -DNDEBUG -Wall -c zip_add.c -o zip_add.o
  726. /bin/sh ../libtool --tag=CC   --mode=compile gcc -DHAVE_CONFIG_H -I. -I..   -D_FORTIFY_SOURCE=2  -march=x86-64 -mtune=generic -O2 -pipe -fstack-protector --param=ssp-buffer-size=4 -march=x86-64 -mtune=generic -O2 -pipe -fstack-protector --param=ssp-buffer-size=4 -fPIC -O3 -DNDEBUG -Wall -c -o zip_add_dir.lo zip_add_dir.c
  727. libtool: compile:  gcc -DHAVE_CONFIG_H -I. -I.. -D_FORTIFY_SOURCE=2 -march=x86-64 -mtune=generic -O2 -pipe -fstack-protector --param=ssp-buffer-size=4 -march=x86-64 -mtune=generic -O2 -pipe -fstack-protector --param=ssp-buffer-size=4 -fPIC -O3 -DNDEBUG -Wall -c zip_add_dir.c -o zip_add_dir.o
  728. /bin/sh ../libtool --tag=CC   --mode=compile gcc -DHAVE_CONFIG_H -I. -I..   -D_FORTIFY_SOURCE=2  -march=x86-64 -mtune=generic -O2 -pipe -fstack-protector --param=ssp-buffer-size=4 -march=x86-64 -mtune=generic -O2 -pipe -fstack-protector --param=ssp-buffer-size=4 -fPIC -O3 -DNDEBUG -Wall -c -o zip_close.lo zip_close.c
  729. libtool: compile:  gcc -DHAVE_CONFIG_H -I. -I.. -D_FORTIFY_SOURCE=2 -march=x86-64 -mtune=generic -O2 -pipe -fstack-protector --param=ssp-buffer-size=4 -march=x86-64 -mtune=generic -O2 -pipe -fstack-protector --param=ssp-buffer-size=4 -fPIC -O3 -DNDEBUG -Wall -c zip_close.c -o zip_close.o
  730. g++ -o ogr/ogrct.o -c -march=x86-64 -mtune=generic -O2 -pipe -fstack-protector --param=ssp-buffer-size=4 -Iport -Iogr -O3 -Wall -DNDEBUG -fPIC -fno-exceptions -DCPL_LSB ogr/ogrct.cpp
  731. /bin/sh ../libtool --tag=CC   --mode=compile gcc -DHAVE_CONFIG_H -I. -I..   -D_FORTIFY_SOURCE=2  -march=x86-64 -mtune=generic -O2 -pipe -fstack-protector --param=ssp-buffer-size=4 -march=x86-64 -mtune=generic -O2 -pipe -fstack-protector --param=ssp-buffer-size=4 -fPIC -O3 -DNDEBUG -Wall -c -o zip_delete.lo zip_delete.c
  732. libtool: compile:  gcc -DHAVE_CONFIG_H -I. -I.. -D_FORTIFY_SOURCE=2 -march=x86-64 -mtune=generic -O2 -pipe -fstack-protector --param=ssp-buffer-size=4 -march=x86-64 -mtune=generic -O2 -pipe -fstack-protector --param=ssp-buffer-size=4 -fPIC -O3 -DNDEBUG -Wall -c zip_delete.c -o zip_delete.o
  733. /bin/sh ../libtool --tag=CC   --mode=compile gcc -DHAVE_CONFIG_H -I. -I..   -D_FORTIFY_SOURCE=2  -march=x86-64 -mtune=generic -O2 -pipe -fstack-protector --param=ssp-buffer-size=4 -march=x86-64 -mtune=generic -O2 -pipe -fstack-protector --param=ssp-buffer-size=4 -fPIC -O3 -DNDEBUG -Wall -c -o zip_dirent.lo zip_dirent.c
  734. libtool: compile:  gcc -DHAVE_CONFIG_H -I. -I.. -D_FORTIFY_SOURCE=2 -march=x86-64 -mtune=generic -O2 -pipe -fstack-protector --param=ssp-buffer-size=4 -march=x86-64 -mtune=generic -O2 -pipe -fstack-protector --param=ssp-buffer-size=4 -fPIC -O3 -DNDEBUG -Wall -c zip_dirent.c -o zip_dirent.o
  735. g++ -o ogr/ogrspatialreference.o -c -march=x86-64 -mtune=generic -O2 -pipe -fstack-protector --param=ssp-buffer-size=4 -Iport -Iogr -O3 -Wall -DNDEBUG -fPIC -fno-exceptions -DCPL_LSB ogr/ogrspatialreference.cpp
  736. /bin/sh ../libtool --tag=CC   --mode=compile gcc -DHAVE_CONFIG_H -I. -I..   -D_FORTIFY_SOURCE=2  -march=x86-64 -mtune=generic -O2 -pipe -fstack-protector --param=ssp-buffer-size=4 -march=x86-64 -mtune=generic -O2 -pipe -fstack-protector --param=ssp-buffer-size=4 -fPIC -O3 -DNDEBUG -Wall -c -o zip_entry_free.lo zip_entry_free.c
  737. libtool: compile:  gcc -DHAVE_CONFIG_H -I. -I.. -D_FORTIFY_SOURCE=2 -march=x86-64 -mtune=generic -O2 -pipe -fstack-protector --param=ssp-buffer-size=4 -march=x86-64 -mtune=generic -O2 -pipe -fstack-protector --param=ssp-buffer-size=4 -fPIC -O3 -DNDEBUG -Wall -c zip_entry_free.c -o zip_entry_free.o
  738. /bin/sh ../libtool --tag=CC   --mode=compile gcc -DHAVE_CONFIG_H -I. -I..   -D_FORTIFY_SOURCE=2  -march=x86-64 -mtune=generic -O2 -pipe -fstack-protector --param=ssp-buffer-size=4 -march=x86-64 -mtune=generic -O2 -pipe -fstack-protector --param=ssp-buffer-size=4 -fPIC -O3 -DNDEBUG -Wall -c -o zip_entry_new.lo zip_entry_new.c
  739. libtool: compile:  gcc -DHAVE_CONFIG_H -I. -I.. -D_FORTIFY_SOURCE=2 -march=x86-64 -mtune=generic -O2 -pipe -fstack-protector --param=ssp-buffer-size=4 -march=x86-64 -mtune=generic -O2 -pipe -fstack-protector --param=ssp-buffer-size=4 -fPIC -O3 -DNDEBUG -Wall -c zip_entry_new.c -o zip_entry_new.o
  740. /bin/sh ../libtool --tag=CC   --mode=compile gcc -DHAVE_CONFIG_H -I. -I..   -D_FORTIFY_SOURCE=2  -march=x86-64 -mtune=generic -O2 -pipe -fstack-protector --param=ssp-buffer-size=4 -march=x86-64 -mtune=generic -O2 -pipe -fstack-protector --param=ssp-buffer-size=4 -fPIC -O3 -DNDEBUG -Wall -c -o zip_err_str.lo zip_err_str.c
  741. libtool: compile:  gcc -DHAVE_CONFIG_H -I. -I.. -D_FORTIFY_SOURCE=2 -march=x86-64 -mtune=generic -O2 -pipe -fstack-protector --param=ssp-buffer-size=4 -march=x86-64 -mtune=generic -O2 -pipe -fstack-protector --param=ssp-buffer-size=4 -fPIC -O3 -DNDEBUG -Wall -c zip_err_str.c -o zip_err_str.o
  742. /bin/sh ../libtool --tag=CC   --mode=compile gcc -DHAVE_CONFIG_H -I. -I..   -D_FORTIFY_SOURCE=2  -march=x86-64 -mtune=generic -O2 -pipe -fstack-protector --param=ssp-buffer-size=4 -march=x86-64 -mtune=generic -O2 -pipe -fstack-protector --param=ssp-buffer-size=4 -fPIC -O3 -DNDEBUG -Wall -c -o zip_error.lo zip_error.c
  743. libtool: compile:  gcc -DHAVE_CONFIG_H -I. -I.. -D_FORTIFY_SOURCE=2 -march=x86-64 -mtune=generic -O2 -pipe -fstack-protector --param=ssp-buffer-size=4 -march=x86-64 -mtune=generic -O2 -pipe -fstack-protector --param=ssp-buffer-size=4 -fPIC -O3 -DNDEBUG -Wall -c zip_error.c -o zip_error.o
  744. /bin/sh ../libtool --tag=CC   --mode=compile gcc -DHAVE_CONFIG_H -I. -I..   -D_FORTIFY_SOURCE=2  -march=x86-64 -mtune=generic -O2 -pipe -fstack-protector --param=ssp-buffer-size=4 -march=x86-64 -mtune=generic -O2 -pipe -fstack-protector --param=ssp-buffer-size=4 -fPIC -O3 -DNDEBUG -Wall -c -o zip_error_clear.lo zip_error_clear.c
  745. libtool: compile:  gcc -DHAVE_CONFIG_H -I. -I.. -D_FORTIFY_SOURCE=2 -march=x86-64 -mtune=generic -O2 -pipe -fstack-protector --param=ssp-buffer-size=4 -march=x86-64 -mtune=generic -O2 -pipe -fstack-protector --param=ssp-buffer-size=4 -fPIC -O3 -DNDEBUG -Wall -c zip_error_clear.c -o zip_error_clear.o
  746. /bin/sh ../libtool --tag=CC   --mode=compile gcc -DHAVE_CONFIG_H -I. -I..   -D_FORTIFY_SOURCE=2  -march=x86-64 -mtune=generic -O2 -pipe -fstack-protector --param=ssp-buffer-size=4 -march=x86-64 -mtune=generic -O2 -pipe -fstack-protector --param=ssp-buffer-size=4 -fPIC -O3 -DNDEBUG -Wall -c -o zip_error_get.lo zip_error_get.c
  747. libtool: compile:  gcc -DHAVE_CONFIG_H -I. -I.. -D_FORTIFY_SOURCE=2 -march=x86-64 -mtune=generic -O2 -pipe -fstack-protector --param=ssp-buffer-size=4 -march=x86-64 -mtune=generic -O2 -pipe -fstack-protector --param=ssp-buffer-size=4 -fPIC -O3 -DNDEBUG -Wall -c zip_error_get.c -o zip_error_get.o
  748. /bin/sh ../libtool --tag=CC   --mode=compile gcc -DHAVE_CONFIG_H -I. -I..   -D_FORTIFY_SOURCE=2  -march=x86-64 -mtune=generic -O2 -pipe -fstack-protector --param=ssp-buffer-size=4 -march=x86-64 -mtune=generic -O2 -pipe -fstack-protector --param=ssp-buffer-size=4 -fPIC -O3 -DNDEBUG -Wall -c -o zip_error_get_sys_type.lo zip_error_get_sys_type.c
  749. libtool: compile:  gcc -DHAVE_CONFIG_H -I. -I.. -D_FORTIFY_SOURCE=2 -march=x86-64 -mtune=generic -O2 -pipe -fstack-protector --param=ssp-buffer-size=4 -march=x86-64 -mtune=generic -O2 -pipe -fstack-protector --param=ssp-buffer-size=4 -fPIC -O3 -DNDEBUG -Wall -c zip_error_get_sys_type.c -o zip_error_get_sys_type.o
  750. /bin/sh ../libtool --tag=CC   --mode=compile gcc -DHAVE_CONFIG_H -I. -I..   -D_FORTIFY_SOURCE=2  -march=x86-64 -mtune=generic -O2 -pipe -fstack-protector --param=ssp-buffer-size=4 -march=x86-64 -mtune=generic -O2 -pipe -fstack-protector --param=ssp-buffer-size=4 -fPIC -O3 -DNDEBUG -Wall -c -o zip_error_strerror.lo zip_error_strerror.c
  751. libtool: compile:  gcc -DHAVE_CONFIG_H -I. -I.. -D_FORTIFY_SOURCE=2 -march=x86-64 -mtune=generic -O2 -pipe -fstack-protector --param=ssp-buffer-size=4 -march=x86-64 -mtune=generic -O2 -pipe -fstack-protector --param=ssp-buffer-size=4 -fPIC -O3 -DNDEBUG -Wall -c zip_error_strerror.c -o zip_error_strerror.o
  752. /bin/sh ../libtool --tag=CC   --mode=compile gcc -DHAVE_CONFIG_H -I. -I..   -D_FORTIFY_SOURCE=2  -march=x86-64 -mtune=generic -O2 -pipe -fstack-protector --param=ssp-buffer-size=4 -march=x86-64 -mtune=generic -O2 -pipe -fstack-protector --param=ssp-buffer-size=4 -fPIC -O3 -DNDEBUG -Wall -c -o zip_error_to_str.lo zip_error_to_str.c
  753. libtool: compile:  gcc -DHAVE_CONFIG_H -I. -I.. -D_FORTIFY_SOURCE=2 -march=x86-64 -mtune=generic -O2 -pipe -fstack-protector --param=ssp-buffer-size=4 -march=x86-64 -mtune=generic -O2 -pipe -fstack-protector --param=ssp-buffer-size=4 -fPIC -O3 -DNDEBUG -Wall -c zip_error_to_str.c -o zip_error_to_str.o
  754. /bin/sh ../libtool --tag=CC   --mode=compile gcc -DHAVE_CONFIG_H -I. -I..   -D_FORTIFY_SOURCE=2  -march=x86-64 -mtune=generic -O2 -pipe -fstack-protector --param=ssp-buffer-size=4 -march=x86-64 -mtune=generic -O2 -pipe -fstack-protector --param=ssp-buffer-size=4 -fPIC -O3 -DNDEBUG -Wall -c -o zip_fclose.lo zip_fclose.c
  755. libtool: compile:  gcc -DHAVE_CONFIG_H -I. -I.. -D_FORTIFY_SOURCE=2 -march=x86-64 -mtune=generic -O2 -pipe -fstack-protector --param=ssp-buffer-size=4 -march=x86-64 -mtune=generic -O2 -pipe -fstack-protector --param=ssp-buffer-size=4 -fPIC -O3 -DNDEBUG -Wall -c zip_fclose.c -o zip_fclose.o
  756. /bin/sh ../libtool --tag=CC   --mode=compile gcc -DHAVE_CONFIG_H -I. -I..   -D_FORTIFY_SOURCE=2  -march=x86-64 -mtune=generic -O2 -pipe -fstack-protector --param=ssp-buffer-size=4 -march=x86-64 -mtune=generic -O2 -pipe -fstack-protector --param=ssp-buffer-size=4 -fPIC -O3 -DNDEBUG -Wall -c -o zip_fdopen.lo zip_fdopen.c
  757. libtool: compile:  gcc -DHAVE_CONFIG_H -I. -I.. -D_FORTIFY_SOURCE=2 -march=x86-64 -mtune=generic -O2 -pipe -fstack-protector --param=ssp-buffer-size=4 -march=x86-64 -mtune=generic -O2 -pipe -fstack-protector --param=ssp-buffer-size=4 -fPIC -O3 -DNDEBUG -Wall -c zip_fdopen.c -o zip_fdopen.o
  758. /bin/sh ../libtool --tag=CC   --mode=compile gcc -DHAVE_CONFIG_H -I. -I..   -D_FORTIFY_SOURCE=2  -march=x86-64 -mtune=generic -O2 -pipe -fstack-protector --param=ssp-buffer-size=4 -march=x86-64 -mtune=generic -O2 -pipe -fstack-protector --param=ssp-buffer-size=4 -fPIC -O3 -DNDEBUG -Wall -c -o zip_file_error_clear.lo zip_file_error_clear.c
  759. libtool: compile:  gcc -DHAVE_CONFIG_H -I. -I.. -D_FORTIFY_SOURCE=2 -march=x86-64 -mtune=generic -O2 -pipe -fstack-protector --param=ssp-buffer-size=4 -march=x86-64 -mtune=generic -O2 -pipe -fstack-protector --param=ssp-buffer-size=4 -fPIC -O3 -DNDEBUG -Wall -c zip_file_error_clear.c -o zip_file_error_clear.o
  760. /bin/sh ../libtool --tag=CC   --mode=compile gcc -DHAVE_CONFIG_H -I. -I..   -D_FORTIFY_SOURCE=2  -march=x86-64 -mtune=generic -O2 -pipe -fstack-protector --param=ssp-buffer-size=4 -march=x86-64 -mtune=generic -O2 -pipe -fstack-protector --param=ssp-buffer-size=4 -fPIC -O3 -DNDEBUG -Wall -c -o zip_file_error_get.lo zip_file_error_get.c
  761. libtool: compile:  gcc -DHAVE_CONFIG_H -I. -I.. -D_FORTIFY_SOURCE=2 -march=x86-64 -mtune=generic -O2 -pipe -fstack-protector --param=ssp-buffer-size=4 -march=x86-64 -mtune=generic -O2 -pipe -fstack-protector --param=ssp-buffer-size=4 -fPIC -O3 -DNDEBUG -Wall -c zip_file_error_get.c -o zip_file_error_get.o
  762. /bin/sh ../libtool --tag=CC   --mode=compile gcc -DHAVE_CONFIG_H -I. -I..   -D_FORTIFY_SOURCE=2  -march=x86-64 -mtune=generic -O2 -pipe -fstack-protector --param=ssp-buffer-size=4 -march=x86-64 -mtune=generic -O2 -pipe -fstack-protector --param=ssp-buffer-size=4 -fPIC -O3 -DNDEBUG -Wall -c -o zip_file_get_offset.lo zip_file_get_offset.c
  763. libtool: compile:  gcc -DHAVE_CONFIG_H -I. -I.. -D_FORTIFY_SOURCE=2 -march=x86-64 -mtune=generic -O2 -pipe -fstack-protector --param=ssp-buffer-size=4 -march=x86-64 -mtune=generic -O2 -pipe -fstack-protector --param=ssp-buffer-size=4 -fPIC -O3 -DNDEBUG -Wall -c zip_file_get_offset.c -o zip_file_get_offset.o
  764. /bin/sh ../libtool --tag=CC   --mode=compile gcc -DHAVE_CONFIG_H -I. -I..   -D_FORTIFY_SOURCE=2  -march=x86-64 -mtune=generic -O2 -pipe -fstack-protector --param=ssp-buffer-size=4 -march=x86-64 -mtune=generic -O2 -pipe -fstack-protector --param=ssp-buffer-size=4 -fPIC -O3 -DNDEBUG -Wall -c -o zip_file_strerror.lo zip_file_strerror.c
  765. libtool: compile:  gcc -DHAVE_CONFIG_H -I. -I.. -D_FORTIFY_SOURCE=2 -march=x86-64 -mtune=generic -O2 -pipe -fstack-protector --param=ssp-buffer-size=4 -march=x86-64 -mtune=generic -O2 -pipe -fstack-protector --param=ssp-buffer-size=4 -fPIC -O3 -DNDEBUG -Wall -c zip_file_strerror.c -o zip_file_strerror.o
  766. /bin/sh ../libtool --tag=CC   --mode=compile gcc -DHAVE_CONFIG_H -I. -I..   -D_FORTIFY_SOURCE=2  -march=x86-64 -mtune=generic -O2 -pipe -fstack-protector --param=ssp-buffer-size=4 -march=x86-64 -mtune=generic -O2 -pipe -fstack-protector --param=ssp-buffer-size=4 -fPIC -O3 -DNDEBUG -Wall -c -o zip_filerange_crc.lo zip_filerange_crc.c
  767. libtool: compile:  gcc -DHAVE_CONFIG_H -I. -I.. -D_FORTIFY_SOURCE=2 -march=x86-64 -mtune=generic -O2 -pipe -fstack-protector --param=ssp-buffer-size=4 -march=x86-64 -mtune=generic -O2 -pipe -fstack-protector --param=ssp-buffer-size=4 -fPIC -O3 -DNDEBUG -Wall -c zip_filerange_crc.c -o zip_filerange_crc.o
  768. /bin/sh ../libtool --tag=CC   --mode=compile gcc -DHAVE_CONFIG_H -I. -I..   -D_FORTIFY_SOURCE=2  -march=x86-64 -mtune=generic -O2 -pipe -fstack-protector --param=ssp-buffer-size=4 -march=x86-64 -mtune=generic -O2 -pipe -fstack-protector --param=ssp-buffer-size=4 -fPIC -O3 -DNDEBUG -Wall -c -o zip_fopen.lo zip_fopen.c
  769. libtool: compile:  gcc -DHAVE_CONFIG_H -I. -I.. -D_FORTIFY_SOURCE=2 -march=x86-64 -mtune=generic -O2 -pipe -fstack-protector --param=ssp-buffer-size=4 -march=x86-64 -mtune=generic -O2 -pipe -fstack-protector --param=ssp-buffer-size=4 -fPIC -O3 -DNDEBUG -Wall -c zip_fopen.c -o zip_fopen.o
  770. /bin/sh ../libtool --tag=CC   --mode=compile gcc -DHAVE_CONFIG_H -I. -I..   -D_FORTIFY_SOURCE=2  -march=x86-64 -mtune=generic -O2 -pipe -fstack-protector --param=ssp-buffer-size=4 -march=x86-64 -mtune=generic -O2 -pipe -fstack-protector --param=ssp-buffer-size=4 -fPIC -O3 -DNDEBUG -Wall -c -o zip_fopen_encrypted.lo zip_fopen_encrypted.c
  771. g++ -o ogr/ogr_fromepsg.o -c -march=x86-64 -mtune=generic -O2 -pipe -fstack-protector --param=ssp-buffer-size=4 -Iport -Iogr -O3 -Wall -DNDEBUG -fPIC -fno-exceptions -DCPL_LSB ogr/ogr_fromepsg.cpp
  772. libtool: compile:  gcc -DHAVE_CONFIG_H -I. -I.. -D_FORTIFY_SOURCE=2 -march=x86-64 -mtune=generic -O2 -pipe -fstack-protector --param=ssp-buffer-size=4 -march=x86-64 -mtune=generic -O2 -pipe -fstack-protector --param=ssp-buffer-size=4 -fPIC -O3 -DNDEBUG -Wall -c zip_fopen_encrypted.c -o zip_fopen_encrypted.o
  773. /bin/sh ../libtool --tag=CC   --mode=compile gcc -DHAVE_CONFIG_H -I. -I..   -D_FORTIFY_SOURCE=2  -march=x86-64 -mtune=generic -O2 -pipe -fstack-protector --param=ssp-buffer-size=4 -march=x86-64 -mtune=generic -O2 -pipe -fstack-protector --param=ssp-buffer-size=4 -fPIC -O3 -DNDEBUG -Wall -c -o zip_fopen_index.lo zip_fopen_index.c
  774. libtool: compile:  gcc -DHAVE_CONFIG_H -I. -I.. -D_FORTIFY_SOURCE=2 -march=x86-64 -mtune=generic -O2 -pipe -fstack-protector --param=ssp-buffer-size=4 -march=x86-64 -mtune=generic -O2 -pipe -fstack-protector --param=ssp-buffer-size=4 -fPIC -O3 -DNDEBUG -Wall -c zip_fopen_index.c -o zip_fopen_index.o
  775. /bin/sh ../libtool --tag=CC   --mode=compile gcc -DHAVE_CONFIG_H -I. -I..   -D_FORTIFY_SOURCE=2  -march=x86-64 -mtune=generic -O2 -pipe -fstack-protector --param=ssp-buffer-size=4 -march=x86-64 -mtune=generic -O2 -pipe -fstack-protector --param=ssp-buffer-size=4 -fPIC -O3 -DNDEBUG -Wall -c -o zip_fopen_index_encrypted.lo zip_fopen_index_encrypted.c
  776. libtool: compile:  gcc -DHAVE_CONFIG_H -I. -I.. -D_FORTIFY_SOURCE=2 -march=x86-64 -mtune=generic -O2 -pipe -fstack-protector --param=ssp-buffer-size=4 -march=x86-64 -mtune=generic -O2 -pipe -fstack-protector --param=ssp-buffer-size=4 -fPIC -O3 -DNDEBUG -Wall -c zip_fopen_index_encrypted.c -o zip_fopen_index_encrypted.o
  777. /bin/sh ../libtool --tag=CC   --mode=compile gcc -DHAVE_CONFIG_H -I. -I..   -D_FORTIFY_SOURCE=2  -march=x86-64 -mtune=generic -O2 -pipe -fstack-protector --param=ssp-buffer-size=4 -march=x86-64 -mtune=generic -O2 -pipe -fstack-protector --param=ssp-buffer-size=4 -fPIC -O3 -DNDEBUG -Wall -c -o zip_fread.lo zip_fread.c
  778. libtool: compile:  gcc -DHAVE_CONFIG_H -I. -I.. -D_FORTIFY_SOURCE=2 -march=x86-64 -mtune=generic -O2 -pipe -fstack-protector --param=ssp-buffer-size=4 -march=x86-64 -mtune=generic -O2 -pipe -fstack-protector --param=ssp-buffer-size=4 -fPIC -O3 -DNDEBUG -Wall -c zip_fread.c -o zip_fread.o
  779. /bin/sh ../libtool --tag=CC   --mode=compile gcc -DHAVE_CONFIG_H -I. -I..   -D_FORTIFY_SOURCE=2  -march=x86-64 -mtune=generic -O2 -pipe -fstack-protector --param=ssp-buffer-size=4 -march=x86-64 -mtune=generic -O2 -pipe -fstack-protector --param=ssp-buffer-size=4 -fPIC -O3 -DNDEBUG -Wall -c -o zip_free.lo zip_free.c
  780. libtool: compile:  gcc -DHAVE_CONFIG_H -I. -I.. -D_FORTIFY_SOURCE=2 -march=x86-64 -mtune=generic -O2 -pipe -fstack-protector --param=ssp-buffer-size=4 -march=x86-64 -mtune=generic -O2 -pipe -fstack-protector --param=ssp-buffer-size=4 -fPIC -O3 -DNDEBUG -Wall -c zip_free.c -o zip_free.o
  781. /bin/sh ../libtool --tag=CC   --mode=compile gcc -DHAVE_CONFIG_H -I. -I..   -D_FORTIFY_SOURCE=2  -march=x86-64 -mtune=generic -O2 -pipe -fstack-protector --param=ssp-buffer-size=4 -march=x86-64 -mtune=generic -O2 -pipe -fstack-protector --param=ssp-buffer-size=4 -fPIC -O3 -DNDEBUG -Wall -c -o zip_get_archive_comment.lo zip_get_archive_comment.c
  782. libtool: compile:  gcc -DHAVE_CONFIG_H -I. -I.. -D_FORTIFY_SOURCE=2 -march=x86-64 -mtune=generic -O2 -pipe -fstack-protector --param=ssp-buffer-size=4 -march=x86-64 -mtune=generic -O2 -pipe -fstack-protector --param=ssp-buffer-size=4 -fPIC -O3 -DNDEBUG -Wall -c zip_get_archive_comment.c -o zip_get_archive_comment.o
  783. /bin/sh ../libtool --tag=CC   --mode=compile gcc -DHAVE_CONFIG_H -I. -I..   -D_FORTIFY_SOURCE=2  -march=x86-64 -mtune=generic -O2 -pipe -fstack-protector --param=ssp-buffer-size=4 -march=x86-64 -mtune=generic -O2 -pipe -fstack-protector --param=ssp-buffer-size=4 -fPIC -O3 -DNDEBUG -Wall -c -o zip_get_archive_flag.lo zip_get_archive_flag.c
  784. libtool: compile:  gcc -DHAVE_CONFIG_H -I. -I.. -D_FORTIFY_SOURCE=2 -march=x86-64 -mtune=generic -O2 -pipe -fstack-protector --param=ssp-buffer-size=4 -march=x86-64 -mtune=generic -O2 -pipe -fstack-protector --param=ssp-buffer-size=4 -fPIC -O3 -DNDEBUG -Wall -c zip_get_archive_flag.c -o zip_get_archive_flag.o
  785. /bin/sh ../libtool --tag=CC   --mode=compile gcc -DHAVE_CONFIG_H -I. -I..   -D_FORTIFY_SOURCE=2  -march=x86-64 -mtune=generic -O2 -pipe -fstack-protector --param=ssp-buffer-size=4 -march=x86-64 -mtune=generic -O2 -pipe -fstack-protector --param=ssp-buffer-size=4 -fPIC -O3 -DNDEBUG -Wall -c -o zip_get_compression_implementation.lo zip_get_compression_implementation.c
  786. libtool: compile:  gcc -DHAVE_CONFIG_H -I. -I.. -D_FORTIFY_SOURCE=2 -march=x86-64 -mtune=generic -O2 -pipe -fstack-protector --param=ssp-buffer-size=4 -march=x86-64 -mtune=generic -O2 -pipe -fstack-protector --param=ssp-buffer-size=4 -fPIC -O3 -DNDEBUG -Wall -c zip_get_compression_implementation.c -o zip_get_compression_implementation.o
  787. /bin/sh ../libtool --tag=CC   --mode=compile gcc -DHAVE_CONFIG_H -I. -I..   -D_FORTIFY_SOURCE=2  -march=x86-64 -mtune=generic -O2 -pipe -fstack-protector --param=ssp-buffer-size=4 -march=x86-64 -mtune=generic -O2 -pipe -fstack-protector --param=ssp-buffer-size=4 -fPIC -O3 -DNDEBUG -Wall -c -o zip_get_encryption_implementation.lo zip_get_encryption_implementation.c
  788. libtool: compile:  gcc -DHAVE_CONFIG_H -I. -I.. -D_FORTIFY_SOURCE=2 -march=x86-64 -mtune=generic -O2 -pipe -fstack-protector --param=ssp-buffer-size=4 -march=x86-64 -mtune=generic -O2 -pipe -fstack-protector --param=ssp-buffer-size=4 -fPIC -O3 -DNDEBUG -Wall -c zip_get_encryption_implementation.c -o zip_get_encryption_implementation.o
  789. /bin/sh ../libtool --tag=CC   --mode=compile gcc -DHAVE_CONFIG_H -I. -I..   -D_FORTIFY_SOURCE=2  -march=x86-64 -mtune=generic -O2 -pipe -fstack-protector --param=ssp-buffer-size=4 -march=x86-64 -mtune=generic -O2 -pipe -fstack-protector --param=ssp-buffer-size=4 -fPIC -O3 -DNDEBUG -Wall -c -o zip_get_file_comment.lo zip_get_file_comment.c
  790. libtool: compile:  gcc -DHAVE_CONFIG_H -I. -I.. -D_FORTIFY_SOURCE=2 -march=x86-64 -mtune=generic -O2 -pipe -fstack-protector --param=ssp-buffer-size=4 -march=x86-64 -mtune=generic -O2 -pipe -fstack-protector --param=ssp-buffer-size=4 -fPIC -O3 -DNDEBUG -Wall -c zip_get_file_comment.c -o zip_get_file_comment.o
  791. /bin/sh ../libtool --tag=CC   --mode=compile gcc -DHAVE_CONFIG_H -I. -I..   -D_FORTIFY_SOURCE=2  -march=x86-64 -mtune=generic -O2 -pipe -fstack-protector --param=ssp-buffer-size=4 -march=x86-64 -mtune=generic -O2 -pipe -fstack-protector --param=ssp-buffer-size=4 -fPIC -O3 -DNDEBUG -Wall -c -o zip_get_file_extra.lo zip_get_file_extra.c
  792. ar rc ogr/libogr.a ogr/ogr_srs_erm.o ogr/ogr_srs_panorama.o ogr/ogr_srs_xml.o ogr/ogr_srs_validate.o ogr/ogr_srs_dict.o ogr/ogr_srs_proj4.o ogr/ogr_srs_pci.o ogr/ogr_srs_ozi.o ogr/ogr_srsnode.o ogr/ogr_srs_usgs.o ogr/ogr_srs_esri.o ogr/ogrct.o ogr/ogrspatialreference.o ogr/ogr_fromepsg.o ogr/ogrct.o
  793. libtool: compile:  gcc -DHAVE_CONFIG_H -I. -I.. -D_FORTIFY_SOURCE=2 -march=x86-64 -mtune=generic -O2 -pipe -fstack-protector --param=ssp-buffer-size=4 -march=x86-64 -mtune=generic -O2 -pipe -fstack-protector --param=ssp-buffer-size=4 -fPIC -O3 -DNDEBUG -Wall -c zip_get_file_extra.c -o zip_get_file_extra.o
  794. ranlib ogr/libogr.a
  795. g++ -o port/cpl_atomic_ops.o -c -march=x86-64 -mtune=generic -O2 -pipe -fstack-protector --param=ssp-buffer-size=4 -Iport -Iogr -O3 -Wall -DNDEBUG -fPIC -fno-exceptions -DCPL_LSB port/cpl_atomic_ops.cpp
  796. /bin/sh ../libtool --tag=CC   --mode=compile gcc -DHAVE_CONFIG_H -I. -I..   -D_FORTIFY_SOURCE=2  -march=x86-64 -mtune=generic -O2 -pipe -fstack-protector --param=ssp-buffer-size=4 -march=x86-64 -mtune=generic -O2 -pipe -fstack-protector --param=ssp-buffer-size=4 -fPIC -O3 -DNDEBUG -Wall -c -o zip_get_num_entries.lo zip_get_num_entries.c
  797. libtool: compile:  gcc -DHAVE_CONFIG_H -I. -I.. -D_FORTIFY_SOURCE=2 -march=x86-64 -mtune=generic -O2 -pipe -fstack-protector --param=ssp-buffer-size=4 -march=x86-64 -mtune=generic -O2 -pipe -fstack-protector --param=ssp-buffer-size=4 -fPIC -O3 -DNDEBUG -Wall -c zip_get_num_entries.c -o zip_get_num_entries.o
  798. g++ -o port/cpl_conv.o -c -march=x86-64 -mtune=generic -O2 -pipe -fstack-protector --param=ssp-buffer-size=4 -Iport -Iogr -O3 -Wall -DNDEBUG -fPIC -fno-exceptions -DCPL_LSB port/cpl_conv.cpp
  799. /bin/sh ../libtool --tag=CC   --mode=compile gcc -DHAVE_CONFIG_H -I. -I..   -D_FORTIFY_SOURCE=2  -march=x86-64 -mtune=generic -O2 -pipe -fstack-protector --param=ssp-buffer-size=4 -march=x86-64 -mtune=generic -O2 -pipe -fstack-protector --param=ssp-buffer-size=4 -fPIC -O3 -DNDEBUG -Wall -c -o zip_get_num_files.lo zip_get_num_files.c
  800. libtool: compile:  gcc -DHAVE_CONFIG_H -I. -I.. -D_FORTIFY_SOURCE=2 -march=x86-64 -mtune=generic -O2 -pipe -fstack-protector --param=ssp-buffer-size=4 -march=x86-64 -mtune=generic -O2 -pipe -fstack-protector --param=ssp-buffer-size=4 -fPIC -O3 -DNDEBUG -Wall -c zip_get_num_files.c -o zip_get_num_files.o
  801. /bin/sh ../libtool --tag=CC   --mode=compile gcc -DHAVE_CONFIG_H -I. -I..   -D_FORTIFY_SOURCE=2  -march=x86-64 -mtune=generic -O2 -pipe -fstack-protector --param=ssp-buffer-size=4 -march=x86-64 -mtune=generic -O2 -pipe -fstack-protector --param=ssp-buffer-size=4 -fPIC -O3 -DNDEBUG -Wall -c -o zip_get_name.lo zip_get_name.c
  802. libtool: compile:  gcc -DHAVE_CONFIG_H -I. -I.. -D_FORTIFY_SOURCE=2 -march=x86-64 -mtune=generic -O2 -pipe -fstack-protector --param=ssp-buffer-size=4 -march=x86-64 -mtune=generic -O2 -pipe -fstack-protector --param=ssp-buffer-size=4 -fPIC -O3 -DNDEBUG -Wall -c zip_get_name.c -o zip_get_name.o
  803. /bin/sh ../libtool --tag=CC   --mode=compile gcc -DHAVE_CONFIG_H -I. -I..   -D_FORTIFY_SOURCE=2  -march=x86-64 -mtune=generic -O2 -pipe -fstack-protector --param=ssp-buffer-size=4 -march=x86-64 -mtune=generic -O2 -pipe -fstack-protector --param=ssp-buffer-size=4 -fPIC -O3 -DNDEBUG -Wall -c -o zip_memdup.lo zip_memdup.c
  804. libtool: compile:  gcc -DHAVE_CONFIG_H -I. -I.. -D_FORTIFY_SOURCE=2 -march=x86-64 -mtune=generic -O2 -pipe -fstack-protector --param=ssp-buffer-size=4 -march=x86-64 -mtune=generic -O2 -pipe -fstack-protector --param=ssp-buffer-size=4 -fPIC -O3 -DNDEBUG -Wall -c zip_memdup.c -o zip_memdup.o
  805. /bin/sh ../libtool --tag=CC   --mode=compile gcc -DHAVE_CONFIG_H -I. -I..   -D_FORTIFY_SOURCE=2  -march=x86-64 -mtune=generic -O2 -pipe -fstack-protector --param=ssp-buffer-size=4 -march=x86-64 -mtune=generic -O2 -pipe -fstack-protector --param=ssp-buffer-size=4 -fPIC -O3 -DNDEBUG -Wall -c -o zip_name_locate.lo zip_name_locate.c
  806. libtool: compile:  gcc -DHAVE_CONFIG_H -I. -I.. -D_FORTIFY_SOURCE=2 -march=x86-64 -mtune=generic -O2 -pipe -fstack-protector --param=ssp-buffer-size=4 -march=x86-64 -mtune=generic -O2 -pipe -fstack-protector --param=ssp-buffer-size=4 -fPIC -O3 -DNDEBUG -Wall -c zip_name_locate.c -o zip_name_locate.o
  807. /bin/sh ../libtool --tag=CC   --mode=compile gcc -DHAVE_CONFIG_H -I. -I..   -D_FORTIFY_SOURCE=2  -march=x86-64 -mtune=generic -O2 -pipe -fstack-protector --param=ssp-buffer-size=4 -march=x86-64 -mtune=generic -O2 -pipe -fstack-protector --param=ssp-buffer-size=4 -fPIC -O3 -DNDEBUG -Wall -c -o zip_new.lo zip_new.c
  808. libtool: compile:  gcc -DHAVE_CONFIG_H -I. -I.. -D_FORTIFY_SOURCE=2 -march=x86-64 -mtune=generic -O2 -pipe -fstack-protector --param=ssp-buffer-size=4 -march=x86-64 -mtune=generic -O2 -pipe -fstack-protector --param=ssp-buffer-size=4 -fPIC -O3 -DNDEBUG -Wall -c zip_new.c -o zip_new.o
  809. /bin/sh ../libtool --tag=CC   --mode=compile gcc -DHAVE_CONFIG_H -I. -I..   -D_FORTIFY_SOURCE=2  -march=x86-64 -mtune=generic -O2 -pipe -fstack-protector --param=ssp-buffer-size=4 -march=x86-64 -mtune=generic -O2 -pipe -fstack-protector --param=ssp-buffer-size=4 -fPIC -O3 -DNDEBUG -Wall -c -o zip_open.lo zip_open.c
  810. libtool: compile:  gcc -DHAVE_CONFIG_H -I. -I.. -D_FORTIFY_SOURCE=2 -march=x86-64 -mtune=generic -O2 -pipe -fstack-protector --param=ssp-buffer-size=4 -march=x86-64 -mtune=generic -O2 -pipe -fstack-protector --param=ssp-buffer-size=4 -fPIC -O3 -DNDEBUG -Wall -c zip_open.c -o zip_open.o
  811. /bin/sh ../libtool --tag=CC   --mode=compile gcc -DHAVE_CONFIG_H -I. -I..   -D_FORTIFY_SOURCE=2  -march=x86-64 -mtune=generic -O2 -pipe -fstack-protector --param=ssp-buffer-size=4 -march=x86-64 -mtune=generic -O2 -pipe -fstack-protector --param=ssp-buffer-size=4 -fPIC -O3 -DNDEBUG -Wall -c -o zip_rename.lo zip_rename.c
  812. g++ -o port/cpl_csv.o -c -march=x86-64 -mtune=generic -O2 -pipe -fstack-protector --param=ssp-buffer-size=4 -Iport -Iogr -O3 -Wall -DNDEBUG -fPIC -fno-exceptions -DCPL_LSB port/cpl_csv.cpp
  813. libtool: compile:  gcc -DHAVE_CONFIG_H -I. -I.. -D_FORTIFY_SOURCE=2 -march=x86-64 -mtune=generic -O2 -pipe -fstack-protector --param=ssp-buffer-size=4 -march=x86-64 -mtune=generic -O2 -pipe -fstack-protector --param=ssp-buffer-size=4 -fPIC -O3 -DNDEBUG -Wall -c zip_rename.c -o zip_rename.o
  814. /bin/sh ../libtool --tag=CC   --mode=compile gcc -DHAVE_CONFIG_H -I. -I..   -D_FORTIFY_SOURCE=2  -march=x86-64 -mtune=generic -O2 -pipe -fstack-protector --param=ssp-buffer-size=4 -march=x86-64 -mtune=generic -O2 -pipe -fstack-protector --param=ssp-buffer-size=4 -fPIC -O3 -DNDEBUG -Wall -c -o zip_replace.lo zip_replace.c
  815. libtool: compile:  gcc -DHAVE_CONFIG_H -I. -I.. -D_FORTIFY_SOURCE=2 -march=x86-64 -mtune=generic -O2 -pipe -fstack-protector --param=ssp-buffer-size=4 -march=x86-64 -mtune=generic -O2 -pipe -fstack-protector --param=ssp-buffer-size=4 -fPIC -O3 -DNDEBUG -Wall -c zip_replace.c -o zip_replace.o
  816. /bin/sh ../libtool --tag=CC   --mode=compile gcc -DHAVE_CONFIG_H -I. -I..   -D_FORTIFY_SOURCE=2  -march=x86-64 -mtune=generic -O2 -pipe -fstack-protector --param=ssp-buffer-size=4 -march=x86-64 -mtune=generic -O2 -pipe -fstack-protector --param=ssp-buffer-size=4 -fPIC -O3 -DNDEBUG -Wall -c -o zip_set_archive_comment.lo zip_set_archive_comment.c
  817. libtool: compile:  gcc -DHAVE_CONFIG_H -I. -I.. -D_FORTIFY_SOURCE=2 -march=x86-64 -mtune=generic -O2 -pipe -fstack-protector --param=ssp-buffer-size=4 -march=x86-64 -mtune=generic -O2 -pipe -fstack-protector --param=ssp-buffer-size=4 -fPIC -O3 -DNDEBUG -Wall -c zip_set_archive_comment.c -o zip_set_archive_comment.o
  818. /bin/sh ../libtool --tag=CC   --mode=compile gcc -DHAVE_CONFIG_H -I. -I..   -D_FORTIFY_SOURCE=2  -march=x86-64 -mtune=generic -O2 -pipe -fstack-protector --param=ssp-buffer-size=4 -march=x86-64 -mtune=generic -O2 -pipe -fstack-protector --param=ssp-buffer-size=4 -fPIC -O3 -DNDEBUG -Wall -c -o zip_set_archive_flag.lo zip_set_archive_flag.c
  819. libtool: compile:  gcc -DHAVE_CONFIG_H -I. -I.. -D_FORTIFY_SOURCE=2 -march=x86-64 -mtune=generic -O2 -pipe -fstack-protector --param=ssp-buffer-size=4 -march=x86-64 -mtune=generic -O2 -pipe -fstack-protector --param=ssp-buffer-size=4 -fPIC -O3 -DNDEBUG -Wall -c zip_set_archive_flag.c -o zip_set_archive_flag.o
  820. /bin/sh ../libtool --tag=CC   --mode=compile gcc -DHAVE_CONFIG_H -I. -I..   -D_FORTIFY_SOURCE=2  -march=x86-64 -mtune=generic -O2 -pipe -fstack-protector --param=ssp-buffer-size=4 -march=x86-64 -mtune=generic -O2 -pipe -fstack-protector --param=ssp-buffer-size=4 -fPIC -O3 -DNDEBUG -Wall -c -o zip_set_default_password.lo zip_set_default_password.c
  821. libtool: compile:  gcc -DHAVE_CONFIG_H -I. -I.. -D_FORTIFY_SOURCE=2 -march=x86-64 -mtune=generic -O2 -pipe -fstack-protector --param=ssp-buffer-size=4 -march=x86-64 -mtune=generic -O2 -pipe -fstack-protector --param=ssp-buffer-size=4 -fPIC -O3 -DNDEBUG -Wall -c zip_set_default_password.c -o zip_set_default_password.o
  822. g++ -o port/cpl_error.o -c -march=x86-64 -mtune=generic -O2 -pipe -fstack-protector --param=ssp-buffer-size=4 -Iport -Iogr -O3 -Wall -DNDEBUG -fPIC -fno-exceptions -DCPL_LSB port/cpl_error.cpp
  823. /bin/sh ../libtool --tag=CC   --mode=compile gcc -DHAVE_CONFIG_H -I. -I..   -D_FORTIFY_SOURCE=2  -march=x86-64 -mtune=generic -O2 -pipe -fstack-protector --param=ssp-buffer-size=4 -march=x86-64 -mtune=generic -O2 -pipe -fstack-protector --param=ssp-buffer-size=4 -fPIC -O3 -DNDEBUG -Wall -c -o zip_set_file_comment.lo zip_set_file_comment.c
  824. libtool: compile:  gcc -DHAVE_CONFIG_H -I. -I.. -D_FORTIFY_SOURCE=2 -march=x86-64 -mtune=generic -O2 -pipe -fstack-protector --param=ssp-buffer-size=4 -march=x86-64 -mtune=generic -O2 -pipe -fstack-protector --param=ssp-buffer-size=4 -fPIC -O3 -DNDEBUG -Wall -c zip_set_file_comment.c -o zip_set_file_comment.o
  825. /bin/sh ../libtool --tag=CC   --mode=compile gcc -DHAVE_CONFIG_H -I. -I..   -D_FORTIFY_SOURCE=2  -march=x86-64 -mtune=generic -O2 -pipe -fstack-protector --param=ssp-buffer-size=4 -march=x86-64 -mtune=generic -O2 -pipe -fstack-protector --param=ssp-buffer-size=4 -fPIC -O3 -DNDEBUG -Wall -c -o zip_set_file_extra.lo zip_set_file_extra.c
  826. libtool: compile:  gcc -DHAVE_CONFIG_H -I. -I.. -D_FORTIFY_SOURCE=2 -march=x86-64 -mtune=generic -O2 -pipe -fstack-protector --param=ssp-buffer-size=4 -march=x86-64 -mtune=generic -O2 -pipe -fstack-protector --param=ssp-buffer-size=4 -fPIC -O3 -DNDEBUG -Wall -c zip_set_file_extra.c -o zip_set_file_extra.o
  827. /bin/sh ../libtool --tag=CC   --mode=compile gcc -DHAVE_CONFIG_H -I. -I..   -D_FORTIFY_SOURCE=2  -march=x86-64 -mtune=generic -O2 -pipe -fstack-protector --param=ssp-buffer-size=4 -march=x86-64 -mtune=generic -O2 -pipe -fstack-protector --param=ssp-buffer-size=4 -fPIC -O3 -DNDEBUG -Wall -c -o zip_source_buffer.lo zip_source_buffer.c
  828. libtool: compile:  gcc -DHAVE_CONFIG_H -I. -I.. -D_FORTIFY_SOURCE=2 -march=x86-64 -mtune=generic -O2 -pipe -fstack-protector --param=ssp-buffer-size=4 -march=x86-64 -mtune=generic -O2 -pipe -fstack-protector --param=ssp-buffer-size=4 -fPIC -O3 -DNDEBUG -Wall -c zip_source_buffer.c -o zip_source_buffer.o
  829. g++ -o port/cpl_findfile.o -c -march=x86-64 -mtune=generic -O2 -pipe -fstack-protector --param=ssp-buffer-size=4 -Iport -Iogr -O3 -Wall -DNDEBUG -fPIC -fno-exceptions -DCPL_LSB port/cpl_findfile.cpp
  830. /bin/sh ../libtool --tag=CC   --mode=compile gcc -DHAVE_CONFIG_H -I. -I..   -D_FORTIFY_SOURCE=2  -march=x86-64 -mtune=generic -O2 -pipe -fstack-protector --param=ssp-buffer-size=4 -march=x86-64 -mtune=generic -O2 -pipe -fstack-protector --param=ssp-buffer-size=4 -fPIC -O3 -DNDEBUG -Wall -c -o zip_source_close.lo zip_source_close.c
  831. libtool: compile:  gcc -DHAVE_CONFIG_H -I. -I.. -D_FORTIFY_SOURCE=2 -march=x86-64 -mtune=generic -O2 -pipe -fstack-protector --param=ssp-buffer-size=4 -march=x86-64 -mtune=generic -O2 -pipe -fstack-protector --param=ssp-buffer-size=4 -fPIC -O3 -DNDEBUG -Wall -c zip_source_close.c -o zip_source_close.o
  832. /bin/sh ../libtool --tag=CC   --mode=compile gcc -DHAVE_CONFIG_H -I. -I..   -D_FORTIFY_SOURCE=2  -march=x86-64 -mtune=generic -O2 -pipe -fstack-protector --param=ssp-buffer-size=4 -march=x86-64 -mtune=generic -O2 -pipe -fstack-protector --param=ssp-buffer-size=4 -fPIC -O3 -DNDEBUG -Wall -c -o zip_source_crc.lo zip_source_crc.c
  833. libtool: compile:  gcc -DHAVE_CONFIG_H -I. -I.. -D_FORTIFY_SOURCE=2 -march=x86-64 -mtune=generic -O2 -pipe -fstack-protector --param=ssp-buffer-size=4 -march=x86-64 -mtune=generic -O2 -pipe -fstack-protector --param=ssp-buffer-size=4 -fPIC -O3 -DNDEBUG -Wall -c zip_source_crc.c -o zip_source_crc.o
  834. /bin/sh ../libtool --tag=CC   --mode=compile gcc -DHAVE_CONFIG_H -I. -I..   -D_FORTIFY_SOURCE=2  -march=x86-64 -mtune=generic -O2 -pipe -fstack-protector --param=ssp-buffer-size=4 -march=x86-64 -mtune=generic -O2 -pipe -fstack-protector --param=ssp-buffer-size=4 -fPIC -O3 -DNDEBUG -Wall -c -o zip_source_deflate.lo zip_source_deflate.c
  835. g++ -o port/cpl_getexecpath.o -c -march=x86-64 -mtune=generic -O2 -pipe -fstack-protector --param=ssp-buffer-size=4 -Iport -Iogr -O3 -Wall -DNDEBUG -fPIC -fno-exceptions -DCPL_LSB port/cpl_getexecpath.cpp
  836. libtool: compile:  gcc -DHAVE_CONFIG_H -I. -I.. -D_FORTIFY_SOURCE=2 -march=x86-64 -mtune=generic -O2 -pipe -fstack-protector --param=ssp-buffer-size=4 -march=x86-64 -mtune=generic -O2 -pipe -fstack-protector --param=ssp-buffer-size=4 -fPIC -O3 -DNDEBUG -Wall -c zip_source_deflate.c -o zip_source_deflate.o
  837. /bin/sh ../libtool --tag=CC   --mode=compile gcc -DHAVE_CONFIG_H -I. -I..   -D_FORTIFY_SOURCE=2  -march=x86-64 -mtune=generic -O2 -pipe -fstack-protector --param=ssp-buffer-size=4 -march=x86-64 -mtune=generic -O2 -pipe -fstack-protector --param=ssp-buffer-size=4 -fPIC -O3 -DNDEBUG -Wall -c -o zip_source_error.lo zip_source_error.c
  838. libtool: compile:  gcc -DHAVE_CONFIG_H -I. -I.. -D_FORTIFY_SOURCE=2 -march=x86-64 -mtune=generic -O2 -pipe -fstack-protector --param=ssp-buffer-size=4 -march=x86-64 -mtune=generic -O2 -pipe -fstack-protector --param=ssp-buffer-size=4 -fPIC -O3 -DNDEBUG -Wall -c zip_source_error.c -o zip_source_error.o
  839. /bin/sh ../libtool --tag=CC   --mode=compile gcc -DHAVE_CONFIG_H -I. -I..   -D_FORTIFY_SOURCE=2  -march=x86-64 -mtune=generic -O2 -pipe -fstack-protector --param=ssp-buffer-size=4 -march=x86-64 -mtune=generic -O2 -pipe -fstack-protector --param=ssp-buffer-size=4 -fPIC -O3 -DNDEBUG -Wall -c -o zip_source_file.lo zip_source_file.c
  840. libtool: compile:  gcc -DHAVE_CONFIG_H -I. -I.. -D_FORTIFY_SOURCE=2 -march=x86-64 -mtune=generic -O2 -pipe -fstack-protector --param=ssp-buffer-size=4 -march=x86-64 -mtune=generic -O2 -pipe -fstack-protector --param=ssp-buffer-size=4 -fPIC -O3 -DNDEBUG -Wall -c zip_source_file.c -o zip_source_file.o
  841. g++ -o port/cpl_http.o -c -march=x86-64 -mtune=generic -O2 -pipe -fstack-protector --param=ssp-buffer-size=4 -Iport -Iogr -O3 -Wall -DNDEBUG -fPIC -fno-exceptions -DCPL_LSB port/cpl_http.cpp
  842. /bin/sh ../libtool --tag=CC   --mode=compile gcc -DHAVE_CONFIG_H -I. -I..   -D_FORTIFY_SOURCE=2  -march=x86-64 -mtune=generic -O2 -pipe -fstack-protector --param=ssp-buffer-size=4 -march=x86-64 -mtune=generic -O2 -pipe -fstack-protector --param=ssp-buffer-size=4 -fPIC -O3 -DNDEBUG -Wall -c -o zip_source_filep.lo zip_source_filep.c
  843. libtool: compile:  gcc -DHAVE_CONFIG_H -I. -I.. -D_FORTIFY_SOURCE=2 -march=x86-64 -mtune=generic -O2 -pipe -fstack-protector --param=ssp-buffer-size=4 -march=x86-64 -mtune=generic -O2 -pipe -fstack-protector --param=ssp-buffer-size=4 -fPIC -O3 -DNDEBUG -Wall -c zip_source_filep.c -o zip_source_filep.o
  844. /bin/sh ../libtool --tag=CC   --mode=compile gcc -DHAVE_CONFIG_H -I. -I..   -D_FORTIFY_SOURCE=2  -march=x86-64 -mtune=generic -O2 -pipe -fstack-protector --param=ssp-buffer-size=4 -march=x86-64 -mtune=generic -O2 -pipe -fstack-protector --param=ssp-buffer-size=4 -fPIC -O3 -DNDEBUG -Wall -c -o zip_source_free.lo zip_source_free.c
  845. libtool: compile:  gcc -DHAVE_CONFIG_H -I. -I.. -D_FORTIFY_SOURCE=2 -march=x86-64 -mtune=generic -O2 -pipe -fstack-protector --param=ssp-buffer-size=4 -march=x86-64 -mtune=generic -O2 -pipe -fstack-protector --param=ssp-buffer-size=4 -fPIC -O3 -DNDEBUG -Wall -c zip_source_free.c -o zip_source_free.o
  846. /bin/sh ../libtool --tag=CC   --mode=compile gcc -DHAVE_CONFIG_H -I. -I..   -D_FORTIFY_SOURCE=2  -march=x86-64 -mtune=generic -O2 -pipe -fstack-protector --param=ssp-buffer-size=4 -march=x86-64 -mtune=generic -O2 -pipe -fstack-protector --param=ssp-buffer-size=4 -fPIC -O3 -DNDEBUG -Wall -c -o zip_source_function.lo zip_source_function.c
  847. g++ -o port/cpl_minixml.o -c -march=x86-64 -mtune=generic -O2 -pipe -fstack-protector --param=ssp-buffer-size=4 -Iport -Iogr -O3 -Wall -DNDEBUG -fPIC -fno-exceptions -DCPL_LSB port/cpl_minixml.cpp
  848. libtool: compile:  gcc -DHAVE_CONFIG_H -I. -I.. -D_FORTIFY_SOURCE=2 -march=x86-64 -mtune=generic -O2 -pipe -fstack-protector --param=ssp-buffer-size=4 -march=x86-64 -mtune=generic -O2 -pipe -fstack-protector --param=ssp-buffer-size=4 -fPIC -O3 -DNDEBUG -Wall -c zip_source_function.c -o zip_source_function.o
  849. /bin/sh ../libtool --tag=CC   --mode=compile gcc -DHAVE_CONFIG_H -I. -I..   -D_FORTIFY_SOURCE=2  -march=x86-64 -mtune=generic -O2 -pipe -fstack-protector --param=ssp-buffer-size=4 -march=x86-64 -mtune=generic -O2 -pipe -fstack-protector --param=ssp-buffer-size=4 -fPIC -O3 -DNDEBUG -Wall -c -o zip_source_layered.lo zip_source_layered.c
  850. libtool: compile:  gcc -DHAVE_CONFIG_H -I. -I.. -D_FORTIFY_SOURCE=2 -march=x86-64 -mtune=generic -O2 -pipe -fstack-protector --param=ssp-buffer-size=4 -march=x86-64 -mtune=generic -O2 -pipe -fstack-protector --param=ssp-buffer-size=4 -fPIC -O3 -DNDEBUG -Wall -c zip_source_layered.c -o zip_source_layered.o
  851. /bin/sh ../libtool --tag=CC   --mode=compile gcc -DHAVE_CONFIG_H -I. -I..   -D_FORTIFY_SOURCE=2  -march=x86-64 -mtune=generic -O2 -pipe -fstack-protector --param=ssp-buffer-size=4 -march=x86-64 -mtune=generic -O2 -pipe -fstack-protector --param=ssp-buffer-size=4 -fPIC -O3 -DNDEBUG -Wall -c -o zip_source_open.lo zip_source_open.c
  852. libtool: compile:  gcc -DHAVE_CONFIG_H -I. -I.. -D_FORTIFY_SOURCE=2 -march=x86-64 -mtune=generic -O2 -pipe -fstack-protector --param=ssp-buffer-size=4 -march=x86-64 -mtune=generic -O2 -pipe -fstack-protector --param=ssp-buffer-size=4 -fPIC -O3 -DNDEBUG -Wall -c zip_source_open.c -o zip_source_open.o
  853. /bin/sh ../libtool --tag=CC   --mode=compile gcc -DHAVE_CONFIG_H -I. -I..   -D_FORTIFY_SOURCE=2  -march=x86-64 -mtune=generic -O2 -pipe -fstack-protector --param=ssp-buffer-size=4 -march=x86-64 -mtune=generic -O2 -pipe -fstack-protector --param=ssp-buffer-size=4 -fPIC -O3 -DNDEBUG -Wall -c -o zip_source_pkware.lo zip_source_pkware.c
  854. libtool: compile:  gcc -DHAVE_CONFIG_H -I. -I.. -D_FORTIFY_SOURCE=2 -march=x86-64 -mtune=generic -O2 -pipe -fstack-protector --param=ssp-buffer-size=4 -march=x86-64 -mtune=generic -O2 -pipe -fstack-protector --param=ssp-buffer-size=4 -fPIC -O3 -DNDEBUG -Wall -c zip_source_pkware.c -o zip_source_pkware.o
  855. zip_source_pkware.c: In function 'zip_source_pkware':
  856. zip_source_pkware.c:84:6: warning: assignment from incompatible pointer type [enabled by default]
  857.   crc = get_crc_table();
  858.       ^
  859. /bin/sh ../libtool --tag=CC   --mode=compile gcc -DHAVE_CONFIG_H -I. -I..   -D_FORTIFY_SOURCE=2  -march=x86-64 -mtune=generic -O2 -pipe -fstack-protector --param=ssp-buffer-size=4 -march=x86-64 -mtune=generic -O2 -pipe -fstack-protector --param=ssp-buffer-size=4 -fPIC -O3 -DNDEBUG -Wall -c -o zip_source_pop.lo zip_source_pop.c
  860. libtool: compile:  gcc -DHAVE_CONFIG_H -I. -I.. -D_FORTIFY_SOURCE=2 -march=x86-64 -mtune=generic -O2 -pipe -fstack-protector --param=ssp-buffer-size=4 -march=x86-64 -mtune=generic -O2 -pipe -fstack-protector --param=ssp-buffer-size=4 -fPIC -O3 -DNDEBUG -Wall -c zip_source_pop.c -o zip_source_pop.o
  861. /bin/sh ../libtool --tag=CC   --mode=compile gcc -DHAVE_CONFIG_H -I. -I..   -D_FORTIFY_SOURCE=2  -march=x86-64 -mtune=generic -O2 -pipe -fstack-protector --param=ssp-buffer-size=4 -march=x86-64 -mtune=generic -O2 -pipe -fstack-protector --param=ssp-buffer-size=4 -fPIC -O3 -DNDEBUG -Wall -c -o zip_source_read.lo zip_source_read.c
  862. libtool: compile:  gcc -DHAVE_CONFIG_H -I. -I.. -D_FORTIFY_SOURCE=2 -march=x86-64 -mtune=generic -O2 -pipe -fstack-protector --param=ssp-buffer-size=4 -march=x86-64 -mtune=generic -O2 -pipe -fstack-protector --param=ssp-buffer-size=4 -fPIC -O3 -DNDEBUG -Wall -c zip_source_read.c -o zip_source_read.o
  863. /bin/sh ../libtool --tag=CC   --mode=compile gcc -DHAVE_CONFIG_H -I. -I..   -D_FORTIFY_SOURCE=2  -march=x86-64 -mtune=generic -O2 -pipe -fstack-protector --param=ssp-buffer-size=4 -march=x86-64 -mtune=generic -O2 -pipe -fstack-protector --param=ssp-buffer-size=4 -fPIC -O3 -DNDEBUG -Wall -c -o zip_source_stat.lo zip_source_stat.c
  864. libtool: compile:  gcc -DHAVE_CONFIG_H -I. -I.. -D_FORTIFY_SOURCE=2 -march=x86-64 -mtune=generic -O2 -pipe -fstack-protector --param=ssp-buffer-size=4 -march=x86-64 -mtune=generic -O2 -pipe -fstack-protector --param=ssp-buffer-size=4 -fPIC -O3 -DNDEBUG -Wall -c zip_source_stat.c -o zip_source_stat.o
  865. /bin/sh ../libtool --tag=CC   --mode=compile gcc -DHAVE_CONFIG_H -I. -I..   -D_FORTIFY_SOURCE=2  -march=x86-64 -mtune=generic -O2 -pipe -fstack-protector --param=ssp-buffer-size=4 -march=x86-64 -mtune=generic -O2 -pipe -fstack-protector --param=ssp-buffer-size=4 -fPIC -O3 -DNDEBUG -Wall -c -o zip_source_zip.lo zip_source_zip.c
  866. libtool: compile:  gcc -DHAVE_CONFIG_H -I. -I.. -D_FORTIFY_SOURCE=2 -march=x86-64 -mtune=generic -O2 -pipe -fstack-protector --param=ssp-buffer-size=4 -march=x86-64 -mtune=generic -O2 -pipe -fstack-protector --param=ssp-buffer-size=4 -fPIC -O3 -DNDEBUG -Wall -c zip_source_zip.c -o zip_source_zip.o
  867. /bin/sh ../libtool --tag=CC   --mode=compile gcc -DHAVE_CONFIG_H -I. -I..   -D_FORTIFY_SOURCE=2  -march=x86-64 -mtune=generic -O2 -pipe -fstack-protector --param=ssp-buffer-size=4 -march=x86-64 -mtune=generic -O2 -pipe -fstack-protector --param=ssp-buffer-size=4 -fPIC -O3 -DNDEBUG -Wall -c -o zip_set_name.lo zip_set_name.c
  868. libtool: compile:  gcc -DHAVE_CONFIG_H -I. -I.. -D_FORTIFY_SOURCE=2 -march=x86-64 -mtune=generic -O2 -pipe -fstack-protector --param=ssp-buffer-size=4 -march=x86-64 -mtune=generic -O2 -pipe -fstack-protector --param=ssp-buffer-size=4 -fPIC -O3 -DNDEBUG -Wall -c zip_set_name.c -o zip_set_name.o
  869. /bin/sh ../libtool --tag=CC   --mode=compile gcc -DHAVE_CONFIG_H -I. -I..   -D_FORTIFY_SOURCE=2  -march=x86-64 -mtune=generic -O2 -pipe -fstack-protector --param=ssp-buffer-size=4 -march=x86-64 -mtune=generic -O2 -pipe -fstack-protector --param=ssp-buffer-size=4 -fPIC -O3 -DNDEBUG -Wall -c -o zip_stat.lo zip_stat.c
  870. libtool: compile:  gcc -DHAVE_CONFIG_H -I. -I.. -D_FORTIFY_SOURCE=2 -march=x86-64 -mtune=generic -O2 -pipe -fstack-protector --param=ssp-buffer-size=4 -march=x86-64 -mtune=generic -O2 -pipe -fstack-protector --param=ssp-buffer-size=4 -fPIC -O3 -DNDEBUG -Wall -c zip_stat.c -o zip_stat.o
  871. /bin/sh ../libtool --tag=CC   --mode=compile gcc -DHAVE_CONFIG_H -I. -I..   -D_FORTIFY_SOURCE=2  -march=x86-64 -mtune=generic -O2 -pipe -fstack-protector --param=ssp-buffer-size=4 -march=x86-64 -mtune=generic -O2 -pipe -fstack-protector --param=ssp-buffer-size=4 -fPIC -O3 -DNDEBUG -Wall -c -o zip_stat_index.lo zip_stat_index.c
  872. libtool: compile:  gcc -DHAVE_CONFIG_H -I. -I.. -D_FORTIFY_SOURCE=2 -march=x86-64 -mtune=generic -O2 -pipe -fstack-protector --param=ssp-buffer-size=4 -march=x86-64 -mtune=generic -O2 -pipe -fstack-protector --param=ssp-buffer-size=4 -fPIC -O3 -DNDEBUG -Wall -c zip_stat_index.c -o zip_stat_index.o
  873. g++ -o port/cpl_multiproc.o -c -march=x86-64 -mtune=generic -O2 -pipe -fstack-protector --param=ssp-buffer-size=4 -Iport -Iogr -O3 -Wall -DNDEBUG -fPIC -fno-exceptions -DCPL_LSB port/cpl_multiproc.cpp
  874. /bin/sh ../libtool --tag=CC   --mode=compile gcc -DHAVE_CONFIG_H -I. -I..   -D_FORTIFY_SOURCE=2  -march=x86-64 -mtune=generic -O2 -pipe -fstack-protector --param=ssp-buffer-size=4 -march=x86-64 -mtune=generic -O2 -pipe -fstack-protector --param=ssp-buffer-size=4 -fPIC -O3 -DNDEBUG -Wall -c -o zip_stat_init.lo zip_stat_init.c
  875. libtool: compile:  gcc -DHAVE_CONFIG_H -I. -I.. -D_FORTIFY_SOURCE=2 -march=x86-64 -mtune=generic -O2 -pipe -fstack-protector --param=ssp-buffer-size=4 -march=x86-64 -mtune=generic -O2 -pipe -fstack-protector --param=ssp-buffer-size=4 -fPIC -O3 -DNDEBUG -Wall -c zip_stat_init.c -o zip_stat_init.o
  876. /bin/sh ../libtool --tag=CC   --mode=compile gcc -DHAVE_CONFIG_H -I. -I..   -D_FORTIFY_SOURCE=2  -march=x86-64 -mtune=generic -O2 -pipe -fstack-protector --param=ssp-buffer-size=4 -march=x86-64 -mtune=generic -O2 -pipe -fstack-protector --param=ssp-buffer-size=4 -fPIC -O3 -DNDEBUG -Wall -c -o zip_strerror.lo zip_strerror.c
  877. libtool: compile:  gcc -DHAVE_CONFIG_H -I. -I.. -D_FORTIFY_SOURCE=2 -march=x86-64 -mtune=generic -O2 -pipe -fstack-protector --param=ssp-buffer-size=4 -march=x86-64 -mtune=generic -O2 -pipe -fstack-protector --param=ssp-buffer-size=4 -fPIC -O3 -DNDEBUG -Wall -c zip_strerror.c -o zip_strerror.o
  878. /bin/sh ../libtool --tag=CC   --mode=compile gcc -DHAVE_CONFIG_H -I. -I..   -D_FORTIFY_SOURCE=2  -march=x86-64 -mtune=generic -O2 -pipe -fstack-protector --param=ssp-buffer-size=4 -march=x86-64 -mtune=generic -O2 -pipe -fstack-protector --param=ssp-buffer-size=4 -fPIC -O3 -DNDEBUG -Wall -c -o zip_unchange.lo zip_unchange.c
  879. g++ -o port/cpl_path.o -c -march=x86-64 -mtune=generic -O2 -pipe -fstack-protector --param=ssp-buffer-size=4 -Iport -Iogr -O3 -Wall -DNDEBUG -fPIC -fno-exceptions -DCPL_LSB port/cpl_path.cpp
  880. libtool: compile:  gcc -DHAVE_CONFIG_H -I. -I.. -D_FORTIFY_SOURCE=2 -march=x86-64 -mtune=generic -O2 -pipe -fstack-protector --param=ssp-buffer-size=4 -march=x86-64 -mtune=generic -O2 -pipe -fstack-protector --param=ssp-buffer-size=4 -fPIC -O3 -DNDEBUG -Wall -c zip_unchange.c -o zip_unchange.o
  881. /bin/sh ../libtool --tag=CC   --mode=compile gcc -DHAVE_CONFIG_H -I. -I..   -D_FORTIFY_SOURCE=2  -march=x86-64 -mtune=generic -O2 -pipe -fstack-protector --param=ssp-buffer-size=4 -march=x86-64 -mtune=generic -O2 -pipe -fstack-protector --param=ssp-buffer-size=4 -fPIC -O3 -DNDEBUG -Wall -c -o zip_unchange_all.lo zip_unchange_all.c
  882. libtool: compile:  gcc -DHAVE_CONFIG_H -I. -I.. -D_FORTIFY_SOURCE=2 -march=x86-64 -mtune=generic -O2 -pipe -fstack-protector --param=ssp-buffer-size=4 -march=x86-64 -mtune=generic -O2 -pipe -fstack-protector --param=ssp-buffer-size=4 -fPIC -O3 -DNDEBUG -Wall -c zip_unchange_all.c -o zip_unchange_all.o
  883. /bin/sh ../libtool --tag=CC   --mode=compile gcc -DHAVE_CONFIG_H -I. -I..   -D_FORTIFY_SOURCE=2  -march=x86-64 -mtune=generic -O2 -pipe -fstack-protector --param=ssp-buffer-size=4 -march=x86-64 -mtune=generic -O2 -pipe -fstack-protector --param=ssp-buffer-size=4 -fPIC -O3 -DNDEBUG -Wall -c -o zip_unchange_archive.lo zip_unchange_archive.c
  884. libtool: compile:  gcc -DHAVE_CONFIG_H -I. -I.. -D_FORTIFY_SOURCE=2 -march=x86-64 -mtune=generic -O2 -pipe -fstack-protector --param=ssp-buffer-size=4 -march=x86-64 -mtune=generic -O2 -pipe -fstack-protector --param=ssp-buffer-size=4 -fPIC -O3 -DNDEBUG -Wall -c zip_unchange_archive.c -o zip_unchange_archive.o
  885. /bin/sh ../libtool --tag=CC   --mode=compile gcc -DHAVE_CONFIG_H -I. -I..   -D_FORTIFY_SOURCE=2  -march=x86-64 -mtune=generic -O2 -pipe -fstack-protector --param=ssp-buffer-size=4 -march=x86-64 -mtune=generic -O2 -pipe -fstack-protector --param=ssp-buffer-size=4 -fPIC -O3 -DNDEBUG -Wall -c -o zip_unchange_data.lo zip_unchange_data.c
  886. libtool: compile:  gcc -DHAVE_CONFIG_H -I. -I.. -D_FORTIFY_SOURCE=2 -march=x86-64 -mtune=generic -O2 -pipe -fstack-protector --param=ssp-buffer-size=4 -march=x86-64 -mtune=generic -O2 -pipe -fstack-protector --param=ssp-buffer-size=4 -fPIC -O3 -DNDEBUG -Wall -c zip_unchange_data.c -o zip_unchange_data.o
  887. /bin/sh ../libtool --tag=CC   --mode=link gcc  -march=x86-64 -mtune=generic -O2 -pipe -fstack-protector --param=ssp-buffer-size=4 -march=x86-64 -mtune=generic -O2 -pipe -fstack-protector --param=ssp-buffer-size=4 -fPIC -O3 -DNDEBUG -Wall -no-undefined -version-info 3:0:1 -Wl,-O1,--sort-common,--as-needed,-z,relro -o libzip.la -rpath /usr/local/lib zip_add.lo zip_add_dir.lo zip_close.lo zip_delete.lo zip_dirent.lo zip_entry_free.lo zip_entry_new.lo zip_err_str.lo zip_error.lo zip_error_clear.lo zip_error_get.lo zip_error_get_sys_type.lo zip_error_strerror.lo zip_error_to_str.lo zip_fclose.lo zip_fdopen.lo zip_file_error_clear.lo zip_file_error_get.lo zip_file_get_offset.lo zip_file_strerror.lo zip_filerange_crc.lo zip_fopen.lo zip_fopen_encrypted.lo zip_fopen_index.lo zip_fopen_index_encrypted.lo zip_fread.lo zip_free.lo zip_get_archive_comment.lo zip_get_archive_flag.lo zip_get_compression_implementation.lo zip_get_encryption_implementation.lo zip_get_file_comment.lo zip_get_file_extra.lo zip_get_num_entries.lo zip_get_num_files.lo zip_get_name.lo zip_memdup.lo zip_name_locate.lo zip_new.lo zip_open.lo zip_rename.lo zip_replace.lo zip_set_archive_comment.lo zip_set_archive_flag.lo zip_set_default_password.lo zip_set_file_comment.lo zip_set_file_extra.lo zip_source_buffer.lo zip_source_close.lo zip_source_crc.lo zip_source_deflate.lo zip_source_error.lo zip_source_file.lo zip_source_filep.lo zip_source_free.lo zip_source_function.lo zip_source_layered.lo zip_source_open.lo zip_source_pkware.lo zip_source_pop.lo zip_source_read.lo zip_source_stat.lo zip_source_zip.lo zip_set_name.lo zip_stat.lo zip_stat_index.lo zip_stat_init.lo zip_strerror.lo zip_unchange.lo zip_unchange_all.lo zip_unchange_archive.lo zip_unchange_data.lo  -lz
  888. libtool: link: ar cru .libs/libzip.a  zip_add.o zip_add_dir.o zip_close.o zip_delete.o zip_dirent.o zip_entry_free.o zip_entry_new.o zip_err_str.o zip_error.o zip_error_clear.o zip_error_get.o zip_error_get_sys_type.o zip_error_strerror.o zip_error_to_str.o zip_fclose.o zip_fdopen.o zip_file_error_clear.o zip_file_error_get.o zip_file_get_offset.o zip_file_strerror.o zip_filerange_crc.o zip_fopen.o zip_fopen_encrypted.o zip_fopen_index.o zip_fopen_index_encrypted.o zip_fread.o zip_free.o zip_get_archive_comment.o zip_get_archive_flag.o zip_get_compression_implementation.o zip_get_encryption_implementation.o zip_get_file_comment.o zip_get_file_extra.o zip_get_num_entries.o zip_get_num_files.o zip_get_name.o zip_memdup.o zip_name_locate.o zip_new.o zip_open.o zip_rename.o zip_replace.o zip_set_archive_comment.o zip_set_archive_flag.o zip_set_default_password.o zip_set_file_comment.o zip_set_file_extra.o zip_source_buffer.o zip_source_close.o zip_source_crc.o zip_source_deflate.o zip_source_error.o zip_source_file.o zip_source_filep.o zip_source_free.o zip_source_function.o zip_source_layered.o zip_source_open.o zip_source_pkware.o zip_source_pop.o zip_source_read.o zip_source_stat.o zip_source_zip.o zip_set_name.o zip_stat.o zip_stat_index.o zip_stat_init.o zip_strerror.o zip_unchange.o zip_unchange_all.o zip_unchange_archive.o zip_unchange_data.o
  889. libtool: link: ranlib .libs/libzip.a
  890. libtool: link: ( cd ".libs" && rm -f "libzip.la" && ln -s "../libzip.la" "libzip.la" )
  891. make[3]: Leaving directory `/tmp/tilemill/pkg/tilemill/usr/lib/node_modules/tilemill/node_modules/millstone/node_modules/zipfile/deps/libzip-0.10/lib'
  892. make[2]: Leaving directory `/tmp/tilemill/pkg/tilemill/usr/lib/node_modules/tilemill/node_modules/millstone/node_modules/zipfile/deps/libzip-0.10/lib'
  893. Making all in src
  894. make[2]: Entering directory `/tmp/tilemill/pkg/tilemill/usr/lib/node_modules/tilemill/node_modules/millstone/node_modules/zipfile/deps/libzip-0.10/src'
  895. gcc -DHAVE_CONFIG_H -I. -I..  -I../lib -D_FORTIFY_SOURCE=2  -march=x86-64 -mtune=generic -O2 -pipe -fstack-protector --param=ssp-buffer-size=4 -march=x86-64 -mtune=generic -O2 -pipe -fstack-protector --param=ssp-buffer-size=4 -fPIC -O3 -DNDEBUG -Wall -c -o zipcmp-zipcmp.o `test -f 'zipcmp.c' || echo './'`zipcmp.c
  896. g++ -o port/cpl_string.o -c -march=x86-64 -mtune=generic -O2 -pipe -fstack-protector --param=ssp-buffer-size=4 -Iport -Iogr -O3 -Wall -DNDEBUG -fPIC -fno-exceptions -DCPL_LSB port/cpl_string.cpp
  897. /bin/sh ../libtool --tag=CC   --mode=link gcc  -march=x86-64 -mtune=generic -O2 -pipe -fstack-protector --param=ssp-buffer-size=4 -march=x86-64 -mtune=generic -O2 -pipe -fstack-protector --param=ssp-buffer-size=4 -fPIC -O3 -DNDEBUG -Wall  -Wl,-O1,--sort-common,--as-needed,-z,relro -o zipcmp zipcmp-zipcmp.o ../lib/libzip.la -lz
  898. libtool: link: gcc -march=x86-64 -mtune=generic -O2 -pipe -fstack-protector --param=ssp-buffer-size=4 -march=x86-64 -mtune=generic -O2 -pipe -fstack-protector --param=ssp-buffer-size=4 -fPIC -O3 -DNDEBUG -Wall -Wl,-O1 -Wl,--sort-common -Wl,--as-needed -Wl,-z -Wl,relro -o zipcmp zipcmp-zipcmp.o  ../lib/.libs/libzip.a -lz
  899. gcc -DHAVE_CONFIG_H -I. -I..  -I../lib -D_FORTIFY_SOURCE=2  -march=x86-64 -mtune=generic -O2 -pipe -fstack-protector --param=ssp-buffer-size=4 -march=x86-64 -mtune=generic -O2 -pipe -fstack-protector --param=ssp-buffer-size=4 -fPIC -O3 -DNDEBUG -Wall -c -o zipmerge-zipmerge.o `test -f 'zipmerge.c' || echo './'`zipmerge.c
  900. zipmerge.c: In function 'confirm_replace':
  901. zipmerge.c:215:5: warning: format '%llu' expects argument of type 'long long unsigned int', but argument 3 has type 'zip_uint64_t' [-Wformat=]
  902.      ss.name, ss.size, ss.crc, sname);
  903.      ^
  904. zipmerge.c:215:5: warning: format '%llu' expects argument of type 'long long unsigned int', but argument 7 has type 'zip_uint64_t' [-Wformat=]
  905. /bin/sh ../libtool --tag=CC   --mode=link gcc  -march=x86-64 -mtune=generic -O2 -pipe -fstack-protector --param=ssp-buffer-size=4 -march=x86-64 -mtune=generic -O2 -pipe -fstack-protector --param=ssp-buffer-size=4 -fPIC -O3 -DNDEBUG -Wall  -Wl,-O1,--sort-common,--as-needed,-z,relro -o zipmerge zipmerge-zipmerge.o ../lib/libzip.la -lz
  906. libtool: link: gcc -march=x86-64 -mtune=generic -O2 -pipe -fstack-protector --param=ssp-buffer-size=4 -march=x86-64 -mtune=generic -O2 -pipe -fstack-protector --param=ssp-buffer-size=4 -fPIC -O3 -DNDEBUG -Wall -Wl,-O1 -Wl,--sort-common -Wl,--as-needed -Wl,-z -Wl,relro -o zipmerge zipmerge-zipmerge.o  ../lib/.libs/libzip.a -lz
  907. Waf: Leaving directory `/tmp/tilemill/pkg/tilemill/usr/lib/node_modules/tilemill/node_modules/mapnik/build'
  908. Build failed:
  909.  -> task failed (err #1):
  910.         {task: cxx node_mapnik.cpp -> node_mapnik_1.o}
  911.  -> task failed (err #4):
  912.         {task: cxx mapnik_color.cpp -> mapnik_color_1.o}
  913. gcc -DHAVE_CONFIG_H -I. -I..  -I../lib -D_FORTIFY_SOURCE=2  -march=x86-64 -mtune=generic -O2 -pipe -fstack-protector --param=ssp-buffer-size=4 -march=x86-64 -mtune=generic -O2 -pipe -fstack-protector --param=ssp-buffer-size=4 -fPIC -O3 -DNDEBUG -Wall -c -o ziptorrent-ziptorrent.o `test -f 'ziptorrent.c' || echo './'`ziptorrent.c
  914. /bin/sh ../libtool --tag=CC   --mode=link gcc  -march=x86-64 -mtune=generic -O2 -pipe -fstack-protector --param=ssp-buffer-size=4 -march=x86-64 -mtune=generic -O2 -pipe -fstack-protector --param=ssp-buffer-size=4 -fPIC -O3 -DNDEBUG -Wall  -Wl,-O1,--sort-common,--as-needed,-z,relro -o ziptorrent ziptorrent-ziptorrent.o ../lib/libzip.la -lz
  915. g++ -o port/cpl_strtod.o -c -march=x86-64 -mtune=generic -O2 -pipe -fstack-protector --param=ssp-buffer-size=4 -Iport -Iogr -O3 -Wall -DNDEBUG -fPIC -fno-exceptions -DCPL_LSB port/cpl_strtod.cpp
  916. libtool: link: gcc -march=x86-64 -mtune=generic -O2 -pipe -fstack-protector --param=ssp-buffer-size=4 -march=x86-64 -mtune=generic -O2 -pipe -fstack-protector --param=ssp-buffer-size=4 -fPIC -O3 -DNDEBUG -Wall -Wl,-O1 -Wl,--sort-common -Wl,--as-needed -Wl,-z -Wl,relro -o ziptorrent ziptorrent-ziptorrent.o  ../lib/.libs/libzip.a -lz
  917. g++ -o port/cpl_vsi_mem.o -c -march=x86-64 -mtune=generic -O2 -pipe -fstack-protector --param=ssp-buffer-size=4 -Iport -Iogr -O3 -Wall -DNDEBUG -fPIC -fno-exceptions -DCPL_LSB port/cpl_vsi_mem.cpp
  918. make[2]: Leaving directory `/tmp/tilemill/pkg/tilemill/usr/lib/node_modules/tilemill/node_modules/millstone/node_modules/zipfile/deps/libzip-0.10/src'
  919. Making all in man
  920. make[2]: Entering directory `/tmp/tilemill/pkg/tilemill/usr/lib/node_modules/tilemill/node_modules/millstone/node_modules/zipfile/deps/libzip-0.10/man'
  921. make[2]: Nothing to be done for `all'.
  922. make[2]: Leaving directory `/tmp/tilemill/pkg/tilemill/usr/lib/node_modules/tilemill/node_modules/millstone/node_modules/zipfile/deps/libzip-0.10/man'
  923. Making all in regress
  924. make[2]: Entering directory `/tmp/tilemill/pkg/tilemill/usr/lib/node_modules/tilemill/node_modules/millstone/node_modules/zipfile/deps/libzip-0.10/regress'
  925. gcc -DHAVE_CONFIG_H -I. -I..  -I../lib -D_FORTIFY_SOURCE=2  -march=x86-64 -mtune=generic -O2 -pipe -fstack-protector --param=ssp-buffer-size=4 -march=x86-64 -mtune=generic -O2 -pipe -fstack-protector --param=ssp-buffer-size=4 -fPIC -O3 -DNDEBUG -Wall -c add_dir.c
  926. /bin/sh ../libtool --tag=CC   --mode=link gcc  -march=x86-64 -mtune=generic -O2 -pipe -fstack-protector --param=ssp-buffer-size=4 -march=x86-64 -mtune=generic -O2 -pipe -fstack-protector --param=ssp-buffer-size=4 -fPIC -O3 -DNDEBUG -Wall  -Wl,-O1,--sort-common,--as-needed,-z,relro -o add_dir add_dir.o ../lib/libzip.la -lz
  927. libtool: link: gcc -march=x86-64 -mtune=generic -O2 -pipe -fstack-protector --param=ssp-buffer-size=4 -march=x86-64 -mtune=generic -O2 -pipe -fstack-protector --param=ssp-buffer-size=4 -fPIC -O3 -DNDEBUG -Wall -Wl,-O1 -Wl,--sort-common -Wl,--as-needed -Wl,-z -Wl,relro -o add_dir add_dir.o  ../lib/.libs/libzip.a -lz
  928. gcc: error: add_dir.o: No such file or directory
  929. make[2]: *** [add_dir] Error 1
  930. make[2]: Leaving directory `/tmp/tilemill/pkg/tilemill/usr/lib/node_modules/tilemill/node_modules/millstone/node_modules/zipfile/deps/libzip-0.10/regress'
  931. make[1]: *** [all-recursive] Error 1
  932. make[1]: Leaving directory `/tmp/tilemill/pkg/tilemill/usr/lib/node_modules/tilemill/node_modules/millstone/node_modules/zipfile/deps/libzip-0.10'
  933. make: *** [all] Error 2
  934. Traceback (most recent call last):
  935.   File "/usr/bin/node-waf", line 16, in <module>
  936.     Scripting.prepare(t, os.getcwd(), VERSION, wafdir)
  937.   File "/usr/bin/../lib/node/wafadmin/Scripting.py", line 145, in prepare
  938.     prepare_impl(t, cwd, ver, wafdir)
  939.   File "/usr/bin/../lib/node/wafadmin/Scripting.py", line 135, in prepare_impl
  940.     main()
  941.   File "/usr/bin/../lib/node/wafadmin/Scripting.py", line 188, in main
  942.     fun(ctx)
  943.   File "/usr/bin/../lib/node/wafadmin/Scripting.py", line 386, in build
  944.     return build_impl(bld)
  945.   File "/usr/bin/../lib/node/wafadmin/Scripting.py", line 399, in build_impl
  946.     bld.add_subdirs([os.path.split(Utils.g_module.root_path)[0]])
  947.   File "/usr/bin/../lib/node/wafadmin/Build.py", line 981, in add_subdirs
  948.     self.recurse(dirs, 'build')
  949.   File "/usr/bin/../lib/node/wafadmin/Utils.py", line 634, in recurse
  950.     f(self)
  951.   File "/tmp/tilemill/pkg/tilemill/usr/lib/node_modules/tilemill/node_modules/millstone/node_modules/zipfile/wscript", line 164, in build
  952. AttributeError: 'NoneType' object has no attribute 'ant_glob'
  953. npm ERR! error rolling back Error: ENOTEMPTY, rmdir '/tmp/tilemill/pkg/tilemill/usr/lib/node_modules/tilemill/node_modules/millstone/node_modules/zipfile/deps/libzip-0.10/regress'
  954. npm ERR! error rolling back  tilemill@0.10.1 { [Error: ENOTEMPTY, rmdir '/tmp/tilemill/pkg/tilemill/usr/lib/node_modules/tilemill/node_modules/millstone/node_modules/zipfile/deps/libzip-0.10/regress']
  955. npm ERR! error rolling back   errno: 53,
  956. npm ERR! error rolling back   code: 'ENOTEMPTY',
  957. npm ERR! error rolling back   path: '/tmp/tilemill/pkg/tilemill/usr/lib/node_modules/tilemill/node_modules/millstone/node_modules/zipfile/deps/libzip-0.10/regress' }
  958. npm ERR! mapnik@0.7.22 install: `node-waf -v configure build`
  959. npm ERR! `sh "-c" "node-waf -v configure build"` failed with 1
  960. npm ERR!
  961. npm ERR! Failed at the mapnik@0.7.22 install script.
  962. npm ERR! This is most likely a problem with the mapnik package,
  963. npm ERR! not with npm itself.
  964. npm ERR! Tell the author that this fails on your system:
  965. npm ERR!     node-waf -v configure build
  966. npm ERR! You can get their info via:
  967. npm ERR!     npm owner ls mapnik
  968. npm ERR! There is likely additional logging output above.
  969.  
  970. npm ERR! System Linux 3.9.2-1-ARCH
  971. npm ERR! command "/usr/bin/node" "/usr/bin/npm" "install" "-g" "--prefix" "/tmp/tilemill/pkg/tilemill/usr"
  972. npm ERR! cwd /tmp/tilemill/src/package
  973. npm ERR! node -v v0.8.23
  974. npm ERR! npm -v 1.2.18
  975. npm ERR! code ELIFECYCLE
  976. scons: *** [port/cpl_vsil.o] Source `port/cpl_vsil.cpp' not found, needed by target `port/cpl_vsil.o'.
  977. scons: building terminated because of errors.
  978. IOError: [Errno 2] No such file or directory: '.sconsign.tmp':
  979.   File "/tmp/tilemill/pkg/tilemill/usr/lib/node_modules/tilemill/node_modules/millstone/node_modules/srs/tools/scons/scons-local-1.2.0/SCons/Script/Main.py", line 1264:
  980.     None
  981.   File "/tmp/tilemill/pkg/tilemill/usr/lib/node_modules/tilemill/node_modules/millstone/node_modules/srs/tools/scons/scons-local-1.2.0/SCons/Script/Main.py", line 1229:
  982.     None
  983.   File "/tmp/tilemill/pkg/tilemill/usr/lib/node_modules/tilemill/node_modules/millstone/node_modules/srs/tools/scons/scons-local-1.2.0/SCons/Script/Main.py", line 992:
  984.     None
  985.   File "/tmp/tilemill/pkg/tilemill/usr/lib/node_modules/tilemill/node_modules/millstone/node_modules/srs/tools/scons/scons-local-1.2.0/SCons/Script/Main.py", line 1185:
  986.     None
  987.   File "/tmp/tilemill/pkg/tilemill/usr/lib/node_modules/tilemill/node_modules/millstone/node_modules/srs/tools/scons/scons-local-1.2.0/SCons/Job.py", line 111:
  988.     None
  989.   File "/tmp/tilemill/pkg/tilemill/usr/lib/node_modules/tilemill/node_modules/millstone/node_modules/srs/tools/scons/scons-local-1.2.0/SCons/Script/Main.py", line 1182:
  990.     None
  991.   File "/tmp/tilemill/pkg/tilemill/usr/lib/node_modules/tilemill/node_modules/millstone/node_modules/srs/tools/scons/scons-local-1.2.0/SCons/SConsign.py", line 107:
  992.     None
  993.   File "/tmp/tilemill/pkg/tilemill/usr/lib/node_modules/tilemill/node_modules/millstone/node_modules/srs/tools/scons/scons-local-1.2.0/SCons/dblite.py", line 93:
  994.     None
  995. Exception IOError: (2, 'No such file or directory', '.sconsign.tmp') in <bound method dblite.__del__ of <SCons.dblite.dblite instance at 0x1183cf8>> ignored
  996. Traceback (most recent call last):
  997.   File "/usr/bin/node-waf", line 16, in <module>
  998.     Scripting.prepare(t, os.getcwd(), VERSION, wafdir)
  999.   File "/usr/bin/../lib/node/wafadmin/Scripting.py", line 145, in prepare
  1000.     prepare_impl(t, cwd, ver, wafdir)
  1001.   File "/usr/bin/../lib/node/wafadmin/Scripting.py", line 135, in prepare_impl
  1002.     main()
  1003.   File "/usr/bin/../lib/node/wafadmin/Scripting.py", line 188, in main
  1004.     fun(ctx)
  1005.   File "/usr/bin/../lib/node/wafadmin/Scripting.py", line 386, in build
  1006.     return build_impl(bld)
  1007.   File "/usr/bin/../lib/node/wafadmin/Scripting.py", line 408, in build_impl
  1008.     info("Waf: Leaving directory `%s'" % bld.bldnode.abspath())
  1009.   File "/usr/bin/../lib/node/wafadmin/Node.py", line 420, in abspath
  1010.     ret = self.__class__.bld.cache_node_abspath[variant].get(self.id, None)
  1011. AttributeError: 'NoneType' object has no attribute 'cache_node_abspath'
  1012. ../deps/sqlite3/sqlite3.c: At top level:
  1013. ../deps/sqlite3/sqlite3.c:137464:1: fatal error: opening dependency file ./Release/.deps/Release/obj.target/sqlite3/deps/sqlite3/sqlite3.o.d.raw: No such file or directory
  1014. compilation terminated.
  1015. make: *** [Release/obj.target/sqlite3/deps/sqlite3/sqlite3.o] Error 1
  1016. make: Leaving directory `/tmp/tilemill/pkg/tilemill/usr/lib/node_modules/tilemill/node_modules/sqlite3/build'
  1017. gyp ERR! build error
  1018. gyp ERR! stack Error: `make` failed with exit code: 2
  1019. gyp ERR! stack     at ChildProcess.onExit (/usr/lib/node_modules/npm/node_modules/node-gyp/lib/build.js:267:23)
  1020. gyp ERR! stack     at ChildProcess.EventEmitter.emit (events.js:99:17)
  1021. gyp ERR! stack     at Process._handle.onexit (child_process.js:680:10)
  1022. gyp ERR! System Linux 3.9.2-1-ARCH
  1023. gyp ERR! command "node" "/usr/lib/node_modules/npm/node_modules/node-gyp/bin/node-gyp.js" "rebuild"
  1024. gyp ERR! UNCAUGHT EXCEPTION
  1025. gyp ERR! stack Error: ENOENT, no such file or directory
  1026. gyp ERR! stack     at errorMessage (/usr/lib/node_modules/npm/node_modules/node-gyp/bin/node-gyp.js:119:28)
  1027. gyp ERR! stack     at /usr/lib/node_modules/npm/node_modules/node-gyp/bin/node-gyp.js:76:7
  1028. gyp ERR! stack     at ChildProcess.onExit (/usr/lib/node_modules/npm/node_modules/node-gyp/lib/build.js:267:14)
  1029. gyp ERR! stack     at ChildProcess.EventEmitter.emit (events.js:99:17)
  1030. gyp ERR! stack     at Process._handle.onexit (child_process.js:680:10)
  1031. gyp ERR! System Linux 3.9.2-1-ARCH
  1032. gyp ERR! command "node" "/usr/lib/node_modules/npm/node_modules/node-gyp/bin/node-gyp.js" "rebuild"
  1033.  
  1034. /usr/lib/node_modules/npm/node_modules/node-gyp/bin/node-gyp.js:119
  1035.   log.error('cwd', process.cwd())
  1036.                            ^
  1037. Error: ENOENT, no such file or directory
  1038.     at errorMessage (/usr/lib/node_modules/npm/node_modules/node-gyp/bin/node-gyp.js:119:28)
  1039.     at issueMessage (/usr/lib/node_modules/npm/node_modules/node-gyp/bin/node-gyp.js:125:3)
  1040.     at process.<anonymous> (/usr/lib/node_modules/npm/node_modules/node-gyp/bin/node-gyp.js:109:3)
  1041.     at process.EventEmitter.emit (events.js:126:20)
  1042. npm ERR!
  1043. npm ERR! Additional logging details can be found in:
  1044. npm ERR!     /tmp/tilemill/src/package/npm-debug.log
  1045. npm ERR! not ok code 0
  1046. ==> ERROR: A failure occurred in package().
  1047.     Aborting...
clone this paste RAW Paste Data