Guest User

Untitled

a guest
Jan 15th, 2016
219
0
Never
Not a member of Pastebin yet? Sign Up, it unlocks many cool features!
text 103.24 KB | None | 0 0
  1. an.cpp item.cpp item_addon.cpp item_attribute.cpp item_manager.cpp item_manager_idrange.cpp locale.cpp locale_service.cpp log.cpp login_data.cpp lzo_manager.cpp marriage.cpp matrix_card.cpp messenger_manager.cpp mining.cpp mob_manager.cpp monarch.cpp motion.cpp over9refine.cpp p2p.cpp packet_info.cpp party.cpp passpod.cpp pcbang.cpp polymorph.cpp priv_manager.cpp pvp.cpp questevent.cpp questlua.cpp questlua_affect.cpp questlua_arena.cpp questlua_ba.cpp questlua_building.cpp questlua_danceevent.cpp questlua_dungeon.cpp questlua_forked.cpp questlua_game.cpp questlua_global.cpp questlua_guild.cpp questlua_horse.cpp questlua_pet.cpp questlua_item.cpp questlua_marriage.cpp questlua_mgmt.cpp questlua_monarch.cpp questlua_npc.cpp questlua_oxevent.cpp questlua_party.cpp questlua_pc.cpp questlua_quest.cpp questlua_target.cpp questmanager.cpp questnpc.cpp questpc.cpp refine.cpp regen.cpp safebox.cpp sectree.cpp sectree_manager.cpp sequence.cpp shop.cpp skill.cpp start_position.cpp target.cpp text_file_loader.cpp trigger.cpp utils.cpp vector.cpp war_map.cpp wedding.cpp xmas_event.cpp version.cpp panama.cpp threeway_war.cpp map_location.cpp auth_brazil.cpp BlueDragon.cpp BlueDragon_Binder.cpp DragonLair.cpp questlua_dragonlair.cpp HackShield.cpp HackShield_Impl.cpp char_hackshield.cpp skill_power.cpp affect.cpp SpeedServer.cpp questlua_speedserver.cpp XTrapManager.cpp auction_manager.cpp FileMonitor_FreeBSD.cpp ClientPackageCryptInfo.cpp cipher.cpp buff_on_attributes.cpp check_server.cpp dragon_soul_table.cpp DragonSoul.cpp group_text_parse_tree.cpp char_dragonsoul.cpp questlua_dragonsoul.cpp shop_manager.cpp shopEx.cpp item_manager_read_tables.cpp minilzo.c main.cpp 2> /dev/null > Depend
  2. gmake[1]: Leaving directory '/usr/src/novaline/Server/game/src'
  3. gmake -C game/src clean
  4. gmake[1]: Entering directory '/usr/src/novaline/Server/game/src'
  5. gmake[1]: Leaving directory '/usr/src/novaline/Server/game/src'
  6. gmake -C game/src limit_time
  7. gmake[1]: Entering directory '/usr/src/novaline/Server/game/src'
  8. update limit time
  9. gmake[1]: Leaving directory '/usr/src/novaline/Server/game/src'
  10. gmake -C db/src dep
  11. gmake[1]: Entering directory '/usr/src/novaline/Server/db/src'
  12. makedepend -fDepend -I../../boost -I../../libmysql/5.x-5.1.35 -I/usr/include/c++/3.3 -I/usr/include/c++/4.2 -p.obj/ Config.cpp NetBase.cpp Peer.cpp PeerBase.cpp Main.cpp Lock.cpp DBManager.cpp Cache.cpp LoginData.cpp ClientManager.cpp ClientManagerPlayer.cpp ClientManagerLogin.cpp ClientManagerBoot.cpp ClientManagerParty.cpp ClientManagerGuild.cpp GuildManager.cpp HB.cpp PrivManager.cpp MoneyLog.cpp ItemAwardManager.cpp ClientManagerEventFlag.cpp Marriage.cpp Monarch.cpp BlockCountry.cpp ItemIDRangeManager.cpp ClientManagerHorseName.cpp version.cpp AuctionManager.cpp ProtoReader.cpp CsvReader.cpp 2> /dev/null
  13. gmake[1]: Leaving directory '/usr/src/novaline/Server/db/src'
  14. gmake -C db/src clean
  15. gmake[1]: Entering directory '/usr/src/novaline/Server/db/src'
  16. gmake[1]: Leaving directory '/usr/src/novaline/Server/db/src'
  17. --------------------------------------
  18. Build Done
  19. --------------------------------------
  20. root@HOSTNAME:/usr/src/novaline/Server # cd /usr/src/novaline/Server/db/src
  21. root@HOSTNAME:/usr/src/novaline/Server/db/src # gmake clean
  22. root@HOSTNAME:/usr/src/novaline/Server/db/src # gmake -j20
  23. compile NetBase.cpp
  24. compile Peer.cpp
  25. compile PeerBase.cpp
  26. compile Main.cpp
  27. compile Lock.cpp
  28. compile DBManager.cpp
  29. compile Cache.cpp
  30. compile LoginData.cpp
  31. compile ClientManager.cpp
  32. compile ClientManagerPlayer.cpp
  33. compile ClientManagerLogin.cpp
  34. compile ClientManagerBoot.cpp
  35. compile ClientManagerParty.cpp
  36. compile ClientManagerGuild.cpp
  37. compile GuildManager.cpp
  38. compile HB.cpp
  39. compile PrivManager.cpp
  40. compile ItemAwardManager.cpp
  41. compile Config.cpp
  42. compile MoneyLog.cpp
  43. g++: warning: '-mcpu=' is deprecated; use '-mtune=' or '-march=' instead
  44. g++: warning: '-mcpu=' is deprecated; use '-mtune=' or '-march=' instead
  45. g++: warning: '-mcpu=' is deprecated; use '-mtune=' or '-march=' instead
  46. g++: warning: '-mcpu=' is deprecated; use '-mtune=' or '-march=' instead
  47. g++: warning: '-mcpu=' is deprecated; use '-mtune=' or '-march=' instead
  48. g++: warning: '-mcpu=' is deprecated; use '-mtune=' or '-march=' instead
  49. g++: warning: '-mcpu=' is deprecated; use '-mtune=' or '-march=' instead
  50. g++: warning: '-mcpu=' is deprecated; use '-mtune=' or '-march=' instead
  51. g++: warning: '-mcpu=' is deprecated; use '-mtune=' or '-march=' instead
  52. g++: warning: '-mcpu=' is deprecated; use '-mtune=' or '-march=' instead
  53. g++: warning: '-mcpu=' is deprecated; use '-mtune=' or '-march=' instead
  54. g++: warning: '-mcpu=' is deprecated; use '-mtune=' or '-march=' instead
  55. g++: warning: '-mcpu=' is deprecated; use '-mtune=' or '-march=' instead
  56. g++: warning: '-mcpu=' is deprecated; use '-mtune=' or '-march=' instead
  57. g++: warning: '-mcpu=' is deprecated; use '-mtune=' or '-march=' instead
  58. g++: warning: '-mcpu=' is deprecated; use '-mtune=' or '-march=' instead
  59. g++: warning: '-mcpu=' is deprecated; use '-mtune=' or '-march=' instead
  60. g++: warning: '-mcpu=' is deprecated; use '-mtune=' or '-march=' instead
  61. g++: warning: '-mcpu=' is deprecated; use '-mtune=' or '-march=' instead
  62. g++: warning: '-mcpu=' is deprecated; use '-mtune=' or '-march=' instead
  63. g++: internal compiler error: Killed (program cc1plus)
  64. no stack trace because unwind library not available
  65. Please submit a full bug report,
  66. with preprocessed source if appropriate.
  67. See <http://gcc.gnu.org/bugs.html> for instructions.
  68. compile ClientManagerEventFlag.cpp
  69. Makefile:59: recipe for target '.obj/PrivManager.o' failed
  70. gmake: *** [.obj/PrivManager.o] Error 4
  71. gmake: *** Waiting for unfinished jobs....
  72. g++: internal compiler error: Killed (program cc1plus)
  73. no stack trace because unwind library not available
  74. Please submit a full bug report,
  75. with preprocessed source if appropriate.
  76. See <http://gcc.gnu.org/bugs.html> for instructions.
  77. Makefile:59: recipe for target '.obj/ClientManagerGuild.o' failed
  78. gmake: *** [.obj/ClientManagerGuild.o] Error 4
  79. g++: warning: '-mcpu=' is deprecated; use '-mtune=' or '-march=' instead
  80. g++: internal compiler error: Killed (program cc1plus)
  81. no stack trace because unwind library not available
  82. Please submit a full bug report,
  83. with preprocessed source if appropriate.
  84. See <http://gcc.gnu.org/bugs.html> for instructions.
  85. Makefile:59: recipe for target '.obj/MoneyLog.o' failed
  86. gmake: *** [.obj/MoneyLog.o] Error 4
  87. g++: internal compiler error: Killed (program cc1plus)
  88. no stack trace because unwind library not available
  89. Please submit a full bug report,
  90. with preprocessed source if appropriate.
  91. See <http://gcc.gnu.org/bugs.html> for instructions.
  92. Makefile:59: recipe for target '.obj/DBManager.o' failed
  93. gmake: *** [.obj/DBManager.o] Error 4
  94. g++: internal compiler error: Killed (program cc1plus)
  95. no stack trace because unwind library not available
  96. Please submit a full bug report,
  97. with preprocessed source if appropriate.
  98. See <http://gcc.gnu.org/bugs.html> for instructions.
  99. Makefile:59: recipe for target '.obj/NetBase.o' failed
  100. gmake: *** [.obj/NetBase.o] Error 4
  101. g++: internal compiler error: Killed (program cc1plus)
  102. no stack trace because unwind library not available
  103. Please submit a full bug report,
  104. with preprocessed source if appropriate.
  105. See <http://gcc.gnu.org/bugs.html> for instructions.
  106. Makefile:59: recipe for target '.obj/ItemAwardManager.o' failed
  107. gmake: *** [.obj/ItemAwardManager.o] Error 4
  108. g++: internal compiler error: Killed (program cc1plus)
  109. no stack trace because unwind library not available
  110. Please submit a full bug report,
  111. with preprocessed source if appropriate.
  112. See <http://gcc.gnu.org/bugs.html> for instructions.
  113. Makefile:59: recipe for target '.obj/Main.o' failed
  114. In file included from GuildManager.cpp:2:0:
  115. GuildManager.h: In member function 'bool TGuildDeclareInfo::operator<(const TGuildDeclareInfo&) const':
  116. GuildManager.h:32:74: warning: suggest parentheses around '&&' within '||' [-Wparentheses]
  117. return dwGuildID[0] < r.dwGuildID[0] || dwGuildID[0] == r.dwGuildID[0] && dwGuildID[1] < r.dwGuildID[1];
  118. ^
  119. gmake: *** [.obj/Main.o] Error 4
  120. GuildManager.h: In member function 'bool TGuildWaitStartInfo::operator<(const TGuildWaitStartInfo&) const':
  121. GuildManager.h:66:50: warning: suggest parentheses around '&&' within '||' [-Wparentheses]
  122. return GID[0] < r.GID[0] || GID[0] == r.GID[0] && GID[1] < r.GID[1];
  123. ^
  124. GuildManager.h: In function 'bool operator<(const TGuildSkillUsed&, const TGuildSkillUsed&)':
  125. GuildManager.h:102:44: warning: suggest parentheses around '&&' within '||' [-Wparentheses]
  126. return a.GID < b.GID || a.GID == b.GID && a.dwSkillVnum < b.dwSkillVnum;
  127. ^
  128. g++: internal compiler error: Killed (program cc1plus)
  129. no stack trace because unwind library not available
  130. Please submit a full bug report,
  131. with preprocessed source if appropriate.
  132. See <http://gcc.gnu.org/bugs.html> for instructions.
  133. Makefile:59: recipe for target '.obj/GuildManager.o' failed
  134. gmake: *** [.obj/GuildManager.o] Error 4
  135. g++: internal compiler error: Killed (program cc1plus)
  136. no stack trace because unwind library not available
  137. Please submit a full bug report,
  138. with preprocessed source if appropriate.
  139. See <http://gcc.gnu.org/bugs.html> for instructions.
  140. Makefile:59: recipe for target '.obj/ClientManagerParty.o' failed
  141. gmake: *** [.obj/ClientManagerParty.o] Error 4
  142. g++: internal compiler error: Killed (program cc1plus)
  143. no stack trace because unwind library not available
  144. Please submit a full bug report,
  145. with preprocessed source if appropriate.
  146. See <http://gcc.gnu.org/bugs.html> for instructions.
  147. Makefile:59: recipe for target '.obj/ClientManagerPlayer.o' failed
  148. gmake: *** [.obj/ClientManagerPlayer.o] Error 4
  149. g++: internal compiler error: Killed (program cc1plus)
  150. no stack trace because unwind library not available
  151. Please submit a full bug report,
  152. with preprocessed source if appropriate.
  153. See <http://gcc.gnu.org/bugs.html> for instructions.
  154. Makefile:59: recipe for target '.obj/LoginData.o' failed
  155. gmake: *** [.obj/LoginData.o] Error 4
  156. In file included from ClientManager.cpp:15:0:
  157. GuildManager.h: In member function 'bool TGuildDeclareInfo::operator<(const TGuildDeclareInfo&) const':
  158. GuildManager.h:32:74: warning: suggest parentheses around '&&' within '||' [-Wparentheses]
  159. return dwGuildID[0] < r.dwGuildID[0] || dwGuildID[0] == r.dwGuildID[0] && dwGuildID[1] < r.dwGuildID[1];
  160. ^
  161. GuildManager.h: In member function 'bool TGuildWaitStartInfo::operator<(const TGuildWaitStartInfo&) const':
  162. GuildManager.h:66:50: warning: suggest parentheses around '&&' within '||' [-Wparentheses]
  163. return GID[0] < r.GID[0] || GID[0] == r.GID[0] && GID[1] < r.GID[1];
  164. ^
  165. GuildManager.h: In function 'bool operator<(const TGuildSkillUsed&, const TGuildSkillUsed&)':
  166. GuildManager.h:102:44: warning: suggest parentheses around '&&' within '||' [-Wparentheses]
  167. return a.GID < b.GID || a.GID == b.GID && a.dwSkillVnum < b.dwSkillVnum;
  168. ^
  169. ClientManagerBoot.cpp: In member function 'bool CClientManager::InitializeMobTableTXT()':
  170. ClientManagerBoot.cpp:424:11: warning: statement has no effect [-Wunused-value]
  171. test_data;
  172. ^
  173. ClientManagerBoot.cpp:223:7: warning: variable 'isNameFile' set but not used [-Wunused-but-set-variable]
  174. bool isNameFile = true;
  175. ^
  176. ClientManagerBoot.cpp: In member function 'bool CClientManager::InitializeItemTableTXT()':
  177. ClientManagerBoot.cpp:623:7: warning: variable 'isNameFile' set but not used [-Wunused-but-set-variable]
  178. bool isNameFile = true;
  179. ^
  180. ClientManagerBoot.cpp:725:6: warning: unused variable 'testValue' [-Wunused-variable]
  181. int testValue = m_vec_itemTable.size();
  182. ^
  183. ClientManagerBoot.cpp: In member function 'bool CClientManager::MirrorItemTableIntoDB()':
  184. ClientManagerBoot.cpp:1730:93: warning: format '%d' expects argument of type 'int', but argument 25 has type 'long int' [-Wformat=]
  185. t.alValues[0], t.alValues[1], t.alValues[2], t.alValues[3], t.alValues[4], t.alValues[5]);
  186. ^
  187. ClientManagerBoot.cpp:1730:93: warning: format '%d' expects argument of type 'int', but argument 27 has type 'long int' [-Wformat=]
  188. ClientManagerBoot.cpp:1730:93: warning: format '%d' expects argument of type 'int', but argument 29 has type 'long int' [-Wformat=]
  189. ClientManagerBoot.cpp:1730:93: warning: format '%d' expects argument of type 'int', but argument 31 has type 'long int' [-Wformat=]
  190. ClientManagerBoot.cpp:1730:93: warning: format '%d' expects argument of type 'int', but argument 33 has type 'long int' [-Wformat=]
  191. ClientManagerBoot.cpp:1730:93: warning: format '%d' expects argument of type 'int', but argument 34 has type 'long int' [-Wformat=]
  192. ClientManagerBoot.cpp:1730:93: warning: format '%d' expects argument of type 'int', but argument 35 has type 'long int' [-Wformat=]
  193. ClientManagerBoot.cpp:1730:93: warning: format '%d' expects argument of type 'int', but argument 36 has type 'long int' [-Wformat=]
  194. ClientManagerBoot.cpp:1730:93: warning: format '%d' expects argument of type 'int', but argument 37 has type 'long int' [-Wformat=]
  195. ClientManagerBoot.cpp:1730:93: warning: format '%d' expects argument of type 'int', but argument 38 has type 'long int' [-Wformat=]
  196. ClientManagerBoot.cpp:1730:93: warning: format '%d' expects argument of type 'int', but argument 39 has type 'long int' [-Wformat=]
  197. ClientManagerBoot.cpp:1730:93: warning: format '%d' expects argument of type 'int', but argument 25 has type 'long int' [-Wformat=]
  198. ClientManagerBoot.cpp:1730:93: warning: format '%d' expects argument of type 'int', but argument 27 has type 'long int' [-Wformat=]
  199. ClientManager.cpp: In member function 'void CClientManager::MainLoop()':
  200. ClientManager.cpp:236:10: warning: deleting object of polymorphic class type 'CItemPriceListTableCache' which has non-virtual destructor might cause undefined behaviour [-Wdelete-non-virtual-dtor]
  201. delete pCache;
  202. ^
  203. ClientManagerBoot.cpp:1730:93: warning: format '%d' expects argument of type 'int', but argument 29 has type 'long int' [-Wformat=]
  204. ClientManagerBoot.cpp:1730:93: warning: format '%d' expects argument of type 'int', but argument 31 has type 'long int' [-Wformat=]
  205. ClientManagerBoot.cpp:1730:93: warning: format '%d' expects argument of type 'int', but argument 33 has type 'long int' [-Wformat=]
  206. ClientManagerBoot.cpp:1730:93: warning: format '%d' expects argument of type 'int', but argument 34 has type 'long int' [-Wformat=]
  207. ClientManagerBoot.cpp:1730:93: warning: format '%d' expects argument of type 'int', but argument 35 has type 'long int' [-Wformat=]
  208. ClientManagerBoot.cpp:1730:93: warning: format '%d' expects argument of type 'int', but argument 36 has type 'long int' [-Wformat=]
  209. ClientManagerBoot.cpp:1730:93: warning: format '%d' expects argument of type 'int', but argument 37 has type 'long int' [-Wformat=]
  210. ClientManagerBoot.cpp:1730:93: warning: format '%d' expects argument of type 'int', but argument 38 has type 'long int' [-Wformat=]
  211. ClientManager.cpp: In member function 'void CClientManager::RESULT_SAFEBOX_CHANGE_PASSWORD(CPeer*, SQLMsg*)':
  212. ClientManager.cpp:876:25: warning: suggest parentheses around '&&' within '||' [-Wparentheses]
  213. if (row[0] && *row[0] && !strcasecmp(row[0], p->login) || (!row[0] || !*row[0]) && !strcmp("000000", p->login))
  214. ^
  215. ClientManagerBoot.cpp:1730:93: warning: format '%d' expects argument of type 'int', but argument 39 has type 'long int' [-Wformat=]
  216. ClientManagerBoot.cpp:1758:93: warning: format '%d' expects argument of type 'int', but argument 23 has type 'long int' [-Wformat=]
  217. t.alValues[0], t.alValues[1], t.alValues[2], t.alValues[3], t.alValues[4], t.alValues[5]);
  218. ^
  219. ClientManagerBoot.cpp:1758:93: warning: format '%d' expects argument of type 'int', but argument 25 has type 'long int' [-Wformat=]
  220. ClientManagerBoot.cpp:1758:93: warning: format '%d' expects argument of type 'int', but argument 27 has type 'long int' [-Wformat=]
  221. ClientManagerBoot.cpp:1758:93: warning: format '%d' expects argument of type 'int', but argument 29 has type 'long int' [-Wformat=]
  222. ClientManagerBoot.cpp:1758:93: warning: format '%d' expects argument of type 'int', but argument 31 has type 'long int' [-Wformat=]
  223. ClientManagerBoot.cpp:1758:93: warning: format '%d' expects argument of type 'int', but argument 32 has type 'long int' [-Wformat=]
  224. ClientManagerBoot.cpp:1758:93: warning: format '%d' expects argument of type 'int', but argument 33 has type 'long int' [-Wformat=]
  225. ClientManagerBoot.cpp:1758:93: warning: format '%d' expects argument of type 'int', but argument 34 has type 'long int' [-Wformat=]
  226. ClientManagerBoot.cpp:1758:93: warning: format '%d' expects argument of type 'int', but argument 35 has type 'long int' [-Wformat=]
  227. ClientManagerBoot.cpp:1758:93: warning: format '%d' expects argument of type 'int', but argument 36 has type 'long int' [-Wformat=]
  228. ClientManagerBoot.cpp:1758:93: warning: format '%d' expects argument of type 'int', but argument 37 has type 'long int' [-Wformat=]
  229. ClientManagerBoot.cpp:1758:93: warning: format '%d' expects argument of type 'int', but argument 23 has type 'long int' [-Wformat=]
  230. ClientManagerBoot.cpp:1758:93: warning: format '%d' expects argument of type 'int', but argument 25 has type 'long int' [-Wformat=]
  231. g++: internal compiler error: Killed (program cc1plus)
  232. no stack trace because unwind library not available
  233. Please submit a full bug report,
  234. with preprocessed source if appropriate.
  235. See <http://gcc.gnu.org/bugs.html> for instructions.
  236. Makefile:59: recipe for target '.obj/ClientManager.o' failed
  237. ClientManagerBoot.cpp:1758:93: warning: format '%d' expects argument of type 'int', but argument 27 has type 'long int' [-Wformat=]
  238. gmake: *** [.obj/ClientManager.o] Error 4
  239. ClientManagerBoot.cpp:1758:93: warning: format '%d' expects argument of type 'int', but argument 29 has type 'long int' [-Wformat=]
  240. ClientManagerBoot.cpp:1758:93: warning: format '%d' expects argument of type 'int', but argument 31 has type 'long int' [-Wformat=]
  241. ClientManagerBoot.cpp:1758:93: warning: format '%d' expects argument of type 'int', but argument 32 has type 'long int' [-Wformat=]
  242. ClientManagerBoot.cpp:1758:93: warning: format '%d' expects argument of type 'int', but argument 33 has type 'long int' [-Wformat=]
  243. ClientManagerBoot.cpp:1758:93: warning: format '%d' expects argument of type 'int', but argument 34 has type 'long int' [-Wformat=]
  244. ClientManagerBoot.cpp:1758:93: warning: format '%d' expects argument of type 'int', but argument 35 has type 'long int' [-Wformat=]
  245. ClientManagerBoot.cpp:1758:93: warning: format '%d' expects argument of type 'int', but argument 36 has type 'long int' [-Wformat=]
  246. ClientManagerBoot.cpp:1758:93: warning: format '%d' expects argument of type 'int', but argument 37 has type 'long int' [-Wformat=]
  247. root@HOSTNAME:/usr/src/novaline/Server/db/src #
  248. root@HOSTNAME:/usr/src/novaline/Server/db/src #
  249. root@HOSTNAME:/usr/src/novaline/Server/db/src #
  250. root@HOSTNAME:/usr/src/novaline/Server/db/src #
  251. root@HOSTNAME:/usr/src/novaline/Server/db/src # gmake clean
  252. root@HOSTNAME:/usr/src/novaline/Server/db/src # gmake -j20
  253. compile Peer.cpp
  254. compile PeerBase.cpp
  255. compile Main.cpp
  256. compile Lock.cpp
  257. compile DBManager.cpp
  258. compile Cache.cpp
  259. compile LoginData.cpp
  260. compile ClientManager.cpp
  261. compile ClientManagerPlayer.cpp
  262. compile ClientManagerLogin.cpp
  263. compile ClientManagerBoot.cpp
  264. compile ClientManagerGuild.cpp
  265. compile GuildManager.cpp
  266. compile HB.cpp
  267. compile PrivManager.cpp
  268. compile MoneyLog.cpp
  269. compile ItemAwardManager.cpp
  270. compile Config.cpp
  271. compile NetBase.cpp
  272. compile ClientManagerParty.cpp
  273. g++: warning: '-mcpu=' is deprecated; use '-mtune=' or '-march=' instead
  274. g++: warning: '-mcpu=' is deprecated; use '-mtune=' or '-march=' instead
  275. g++: warning: '-mcpu=' is deprecated; use '-mtune=' or '-march=' instead
  276. g++: warning: '-mcpu=' is deprecated; use '-mtune=' or '-march=' instead
  277. g++: warning: '-mcpu=' is deprecated; use '-mtune=' or '-march=' instead
  278. g++: warning: '-mcpu=' is deprecated; use '-mtune=' or '-march=' instead
  279. g++: warning: '-mcpu=' is deprecated; use '-mtune=' or '-march=' instead
  280. g++: warning: '-mcpu=' is deprecated; use '-mtune=' or '-march=' instead
  281. g++: warning: '-mcpu=' is deprecated; use '-mtune=' or '-march=' instead
  282. g++: warning: '-mcpu=' is deprecated; use '-mtune=' or '-march=' instead
  283. g++: warning: '-mcpu=' is deprecated; use '-mtune=' or '-march=' instead
  284. g++: warning: '-mcpu=' is deprecated; use '-mtune=' or '-march=' instead
  285. g++: warning: '-mcpu=' is deprecated; use '-mtune=' or '-march=' instead
  286. g++: warning: '-mcpu=' is deprecated; use '-mtune=' or '-march=' instead
  287. g++: warning: '-mcpu=' is deprecated; use '-mtune=' or '-march=' instead
  288. g++: warning: '-mcpu=' is deprecated; use '-mtune=' or '-march=' instead
  289. g++: warning: '-mcpu=' is deprecated; use '-mtune=' or '-march=' instead
  290. g++: warning: '-mcpu=' is deprecated; use '-mtune=' or '-march=' instead
  291. g++: warning: '-mcpu=' is deprecated; use '-mtune=' or '-march=' instead
  292. g++: warning: '-mcpu=' is deprecated; use '-mtune=' or '-march=' instead
  293. g++: internal compiler error: Killed (program cc1plus)
  294. no stack trace because unwind library not available
  295. Please submit a full bug report,
  296. with preprocessed source if appropriate.
  297. See <http://gcc.gnu.org/bugs.html> for instructions.
  298. Makefile:52: recipe for target '.obj/ClientManager.o' failed
  299. gmake: *** [.obj/ClientManager.o] Error 4
  300. gmake: *** Waiting for unfinished jobs....
  301. g++: internal compiler error: Killed (program cc1plus)
  302. no stack trace because unwind library not available
  303. Please submit a full bug report,
  304. with preprocessed source if appropriate.
  305. See <http://gcc.gnu.org/bugs.html> for instructions.
  306. Makefile:52: recipe for target '.obj/LoginData.o' failed
  307. gmake: *** [.obj/LoginData.o] Error 4
  308. g++: internal compiler error: Killed (program cc1plus)
  309. no stack trace because unwind library not available
  310. Please submit a full bug report,
  311. with preprocessed source if appropriate.
  312. See <http://gcc.gnu.org/bugs.html> for instructions.
  313. Makefile:52: recipe for target '.obj/MoneyLog.o' failed
  314. gmake: *** [.obj/MoneyLog.o] Error 4
  315. g++: internal compiler error: Killed (program cc1plus)
  316. no stack trace because unwind library not available
  317. Please submit a full bug report,
  318. with preprocessed source if appropriate.
  319. See <http://gcc.gnu.org/bugs.html> for instructions.
  320. Makefile:52: recipe for target '.obj/ClientManagerBoot.o' failed
  321. gmake: *** [.obj/ClientManagerBoot.o] Error 4
  322. g++: internal compiler error: Killed (program cc1plus)
  323. no stack trace because unwind library not available
  324. Please submit a full bug report,
  325. with preprocessed source if appropriate.
  326. See <http://gcc.gnu.org/bugs.html> for instructions.
  327. Makefile:52: recipe for target '.obj/ClientManagerGuild.o' failed
  328. gmake: *** [.obj/ClientManagerGuild.o] Error 4
  329. g++: internal compiler error: Killed (program cc1plus)
  330. no stack trace because unwind library not available
  331. Please submit a full bug report,
  332. with preprocessed source if appropriate.
  333. See <http://gcc.gnu.org/bugs.html> for instructions.
  334. Makefile:52: recipe for target '.obj/Main.o' failed
  335. gmake: *** [.obj/Main.o] Error 4
  336. g++: internal compiler error: Killed (program cc1plus)
  337. no stack trace because unwind library not available
  338. Please submit a full bug report,
  339. with preprocessed source if appropriate.
  340. See <http://gcc.gnu.org/bugs.html> for instructions.
  341. Makefile:52: recipe for target '.obj/DBManager.o' failed
  342. gmake: *** [.obj/DBManager.o] Error 4
  343. g++: internal compiler error: Killed (program cc1plus)
  344. no stack trace because unwind library not available
  345. Please submit a full bug report,
  346. with preprocessed source if appropriate.
  347. See <http://gcc.gnu.org/bugs.html> for instructions.
  348. Makefile:52: recipe for target '.obj/Cache.o' failed
  349. gmake: *** [.obj/Cache.o] Error 4
  350. g++: internal compiler error: Killed (program cc1plus)
  351. no stack trace because unwind library not available
  352. Please submit a full bug report,
  353. with preprocessed source if appropriate.
  354. See <http://gcc.gnu.org/bugs.html> for instructions.
  355. Makefile:52: recipe for target '.obj/PrivManager.o' failed
  356. gmake: *** [.obj/PrivManager.o] Error 4
  357. g++: internal compiler error: Killed (program cc1plus)
  358. no stack trace because unwind library not available
  359. Please submit a full bug report,
  360. with preprocessed source if appropriate.
  361. See <http://gcc.gnu.org/bugs.html> for instructions.
  362. Makefile:52: recipe for target '.obj/ItemAwardManager.o' failed
  363. gmake: *** [.obj/ItemAwardManager.o] Error 4
  364. g++: internal compiler error: Killed (program cc1plus)
  365. no stack trace because unwind library not available
  366. Please submit a full bug report,
  367. with preprocessed source if appropriate.
  368. See <http://gcc.gnu.org/bugs.html> for instructions.
  369. Makefile:52: recipe for target '.obj/ClientManagerPlayer.o' failed
  370. gmake: *** [.obj/ClientManagerPlayer.o] Error 4
  371. root@HOSTNAME:/usr/src/novaline/Server/db/src #
  372. root@HOSTNAME:/usr/src/novaline/Server/db/src # gmake -j20
  373. root@HOSTNAME:/usr/src/novaline/Server/db/src #
  374. root@HOSTNAME:/usr/src/novaline/Server/db/src # ee /etc/motd
  375. ^[ (escape) menu ^y search prompt ^k delete line ^p prev li ^g prev page
  376. ^o ascii code ^x search ^l undelete line ^n next li ^v next page
  377. ^u end of file ^a begin of line ^w delete word ^b back 1 char
  378. ^t top of text ^e end of line ^r restore word ^f forward 1 char
  379. ^c command ^d delete char ^j undelete char ^z next word
  380. =====line 1 col 0 lines from top 1 ============================================
  381. FreeBSD 10.1-RELEASE-p9 (GENERIC) #0: Tue Apr 7 01:09:46 UTC 2015
  382.  
  383. HOSTNAME <3
  384.  
  385.  
  386.  
  387.  
  388.  
  389.  
  390.  
  391.  
  392.  
  393.  
  394.  
  395.  
  396.  
  397.  
  398.  
  399.  
  400.  
  401.  
  402.  
  403.  
  404.  
  405.  
  406.  
  407.  
  408.  
  409.  
  410.  
  411.  
  412.  
  413.  
  414.  
  415.  
  416.  
  417.  
  418.  
  419.  
  420.  
  421. root@HOSTNAME:/usr/src/novaline/Server/db/src #
  422. root@HOSTNAME:/usr/src/novaline/Server/db/src #
  423. root@HOSTNAME:/usr/src/novaline/Server/db/src # clear
  424. root@HOSTNAME:/usr/src/novaline/Server/db/src # cd /usr/src/novaline/Server/db/src && gmake -j20
  425. compile ClientManagerEventFlag.cpp
  426. compile Marriage.cpp
  427. compile BlockCountry.cpp
  428. compile ItemIDRangeManager.cpp
  429. compile ClientManagerHorseName.cpp
  430. compile Monarch.cpp
  431. compile AuctionManager.cpp
  432. compile ProtoReader.cpp
  433. compile CsvReader.cpp
  434. g++: warning: '-mcpu=' is deprecated; use '-mtune=' or '-march=' instead
  435. g++: warning: '-mcpu=' is deprecated; use '-mtune=' or '-march=' instead
  436. g++: warning: '-mcpu=' is deprecated; use '-mtune=' or '-march=' instead
  437. g++: warning: '-mcpu=' is deprecated; use '-mtune=' or '-march=' instead
  438. g++: warning: '-mcpu=' is deprecated; use '-mtune=' or '-march=' instead
  439. g++: warning: '-mcpu=' is deprecated; use '-mtune=' or '-march=' instead
  440. g++: warning: '-mcpu=' is deprecated; use '-mtune=' or '-march=' instead
  441. g++: warning: '-mcpu=' is deprecated; use '-mtune=' or '-march=' instead
  442. g++: warning: '-mcpu=' is deprecated; use '-mtune=' or '-march=' instead
  443. g++: warning: '-mcpu=' is deprecated; use '-mtune=' or '-march=' instead
  444. compile version.cpp
  445.  
  446. g++: internal compiler error: Killed (program cc1plus)
  447. no stack trace because unwind library not available
  448. Please submit a full bug report,
  449. with preprocessed source if appropriate.
  450. See <http://gcc.gnu.org/bugs.html> for instructions.
  451. Makefile:52: recipe for target '.obj/ClientManagerHorseName.o' failed
  452. gmake: *** [.obj/ClientManagerHorseName.o] Error 4
  453. gmake: *** Waiting for unfinished jobs....
  454. g++: internal compiler error: Killed (program cc1plus)
  455. no stack trace because unwind library not available
  456. Please submit a full bug report,
  457. with preprocessed source if appropriate.
  458. See <http://gcc.gnu.org/bugs.html> for instructions.
  459. Makefile:52: recipe for target '.obj/Monarch.o' failed
  460. gmake: *** [.obj/Monarch.o] Error 4
  461. root@HOSTNAME:/usr/src/novaline/Server/db/src #
  462. root@HOSTNAME:/usr/src/novaline/Server/db/src #
  463. root@HOSTNAME:/usr/src/novaline/Server/db/src #
  464. root@HOSTNAME:/usr/src/novaline/Server/db/src # cd /usr/src/novaline/Server/game/src
  465. root@HOSTNAME:/usr/src/novaline/Server/game/src # gmake -j20
  466. compile FSM.cpp
  467. compile MarkImage.cpp
  468. compile MarkManager.cpp
  469. compile OXEvent.cpp
  470. compile TrafficProfiler.cpp
  471. compile ani.cpp
  472. compile arena.cpp
  473. compile banword.cpp
  474. compile battle.cpp
  475. compile blend_item.cpp
  476. compile block_country.cpp
  477. compile buffer_manager.cpp
  478. compile building.cpp
  479. compile castle.cpp
  480. compile BattleArena.cpp
  481. compile char_affect.cpp
  482. compile char_battle.cpp
  483. g++: warning: '-mcpu=' is deprecated; use '-mtune=' or '-march=' instead
  484. compile MarkConvert.cpp
  485. compile char_change_empire.cpp
  486. g++: warning: '-mcpu=' is deprecated; use '-mtune=' or '-march=' instead
  487. g++: warning: '-mcpu=' is deprecated; use '-mtune=' or '-march=' instead
  488. g++: warning: '-mcpu=' is deprecated; use '-mtune=' or '-march=' instead
  489. g++: warning: '-mcpu=' is deprecated; use '-mtune=' or '-march=' instead
  490. g++: warning: '-mcpu=' is deprecated; use '-mtune=' or '-march=' instead
  491. g++: warning: '-mcpu=' is deprecated; use '-mtune=' or '-march=' instead
  492. g++: warning: '-mcpu=' is deprecated; use '-mtune=' or '-march=' instead
  493. g++: warning: '-mcpu=' is deprecated; use '-mtune=' or '-march=' instead
  494. g++: warning: '-mcpu=' is deprecated; use '-mtune=' or '-march=' instead
  495. g++: warning: '-mcpu=' is deprecated; use '-mtune=' or '-march=' instead
  496. g++: warning: '-mcpu=' is deprecated; use '-mtune=' or '-march=' instead
  497. g++: warning: '-mcpu=' is deprecated; use '-mtune=' or '-march=' instead
  498. compile char.cpp
  499. g++: warning: '-mcpu=' is deprecated; use '-mtune=' or '-march=' instead
  500. g++: warning: '-mcpu=' is deprecated; use '-mtune=' or '-march=' instead
  501. g++: warning: '-mcpu=' is deprecated; use '-mtune=' or '-march=' instead
  502. g++: warning: '-mcpu=' is deprecated; use '-mtune=' or '-march=' instead
  503. g++: warning: '-mcpu=' is deprecated; use '-mtune=' or '-march=' instead
  504. In file included from FSM.cpp:4:0:
  505. /usr/local/lib/gcc48/include/c++/cstdlib:178:10: error: expected unqualified-id before '__int128'
  506. inline __int128
  507. ^
  508. g++: warning: '-mcpu=' is deprecated; use '-mtune=' or '-march=' instead
  509. g++: warning: '-mcpu=' is deprecated; use '-mtune=' or '-march=' instead
  510. Makefile:119: recipe for target 'OBJDIR/FSM.o' failed
  511. gmake: *** [OBJDIR/FSM.o] Error 1
  512. gmake: *** Waiting for unfinished jobs....
  513. In file included from debug_allocator.h:4:0,
  514. from stdafx.h:7,
  515. from blend_item.cpp:10:
  516. /usr/local/lib/gcc48/include/c++/cstdlib:178:10: error: expected unqualified-id before '__int128'
  517. inline __int128
  518. ^
  519. In file included from desc.h:7:0,
  520. from char_battle.cpp:4:
  521. cipher.h:6:31: fatal error: cryptopp/cryptlib.h: No such file or directory
  522. #include <cryptopp/cryptlib.h>
  523. ^
  524. compilation terminated.
  525. Makefile:119: recipe for target 'OBJDIR/char_battle.o' failed
  526. In file included from desc.h:7:0,
  527. from battle.cpp:4:
  528. cipher.h:6:31: fatal error: cryptopp/cryptlib.h: No such file or directory
  529. #include <cryptopp/cryptlib.h>
  530. ^
  531. In file included from debug_allocator.h:4:0,
  532. from stdafx.h:7,
  533. from TrafficProfiler.cpp:10:
  534. /usr/local/lib/gcc48/include/c++/cstdlib:178:10: error: expected unqualified-id before '__int128'
  535. inline __int128
  536. ^
  537. gmake: *** [OBJDIR/char_battle.o] Error 1
  538. compilation terminated.
  539. In file included from desc.h:7:0,
  540. from arena.cpp:5:
  541. cipher.h:6:31: fatal error: cryptopp/cryptlib.h: No such file or directory
  542. #include <cryptopp/cryptlib.h>
  543. ^
  544. Makefile:119: recipe for target 'OBJDIR/battle.o' failed
  545. compilation terminated.
  546. gmake: *** [OBJDIR/battle.o] Error 1
  547. In file included from MarkImage.cpp:2:0:
  548. MarkImage.h:4:19: fatal error: IL/il.h: No such file or directory
  549. #include <IL/il.h>
  550. ^
  551. Makefile:119: recipe for target 'OBJDIR/arena.o' failed
  552. compilation terminated.
  553. gmake: *** [OBJDIR/arena.o] Error 1
  554. In file included from debug_allocator.h:4:0,
  555. from stdafx.h:7,
  556. from block_country.cpp:10:
  557. /usr/local/lib/gcc48/include/c++/cstdlib:178:10: error: expected unqualified-id before '__int128'
  558. inline __int128
  559. ^
  560. In file included from debug_allocator.h:4:0,
  561. from stdafx.h:7,
  562. from buffer_manager.cpp:1:
  563. /usr/local/lib/gcc48/include/c++/cstdlib:178:10: error: expected unqualified-id before '__int128'
  564. inline __int128
  565. ^
  566. Makefile:119: recipe for target 'OBJDIR/MarkImage.o' failed
  567. In file included from MarkManager.h:4:0,
  568. from MarkConvert.cpp:2:
  569. MarkImage.h:4:19: fatal error: IL/il.h: No such file or directory
  570. #include <IL/il.h>
  571. ^
  572. gmake: *** [OBJDIR/MarkImage.o] Error 1
  573. compilation terminated.
  574. In file included from MarkManager.h:4:0,
  575. from MarkManager.cpp:2:
  576. MarkImage.h:4:19: fatal error: IL/il.h: No such file or directory
  577. #include <IL/il.h>
  578. ^
  579. Makefile:119: recipe for target 'OBJDIR/MarkConvert.o' failed
  580. compilation terminated.
  581. gmake: *** [OBJDIR/MarkConvert.o] Error 1
  582. Makefile:119: recipe for target 'OBJDIR/MarkManager.o' failed
  583. gmake: *** [OBJDIR/MarkManager.o] Error 1
  584. Makefile:119: recipe for target 'OBJDIR/TrafficProfiler.o' failed
  585. gmake: *** [OBJDIR/TrafficProfiler.o] Error 1
  586. Makefile:119: recipe for target 'OBJDIR/blend_item.o' failed
  587. gmake: *** [OBJDIR/blend_item.o] Error 1
  588. Makefile:119: recipe for target 'OBJDIR/buffer_manager.o' failed
  589. gmake: *** [OBJDIR/buffer_manager.o] Error 1
  590. Makefile:119: recipe for target 'OBJDIR/block_country.o' failed
  591. gmake: *** [OBJDIR/block_country.o] Error 1
  592. In file included from debug_allocator.h:4:0,
  593. from stdafx.h:7,
  594. from BattleArena.cpp:1:
  595. /usr/local/lib/gcc48/include/c++/cstdlib:178:10: error: expected unqualified-id before '__int128'
  596. inline __int128
  597. ^
  598. In file included from debug_allocator.h:4:0,
  599. from stdafx.h:7,
  600. from char_change_empire.cpp:2:
  601. /usr/local/lib/gcc48/include/c++/cstdlib:178:10: error: expected unqualified-id before '__int128'
  602. inline __int128
  603. ^
  604. In file included from debug_allocator.h:4:0,
  605. from stdafx.h:7,
  606. from ani.cpp:10:
  607. /usr/local/lib/gcc48/include/c++/cstdlib:178:10: error: expected unqualified-id before '__int128'
  608. inline __int128
  609. ^
  610. In file included from debug_allocator.h:4:0,
  611. from stdafx.h:7,
  612. from banword.cpp:1:
  613. /usr/local/lib/gcc48/include/c++/cstdlib:178:10: error: expected unqualified-id before '__int128'
  614. inline __int128
  615. ^
  616. In file included from desc.h:7:0,
  617. from building.cpp:12:
  618. cipher.h:6:31: fatal error: cryptopp/cryptlib.h: No such file or directory
  619. #include <cryptopp/cryptlib.h>
  620. ^
  621. In file included from desc.h:7:0,
  622. from desc_client.h:4,
  623. from char_affect.cpp:10:
  624. cipher.h:6:31: fatal error: cryptopp/cryptlib.h: No such file or directory
  625. #include <cryptopp/cryptlib.h>
  626. ^
  627. compilation terminated.
  628. compilation terminated.
  629. In file included from debug_allocator.h:4:0,
  630. from stdafx.h:7,
  631. from castle.cpp:12:
  632. /usr/local/lib/gcc48/include/c++/cstdlib:178:10: error: expected unqualified-id before '__int128'
  633. inline __int128
  634. ^
  635. Makefile:119: recipe for target 'OBJDIR/building.o' failed
  636. In file included from desc.h:7:0,
  637. from desc_client.h:4,
  638. from char.cpp:12:
  639. cipher.h:6:31: fatal error: cryptopp/cryptlib.h: No such file or directory
  640. #include <cryptopp/cryptlib.h>
  641. ^
  642. gmake: *** [OBJDIR/building.o] Error 1
  643. In file included from desc.h:7:0,
  644. from OXEvent.cpp:12:
  645. cipher.h:6:31: fatal error: cryptopp/cryptlib.h: No such file or directory
  646. #include <cryptopp/cryptlib.h>
  647. ^
  648. compilation terminated.
  649. Makefile:119: recipe for target 'OBJDIR/char_affect.o' failed
  650. gmake: *** [OBJDIR/char_affect.o] Error 1
  651. compilation terminated.
  652. Makefile:119: recipe for target 'OBJDIR/OXEvent.o' failed
  653. gmake: *** [OBJDIR/OXEvent.o] Error 1
  654. Makefile:119: recipe for target 'OBJDIR/char.o' failed
  655. gmake: *** [OBJDIR/char.o] Error 1
  656. In file included from /usr/local/include/boost/limits.hpp:19:0,
  657. from /usr/local/include/boost/unordered/detail/allocate.hpp:340,
  658. from /usr/local/include/boost/unordered/detail/buckets.hpp:15,
  659. from /usr/local/include/boost/unordered/detail/table.hpp:10,
  660. from /usr/local/include/boost/unordered/detail/equivalent.hpp:14,
  661. from /usr/local/include/boost/unordered/unordered_map.hpp:17,
  662. from /usr/local/include/boost/unordered_map.hpp:16,
  663. from char.h:4,
  664. from BattleArena.cpp:6:
  665. /usr/local/lib/gcc48/include/c++/limits:1405:35: error: template argument 1 is invalid
  666. struct numeric_limits<__int128>
  667. ^
  668. /usr/local/lib/gcc48/include/c++/limits:1479:44: error: template argument 1 is invalid
  669. struct numeric_limits<unsigned __int128>
  670. ^
  671. In file included from /usr/local/include/boost/limits.hpp:19:0,
  672. from /usr/local/include/boost/unordered/detail/allocate.hpp:340,
  673. from /usr/local/include/boost/unordered/detail/buckets.hpp:15,
  674. from /usr/local/include/boost/unordered/detail/table.hpp:10,
  675. from /usr/local/include/boost/unordered/detail/equivalent.hpp:14,
  676. from /usr/local/include/boost/unordered/unordered_map.hpp:17,
  677. from /usr/local/include/boost/unordered_map.hpp:16,
  678. from char.h:4,
  679. from ani.cpp:11:
  680. /usr/local/lib/gcc48/include/c++/limits:1405:35: error: template argument 1 is invalid
  681. struct numeric_limits<__int128>
  682. ^
  683. In file included from /usr/local/include/boost/limits.hpp:19:0,
  684. from /usr/local/include/boost/unordered/detail/allocate.hpp:340,
  685. from /usr/local/include/boost/unordered/detail/buckets.hpp:15,
  686. from /usr/local/include/boost/unordered/detail/table.hpp:10,
  687. from /usr/local/include/boost/unordered/detail/equivalent.hpp:14,
  688. from /usr/local/include/boost/unordered/unordered_map.hpp:17,
  689. from /usr/local/include/boost/unordered_map.hpp:16,
  690. from char.h:4,
  691. from char_change_empire.cpp:4:
  692. /usr/local/lib/gcc48/include/c++/limits:1405:35: error: template argument 1 is invalid
  693. struct numeric_limits<__int128>
  694. ^
  695. /usr/local/lib/gcc48/include/c++/limits:1479:44: error: template argument 1 is invalid
  696. struct numeric_limits<unsigned __int128>
  697. ^
  698. /usr/local/lib/gcc48/include/c++/limits:1479:44: error: template argument 1 is invalid
  699. struct numeric_limits<unsigned __int128>
  700. ^
  701. In file included from /usr/local/include/boost/limits.hpp:19:0,
  702. from /usr/local/include/boost/unordered/detail/allocate.hpp:340,
  703. from /usr/local/include/boost/unordered/detail/buckets.hpp:15,
  704. from /usr/local/include/boost/unordered/detail/table.hpp:10,
  705. from /usr/local/include/boost/unordered/detail/equivalent.hpp:14,
  706. from /usr/local/include/boost/unordered/unordered_map.hpp:17,
  707. from /usr/local/include/boost/unordered_map.hpp:16,
  708. from banword.h:5,
  709. from banword.cpp:3:
  710. /usr/local/lib/gcc48/include/c++/limits:1405:35: error: template argument 1 is invalid
  711. struct numeric_limits<__int128>
  712. ^
  713. /usr/local/lib/gcc48/include/c++/limits:1479:44: error: template argument 1 is invalid
  714. struct numeric_limits<unsigned __int128>
  715. ^
  716. In file included from /usr/local/include/boost/limits.hpp:19:0,
  717. from /usr/local/include/boost/unordered/detail/allocate.hpp:340,
  718. from /usr/local/include/boost/unordered/detail/buckets.hpp:15,
  719. from /usr/local/include/boost/unordered/detail/table.hpp:10,
  720. from /usr/local/include/boost/unordered/detail/equivalent.hpp:14,
  721. from /usr/local/include/boost/unordered/unordered_map.hpp:17,
  722. from /usr/local/include/boost/unordered_map.hpp:16,
  723. from char.h:4,
  724. from castle.cpp:21:
  725. /usr/local/lib/gcc48/include/c++/limits:1405:35: error: template argument 1 is invalid
  726. struct numeric_limits<__int128>
  727. ^
  728. /usr/local/lib/gcc48/include/c++/limits:1479:44: error: template argument 1 is invalid
  729. struct numeric_limits<unsigned __int128>
  730. ^
  731. Makefile:119: recipe for target 'OBJDIR/ani.o' failed
  732. gmake: *** [OBJDIR/ani.o] Error 1
  733. Makefile:119: recipe for target 'OBJDIR/banword.o' failed
  734. gmake: *** [OBJDIR/banword.o] Error 1
  735. Makefile:119: recipe for target 'OBJDIR/BattleArena.o' failed
  736. gmake: *** [OBJDIR/BattleArena.o] Error 1
  737. Makefile:119: recipe for target 'OBJDIR/char_change_empire.o' failed
  738. gmake: *** [OBJDIR/char_change_empire.o] Error 1
  739. Makefile:119: recipe for target 'OBJDIR/castle.o' failed
  740. gmake: *** [OBJDIR/castle.o] Error 1
  741. root@HOSTNAME:/usr/src/novaline/Server/game/src #
  742. root@HOSTNAME:/usr/src/novaline/Server/game/src #
  743. root@HOSTNAME:/usr/src/novaline/Server/game/src #
  744. root@HOSTNAME:/usr/src/novaline/Server/game/src #
  745. root@HOSTNAME:/usr/src/novaline/Server/game/src # cd /usr/home/game
  746. root@HOSTNAME:/usr/home/game # cd /usr/src/novaline/Server/game/src
  747. root@HOSTNAME:/usr/src/novaline/Server/game/src # gmake -j20
  748. compile FSM.cpp
  749. compile MarkConvert.cpp
  750. compile MarkManager.cpp
  751. compile OXEvent.cpp
  752. compile TrafficProfiler.cpp
  753. compile ani.cpp
  754. compile arena.cpp
  755. compile banword.cpp
  756. compile battle.cpp
  757. compile blend_item.cpp
  758. compile block_country.cpp
  759. compile buffer_manager.cpp
  760. compile building.cpp
  761. compile castle.cpp
  762. compile MarkImage.cpp
  763. compile char_battle.cpp
  764. compile BattleArena.cpp
  765. compile char_affect.cpp
  766. compile char_change_empire.cpp
  767. g++: warning: '-mcpu=' is deprecated; use '-mtune=' or '-march=' instead
  768. g++: warning: '-mcpu=' is deprecated; use '-mtune=' or '-march=' instead
  769. g++: warning: '-mcpu=' is deprecated; use '-mtune=' or '-march=' instead
  770. g++: warning: '-mcpu=' is deprecated; use '-mtune=' or '-march=' instead
  771. g++: warning: '-mcpu=' is deprecated; use '-mtune=' or '-march=' instead
  772. g++: warning: '-mcpu=' is deprecated; use '-mtune=' or '-march=' instead
  773. g++: warning: '-mcpu=' is deprecated; use '-mtune=' or '-march=' instead
  774. g++: warning: '-mcpu=' is deprecated; use '-mtune=' or '-march=' instead
  775. g++: warning: '-mcpu=' is deprecated; use '-mtune=' or '-march=' instead
  776. g++: warning: '-mcpu=' is deprecated; use '-mtune=' or '-march=' instead
  777. g++: warning: '-mcpu=' is deprecated; use '-mtune=' or '-march=' instead
  778. g++: warning: '-mcpu=' is deprecated; use '-mtune=' or '-march=' instead
  779. g++: warning: '-mcpu=' is deprecated; use '-mtune=' or '-march=' instead
  780. compile char.cpp
  781. g++: warning: '-mcpu=' is deprecated; use '-mtune=' or '-march=' instead
  782. g++: warning: '-mcpu=' is deprecated; use '-mtune=' or '-march=' instead
  783. g++: warning: '-mcpu=' is deprecated; use '-mtune=' or '-march=' instead
  784. g++: warning: '-mcpu=' is deprecated; use '-mtune=' or '-march=' instead
  785. g++: warning: '-mcpu=' is deprecated; use '-mtune=' or '-march=' instead
  786. g++: warning: '-mcpu=' is deprecated; use '-mtune=' or '-march=' instead
  787. g++: warning: '-mcpu=' is deprecated; use '-mtune=' or '-march=' instead
  788. In file included from FSM.cpp:4:0:
  789. /usr/local/lib/gcc48/include/c++/cstdlib:178:10: error: expected unqualified-id before '__int128'
  790. inline __int128
  791. ^
  792. Makefile:119: recipe for target 'OBJDIR/FSM.o' failed
  793. gmake: *** [OBJDIR/FSM.o] Error 1
  794. gmake: *** Waiting for unfinished jobs....
  795. In file included from debug_allocator.h:4:0,
  796. from stdafx.h:7,
  797. from buffer_manager.cpp:1:
  798. /usr/local/lib/gcc48/include/c++/cstdlib:178:10: error: expected unqualified-id before '__int128'
  799. inline __int128
  800. ^
  801. In file included from debug_allocator.h:4:0,
  802. from stdafx.h:7,
  803. from blend_item.cpp:10:
  804. /usr/local/lib/gcc48/include/c++/cstdlib:178:10: error: expected unqualified-id before '__int128'
  805. inline __int128
  806. ^
  807. In file included from desc.h:7:0,
  808. from char_battle.cpp:4:
  809. cipher.h:6:31: fatal error: cryptopp/cryptlib.h: No such file or directory
  810. #include <cryptopp/cryptlib.h>
  811. ^
  812. compilation terminated.
  813. In file included from MarkManager.h:4:0,
  814. from MarkManager.cpp:2:
  815. MarkImage.h:4:19: fatal error: IL/il.h: No such file or directory
  816. #include <IL/il.h>
  817. ^
  818. In file included from MarkImage.cpp:2:0:
  819. MarkImage.h:4:19: fatal error: IL/il.h: No such file or directory
  820. #include <IL/il.h>
  821. ^
  822. compilation terminated.
  823. In file included from desc.h:7:0,
  824. from arena.cpp:5:
  825. cipher.h:6:31: fatal error: cryptopp/cryptlib.h: No such file or directory
  826. #include <cryptopp/cryptlib.h>
  827. ^
  828. compilation terminated.
  829. Makefile:119: recipe for target 'OBJDIR/char_battle.o' failed
  830. compilation terminated.
  831. gmake: *** [OBJDIR/char_battle.o] Error 1
  832. Makefile:119: recipe for target 'OBJDIR/MarkImage.o' failed
  833. In file included from MarkManager.h:4:0,
  834. from MarkConvert.cpp:2:
  835. MarkImage.h:4:19: fatal error: IL/il.h: No such file or directory
  836. #include <IL/il.h>
  837. ^
  838. gmake: *** [OBJDIR/MarkImage.o] Error 1
  839. compilation terminated.
  840. Makefile:119: recipe for target 'OBJDIR/arena.o' failed
  841. In file included from debug_allocator.h:4:0,
  842. from stdafx.h:7,
  843. from TrafficProfiler.cpp:10:
  844. /usr/local/lib/gcc48/include/c++/cstdlib:178:10: error: expected unqualified-id before '__int128'
  845. inline __int128
  846. ^
  847. gmake: *** [OBJDIR/arena.o] Error 1
  848. In file included from desc.h:7:0,
  849. from battle.cpp:4:
  850. cipher.h:6:31: fatal error: cryptopp/cryptlib.h: No such file or directory
  851. #include <cryptopp/cryptlib.h>
  852. ^
  853. Makefile:119: recipe for target 'OBJDIR/MarkManager.o' failed
  854. compilation terminated.
  855. In file included from debug_allocator.h:4:0,
  856. from stdafx.h:7,
  857. from block_country.cpp:10:
  858. /usr/local/lib/gcc48/include/c++/cstdlib:178:10: error: expected unqualified-id before '__int128'
  859. inline __int128
  860. ^
  861. gmake: *** [OBJDIR/MarkManager.o] Error 1
  862. Makefile:119: recipe for target 'OBJDIR/battle.o' failed
  863. gmake: *** [OBJDIR/battle.o] Error 1
  864. Makefile:119: recipe for target 'OBJDIR/MarkConvert.o' failed
  865. gmake: *** [OBJDIR/MarkConvert.o] Error 1
  866. Makefile:119: recipe for target 'OBJDIR/buffer_manager.o' failed
  867. gmake: *** [OBJDIR/buffer_manager.o] Error 1
  868. Makefile:119: recipe for target 'OBJDIR/blend_item.o' failed
  869. gmake: *** [OBJDIR/blend_item.o] Error 1
  870. Makefile:119: recipe for target 'OBJDIR/block_country.o' failed
  871. gmake: *** [OBJDIR/block_country.o] Error 1
  872. Makefile:119: recipe for target 'OBJDIR/TrafficProfiler.o' failed
  873. gmake: *** [OBJDIR/TrafficProfiler.o] Error 1
  874. In file included from debug_allocator.h:4:0,
  875. from stdafx.h:7,
  876. from BattleArena.cpp:1:
  877. /usr/local/lib/gcc48/include/c++/cstdlib:178:10: error: expected unqualified-id before '__int128'
  878. inline __int128
  879. ^
  880. In file included from desc.h:7:0,
  881. from desc_client.h:4,
  882. from char_affect.cpp:10:
  883. cipher.h:6:31: fatal error: cryptopp/cryptlib.h: No such file or directory
  884. #include <cryptopp/cryptlib.h>
  885. ^
  886. compilation terminated.
  887. Makefile:119: recipe for target 'OBJDIR/char_affect.o' failed
  888. gmake: *** [OBJDIR/char_affect.o] Error 1
  889. In file included from debug_allocator.h:4:0,
  890. from stdafx.h:7,
  891. from ani.cpp:10:
  892. /usr/local/lib/gcc48/include/c++/cstdlib:178:10: error: expected unqualified-id before '__int128'
  893. inline __int128
  894. ^
  895. In file included from desc.h:7:0,
  896. from building.cpp:12:
  897. cipher.h:6:31: fatal error: cryptopp/cryptlib.h: No such file or directory
  898. #include <cryptopp/cryptlib.h>
  899. ^
  900. compilation terminated.
  901. In file included from debug_allocator.h:4:0,
  902. from stdafx.h:7,
  903. from banword.cpp:1:
  904. /usr/local/lib/gcc48/include/c++/cstdlib:178:10: error: expected unqualified-id before '__int128'
  905. inline __int128
  906. ^
  907. In file included from debug_allocator.h:4:0,
  908. from stdafx.h:7,
  909. from castle.cpp:12:
  910. /usr/local/lib/gcc48/include/c++/cstdlib:178:10: error: expected unqualified-id before '__int128'
  911. inline __int128
  912. ^
  913. In file included from desc.h:7:0,
  914. from OXEvent.cpp:12:
  915. cipher.h:6:31: fatal error: cryptopp/cryptlib.h: No such file or directory
  916. #include <cryptopp/cryptlib.h>
  917. ^
  918. Makefile:119: recipe for target 'OBJDIR/building.o' failed
  919. In file included from debug_allocator.h:4:0,
  920. from stdafx.h:7,
  921. from char_change_empire.cpp:2:
  922. /usr/local/lib/gcc48/include/c++/cstdlib:178:10: error: expected unqualified-id before '__int128'
  923. inline __int128
  924. ^
  925. compilation terminated.
  926. gmake: *** [OBJDIR/building.o] Error 1
  927. In file included from desc.h:7:0,
  928. from desc_client.h:4,
  929. from char.cpp:12:
  930. cipher.h:6:31: fatal error: cryptopp/cryptlib.h: No such file or directory
  931. #include <cryptopp/cryptlib.h>
  932. ^
  933. Makefile:119: recipe for target 'OBJDIR/OXEvent.o' failed
  934. compilation terminated.
  935. gmake: *** [OBJDIR/OXEvent.o] Error 1
  936. Makefile:119: recipe for target 'OBJDIR/char.o' failed
  937. gmake: *** [OBJDIR/char.o] Error 1
  938. In file included from /usr/local/include/boost/limits.hpp:19:0,
  939. from /usr/local/include/boost/unordered/detail/allocate.hpp:340,
  940. from /usr/local/include/boost/unordered/detail/buckets.hpp:15,
  941. from /usr/local/include/boost/unordered/detail/table.hpp:10,
  942. from /usr/local/include/boost/unordered/detail/equivalent.hpp:14,
  943. from /usr/local/include/boost/unordered/unordered_map.hpp:17,
  944. from /usr/local/include/boost/unordered_map.hpp:16,
  945. from char.h:4,
  946. from BattleArena.cpp:6:
  947. /usr/local/lib/gcc48/include/c++/limits:1405:35: error: template argument 1 is invalid
  948. struct numeric_limits<__int128>
  949. ^
  950. /usr/local/lib/gcc48/include/c++/limits:1479:44: error: template argument 1 is invalid
  951. struct numeric_limits<unsigned __int128>
  952. ^
  953. In file included from /usr/local/include/boost/limits.hpp:19:0,
  954. from /usr/local/include/boost/unordered/detail/allocate.hpp:340,
  955. from /usr/local/include/boost/unordered/detail/buckets.hpp:15,
  956. from /usr/local/include/boost/unordered/detail/table.hpp:10,
  957. from /usr/local/include/boost/unordered/detail/equivalent.hpp:14,
  958. from /usr/local/include/boost/unordered/unordered_map.hpp:17,
  959. from /usr/local/include/boost/unordered_map.hpp:16,
  960. from char.h:4,
  961. from ani.cpp:11:
  962. /usr/local/lib/gcc48/include/c++/limits:1405:35: error: template argument 1 is invalid
  963. struct numeric_limits<__int128>
  964. ^
  965. /usr/local/lib/gcc48/include/c++/limits:1479:44: error: template argument 1 is invalid
  966. struct numeric_limits<unsigned __int128>
  967. ^
  968. In file included from /usr/local/include/boost/limits.hpp:19:0,
  969. from /usr/local/include/boost/unordered/detail/allocate.hpp:340,
  970. from /usr/local/include/boost/unordered/detail/buckets.hpp:15,
  971. from /usr/local/include/boost/unordered/detail/table.hpp:10,
  972. from /usr/local/include/boost/unordered/detail/equivalent.hpp:14,
  973. from /usr/local/include/boost/unordered/unordered_map.hpp:17,
  974. from /usr/local/include/boost/unordered_map.hpp:16,
  975. from banword.h:5,
  976. from banword.cpp:3:
  977. /usr/local/lib/gcc48/include/c++/limits:1405:35: error: template argument 1 is invalid
  978. struct numeric_limits<__int128>
  979. ^
  980. /usr/local/lib/gcc48/include/c++/limits:1479:44: error: template argument 1 is invalid
  981. struct numeric_limits<unsigned __int128>
  982. ^
  983. In file included from /usr/local/include/boost/limits.hpp:19:0,
  984. from /usr/local/include/boost/unordered/detail/allocate.hpp:340,
  985. from /usr/local/include/boost/unordered/detail/buckets.hpp:15,
  986. from /usr/local/include/boost/unordered/detail/table.hpp:10,
  987. from /usr/local/include/boost/unordered/detail/equivalent.hpp:14,
  988. from /usr/local/include/boost/unordered/unordered_map.hpp:17,
  989. from /usr/local/include/boost/unordered_map.hpp:16,
  990. from char.h:4,
  991. from castle.cpp:21:
  992. /usr/local/lib/gcc48/include/c++/limits:1405:35: error: template argument 1 is invalid
  993. struct numeric_limits<__int128>
  994. ^
  995. /usr/local/lib/gcc48/include/c++/limits:1479:44: error: template argument 1 is invalid
  996. struct numeric_limits<unsigned __int128>
  997. ^
  998. In file included from /usr/local/include/boost/limits.hpp:19:0,
  999. from /usr/local/include/boost/unordered/detail/allocate.hpp:340,
  1000. from /usr/local/include/boost/unordered/detail/buckets.hpp:15,
  1001. from /usr/local/include/boost/unordered/detail/table.hpp:10,
  1002. from /usr/local/include/boost/unordered/detail/equivalent.hpp:14,
  1003. from /usr/local/include/boost/unordered/unordered_map.hpp:17,
  1004. from /usr/local/include/boost/unordered_map.hpp:16,
  1005. from char.h:4,
  1006. from char_change_empire.cpp:4:
  1007. /usr/local/lib/gcc48/include/c++/limits:1405:35: error: template argument 1 is invalid
  1008. struct numeric_limits<__int128>
  1009. ^
  1010. /usr/local/lib/gcc48/include/c++/limits:1479:44: error: template argument 1 is invalid
  1011. struct numeric_limits<unsigned __int128>
  1012. ^
  1013. Makefile:119: recipe for target 'OBJDIR/banword.o' failed
  1014. gmake: *** [OBJDIR/banword.o] Error 1
  1015. Makefile:119: recipe for target 'OBJDIR/ani.o' failed
  1016. gmake: *** [OBJDIR/ani.o] Error 1
  1017. Makefile:119: recipe for target 'OBJDIR/castle.o' failed
  1018. gmake: *** [OBJDIR/castle.o] Error 1
  1019. Makefile:119: recipe for target 'OBJDIR/BattleArena.o' failed
  1020. gmake: *** [OBJDIR/BattleArena.o] Error 1
  1021. Makefile:119: recipe for target 'OBJDIR/char_change_empire.o' failed
  1022. gmake: *** [OBJDIR/char_change_empire.o] Error 1
  1023. root@HOSTNAME:/usr/src/novaline/Server/game/src # gmake -j20
  1024. compile FSM.cpp
  1025. compile MarkConvert.cpp
  1026. compile MarkImage.cpp
  1027. compile MarkManager.cpp
  1028. compile OXEvent.cpp
  1029. compile TrafficProfiler.cpp
  1030. compile ani.cpp
  1031. compile arena.cpp
  1032. compile banword.cpp
  1033. compile battle.cpp
  1034. compile block_country.cpp
  1035. compile buffer_manager.cpp
  1036. compile BattleArena.cpp
  1037. compile castle.cpp
  1038. compile char.cpp
  1039. compile char_affect.cpp
  1040. compile blend_item.cpp
  1041. g++: warning: '-mcpu=' is deprecated; use '-mtune=' or '-march=' instead
  1042. g++: warning: '-mcpu=' is deprecated; use '-mtune=' or '-march=' instead
  1043. g++: warning: '-mcpu=' is deprecated; use '-mtune=' or '-march=' instead
  1044. g++: warning: '-mcpu=' is deprecated; use '-mtune=' or '-march=' instead
  1045. g++: warning: '-mcpu=' is deprecated; use '-mtune=' or '-march=' instead
  1046. g++: warning: '-mcpu=' is deprecated; use '-mtune=' or '-march=' instead
  1047. g++: warning: '-mcpu=' is deprecated; use '-mtune=' or '-march=' instead
  1048. g++: warning: '-mcpu=' is deprecated; use '-mtune=' or '-march=' instead
  1049. compile building.cpp
  1050. g++: warning: '-mcpu=' is deprecated; use '-mtune=' or '-march=' instead
  1051. g++: warning: '-mcpu=' is deprecated; use '-mtune=' or '-march=' instead
  1052. compile char_battle.cpp
  1053. compile char_change_empire.cpp
  1054. g++: warning: '-mcpu=' is deprecated; use '-mtune=' or '-march=' instead
  1055. g++: warning: '-mcpu=' is deprecated; use '-mtune=' or '-march=' instead
  1056. g++: warning: '-mcpu=' is deprecated; use '-mtune=' or '-march=' instead
  1057. g++: warning: '-mcpu=' is deprecated; use '-mtune=' or '-march=' instead
  1058. g++: warning: '-mcpu=' is deprecated; use '-mtune=' or '-march=' instead
  1059. g++: warning: '-mcpu=' is deprecated; use '-mtune=' or '-march=' instead
  1060. g++: warning: '-mcpu=' is deprecated; use '-mtune=' or '-march=' instead
  1061. g++: warning: '-mcpu=' is deprecated; use '-mtune=' or '-march=' instead
  1062. g++: warning: '-mcpu=' is deprecated; use '-mtune=' or '-march=' instead
  1063. g++: warning: '-mcpu=' is deprecated; use '-mtune=' or '-march=' instead
  1064. In file included from FSM.cpp:4:0:
  1065. /usr/local/lib/gcc48/include/c++/cstdlib:178:10: error: expected unqualified-id before '__int128'
  1066. inline __int128
  1067. ^
  1068. Makefile:119: recipe for target 'OBJDIR/FSM.o' failed
  1069. In file included from MarkImage.cpp:2:0:
  1070. MarkImage.h:4:19: fatal error: IL/il.h: No such file or directory
  1071. #include <IL/il.h>
  1072. ^
  1073. In file included from debug_allocator.h:4:0,
  1074. from stdafx.h:7,
  1075. from TrafficProfiler.cpp:10:
  1076. /usr/local/lib/gcc48/include/c++/cstdlib:178:10: error: expected unqualified-id before '__int128'
  1077. inline __int128
  1078. ^
  1079. gmake: *** [OBJDIR/FSM.o] Error 1
  1080. compilation terminated.
  1081. gmake: *** Waiting for unfinished jobs....
  1082. In file included from MarkManager.h:4:0,
  1083. from MarkManager.cpp:2:
  1084. MarkImage.h:4:19: fatal error: IL/il.h: No such file or directory
  1085. #include <IL/il.h>
  1086. ^
  1087. Makefile:119: recipe for target 'OBJDIR/MarkImage.o' failed
  1088. compilation terminated.
  1089. gmake: *** [OBJDIR/MarkImage.o] Error 1
  1090. In file included from desc.h:7:0,
  1091. from battle.cpp:4:
  1092. cipher.h:6:31: fatal error: cryptopp/cryptlib.h: No such file or directory
  1093. #include <cryptopp/cryptlib.h>
  1094. ^
  1095. Makefile:119: recipe for target 'OBJDIR/MarkManager.o' failed
  1096. In file included from debug_allocator.h:4:0,
  1097. from stdafx.h:7,
  1098. from blend_item.cpp:10:
  1099. /usr/local/lib/gcc48/include/c++/cstdlib:178:10: error: expected unqualified-id before '__int128'
  1100. inline __int128
  1101. ^
  1102. compilation terminated.
  1103. gmake: *** [OBJDIR/MarkManager.o] Error 1
  1104. Makefile:119: recipe for target 'OBJDIR/battle.o' failed
  1105. In file included from desc.h:7:0,
  1106. from char_battle.cpp:4:
  1107. cipher.h:6:31: fatal error: cryptopp/cryptlib.h: No such file or directory
  1108. #include <cryptopp/cryptlib.h>
  1109. ^
  1110. In file included from debug_allocator.h:4:0,
  1111. from stdafx.h:7,
  1112. from block_country.cpp:10:
  1113. /usr/local/lib/gcc48/include/c++/cstdlib:178:10: error: expected unqualified-id before '__int128'
  1114. inline __int128
  1115. ^
  1116. In file included from desc.h:7:0,
  1117. from arena.cpp:5:
  1118. cipher.h:6:31: fatal error: cryptopp/cryptlib.h: No such file or directory
  1119. #include <cryptopp/cryptlib.h>
  1120. ^
  1121. gmake: *** [OBJDIR/battle.o] Error 1
  1122. In file included from debug_allocator.h:4:0,
  1123. from stdafx.h:7,
  1124. from buffer_manager.cpp:1:
  1125. /usr/local/lib/gcc48/include/c++/cstdlib:178:10: error: expected unqualified-id before '__int128'
  1126. inline __int128
  1127. ^
  1128. compilation terminated.
  1129. compilation terminated.
  1130. Makefile:119: recipe for target 'OBJDIR/arena.o' failed
  1131. In file included from MarkManager.h:4:0,
  1132. from MarkConvert.cpp:2:
  1133. MarkImage.h:4:19: fatal error: IL/il.h: No such file or directory
  1134. #include <IL/il.h>
  1135. ^
  1136. gmake: *** [OBJDIR/arena.o] Error 1
  1137. compilation terminated.
  1138. Makefile:119: recipe for target 'OBJDIR/TrafficProfiler.o' failed
  1139. gmake: *** [OBJDIR/TrafficProfiler.o] Error 1
  1140. Makefile:119: recipe for target 'OBJDIR/char_battle.o' failed
  1141. gmake: *** [OBJDIR/char_battle.o] Error 1
  1142. Makefile:119: recipe for target 'OBJDIR/MarkConvert.o' failed
  1143. gmake: *** [OBJDIR/MarkConvert.o] Error 1
  1144. Makefile:119: recipe for target 'OBJDIR/buffer_manager.o' failed
  1145. gmake: *** [OBJDIR/buffer_manager.o] Error 1
  1146. Makefile:119: recipe for target 'OBJDIR/blend_item.o' failed
  1147. gmake: *** [OBJDIR/blend_item.o] Error 1
  1148. Makefile:119: recipe for target 'OBJDIR/block_country.o' failed
  1149. gmake: *** [OBJDIR/block_country.o] Error 1
  1150. In file included from debug_allocator.h:4:0,
  1151. from stdafx.h:7,
  1152. from ani.cpp:10:
  1153. /usr/local/lib/gcc48/include/c++/cstdlib:178:10: error: expected unqualified-id before '__int128'
  1154. inline __int128
  1155. ^
  1156. In file included from desc.h:7:0,
  1157. from OXEvent.cpp:12:
  1158. cipher.h:6:31: fatal error: cryptopp/cryptlib.h: No such file or directory
  1159. #include <cryptopp/cryptlib.h>
  1160. ^
  1161. compilation terminated.
  1162. In file included from debug_allocator.h:4:0,
  1163. from stdafx.h:7,
  1164. from banword.cpp:1:
  1165. /usr/local/lib/gcc48/include/c++/cstdlib:178:10: error: expected unqualified-id before '__int128'
  1166. inline __int128
  1167. ^
  1168. Makefile:119: recipe for target 'OBJDIR/OXEvent.o' failed
  1169. In file included from debug_allocator.h:4:0,
  1170. from stdafx.h:7,
  1171. from char_change_empire.cpp:2:
  1172. /usr/local/lib/gcc48/include/c++/cstdlib:178:10: error: expected unqualified-id before '__int128'
  1173. inline __int128
  1174. ^
  1175. In file included from desc.h:7:0,
  1176. from desc_client.h:4,
  1177. from char.cpp:12:
  1178. cipher.h:6:31: fatal error: cryptopp/cryptlib.h: No such file or directory
  1179. #include <cryptopp/cryptlib.h>
  1180. ^
  1181. gmake: *** [OBJDIR/OXEvent.o] Error 1
  1182. compilation terminated.
  1183. In file included from debug_allocator.h:4:0,
  1184. from stdafx.h:7,
  1185. from castle.cpp:12:
  1186. /usr/local/lib/gcc48/include/c++/cstdlib:178:10: error: expected unqualified-id before '__int128'
  1187. inline __int128
  1188. ^
  1189. In file included from debug_allocator.h:4:0,
  1190. from stdafx.h:7,
  1191. from BattleArena.cpp:1:
  1192. /usr/local/lib/gcc48/include/c++/cstdlib:178:10: error: expected unqualified-id before '__int128'
  1193. inline __int128
  1194. ^
  1195. In file included from desc.h:7:0,
  1196. from desc_client.h:4,
  1197. from char_affect.cpp:10:
  1198. cipher.h:6:31: fatal error: cryptopp/cryptlib.h: No such file or directory
  1199. #include <cryptopp/cryptlib.h>
  1200. ^
  1201. In file included from desc.h:7:0,
  1202. from building.cpp:12:
  1203. cipher.h:6:31: fatal error: cryptopp/cryptlib.h: No such file or directory
  1204. #include <cryptopp/cryptlib.h>
  1205. ^
  1206. Makefile:119: recipe for target 'OBJDIR/char.o' failed
  1207. compilation terminated.
  1208. compilation terminated.
  1209. gmake: *** [OBJDIR/char.o] Error 1
  1210. Makefile:119: recipe for target 'OBJDIR/char_affect.o' failed
  1211. gmake: *** [OBJDIR/char_affect.o] Error 1
  1212. Makefile:119: recipe for target 'OBJDIR/building.o' failed
  1213. gmake: *** [OBJDIR/building.o] Error 1
  1214. In file included from /usr/local/include/boost/limits.hpp:19:0,
  1215. from /usr/local/include/boost/unordered/detail/allocate.hpp:340 ,
  1216. from /usr/local/include/boost/unordered/detail/buckets.hpp:15,
  1217. from /usr/local/include/boost/unordered/detail/table.hpp:10,
  1218. from /usr/local/include/boost/unordered/detail/equivalent.hpp:1 4,
  1219. from /usr/local/include/boost/unordered/unordered_map.hpp:17,
  1220. from /usr/local/include/boost/unordered_map.hpp:16,
  1221. from banword.h:5,
  1222. from banword.cpp:3:
  1223. /usr/local/lib/gcc48/include/c++/limits:1405:35: error: template argument 1 is i nvalid
  1224. struct numeric_limits<__int128>
  1225. ^
  1226. /usr/local/lib/gcc48/include/c++/limits:1479:44: error: template argument 1 is i nvalid
  1227. struct numeric_limits<unsigned __int128>
  1228. ^
  1229. In file included from /usr/local/include/boost/limits.hpp:19:0,
  1230. from /usr/local/include/boost/unordered/detail/allocate.hpp:340 ,
  1231. from /usr/local/include/boost/unordered/detail/buckets.hpp:15,
  1232. from /usr/local/include/boost/unordered/detail/table.hpp:10,
  1233. from /usr/local/include/boost/unordered/detail/equivalent.hpp:1 4,
  1234. from /usr/local/include/boost/unordered/unordered_map.hpp:17,
  1235. from /usr/local/include/boost/unordered_map.hpp:16,
  1236. from char.h:4,
  1237. from ani.cpp:11:
  1238. /usr/local/lib/gcc48/include/c++/limits:1405:35: error: template argument 1 is i nvalid
  1239. struct numeric_limits<__int128>
  1240. ^
  1241. /usr/local/lib/gcc48/include/c++/limits:1479:44: error: template argument 1 is i nvalid
  1242. struct numeric_limits<unsigned __int128>
  1243. ^
  1244. In file included from /usr/local/include/boost/limits.hpp:19:0,
  1245. from /usr/local/include/boost/unordered/detail/allocate.hpp:340 ,
  1246. from /usr/local/include/boost/unordered/detail/buckets.hpp:15,
  1247. from /usr/local/include/boost/unordered/detail/table.hpp:10,
  1248. from /usr/local/include/boost/unordered/detail/equivalent.hpp:1 4,
  1249. from /usr/local/include/boost/unordered/unordered_map.hpp:17,
  1250. from /usr/local/include/boost/unordered_map.hpp:16,
  1251. from char.h:4,
  1252. from char_change_empire.cpp:4:
  1253. /usr/local/lib/gcc48/include/c++/limits:1405:35: error: template argument 1 is i nvalid
  1254. struct numeric_limits<__int128>
  1255. ^
  1256. /usr/local/lib/gcc48/include/c++/limits:1479:44: error: template argument 1 is i nvalid
  1257. struct numeric_limits<unsigned __int128>
  1258. ^
  1259. In file included from /usr/local/include/boost/limits.hpp:19:0,
  1260. from /usr/local/include/boost/unordered/detail/allocate.hpp:340 ,
  1261. from /usr/local/include/boost/unordered/detail/buckets.hpp:15,
  1262. from /usr/local/include/boost/unordered/detail/table.hpp:10,
  1263. from /usr/local/include/boost/unordered/detail/equivalent.hpp:1 4,
  1264. from /usr/local/include/boost/unordered/unordered_map.hpp:17,
  1265. from /usr/local/include/boost/unordered_map.hpp:16,
  1266. from char.h:4,
  1267. from BattleArena.cpp:6:
  1268. /usr/local/lib/gcc48/include/c++/limits:1405:35: error: template argument 1 is i nvalid
  1269. struct numeric_limits<__int128>
  1270. ^
  1271. /usr/local/lib/gcc48/include/c++/limits:1479:44: error: template argument 1 is i nvalid
  1272. struct numeric_limits<unsigned __int128>
  1273. ^
  1274. Makefile:119: recipe for target 'OBJDIR/banword.o' failed
  1275. gmake: *** [OBJDIR/banword.o] Error 1
  1276. In file included from /usr/local/include/boost/limits.hpp:19:0,
  1277. from /usr/local/include/boost/unordered/detail/allocate.hpp:340 ,
  1278. from /usr/local/include/boost/unordered/detail/buckets.hpp:15,
  1279. from /usr/local/include/boost/unordered/detail/table.hpp:10,
  1280. from /usr/local/include/boost/unordered/detail/equivalent.hpp:1 4,
  1281. from /usr/local/include/boost/unordered/unordered_map.hpp:17,
  1282. from /usr/local/include/boost/unordered_map.hpp:16,
  1283. from char.h:4,
  1284. from castle.cpp:21:
  1285. /usr/local/lib/gcc48/include/c++/limits:1405:35: error: template argument 1 is i nvalid
  1286. struct numeric_limits<__int128>
  1287. ^
  1288. /usr/local/lib/gcc48/include/c++/limits:1479:44: error: template argument 1 is i nvalid
  1289. struct numeric_limits<unsigned __int128>
  1290. ^
  1291. Makefile:119: recipe for target 'OBJDIR/ani.o' failed
  1292. gmake: *** [OBJDIR/ani.o] Error 1
  1293. Makefile:119: recipe for target 'OBJDIR/char_change_empire.o' failed
  1294. gmake: *** [OBJDIR/char_change_empire.o] Error 1
  1295. Makefile:119: recipe for target 'OBJDIR/BattleArena.o' failed
  1296. gmake: *** [OBJDIR/BattleArena.o] Error 1
  1297. Makefile:119: recipe for target 'OBJDIR/castle.o' failed
  1298. gmake: *** [OBJDIR/castle.o] Error 1
  1299. root@HOSTNAME:/usr/src/novaline/Server/game/src # prob me ta .o arxeia tha xei
  1300. prob: Command not found.
  1301. root@HOSTNAME:/usr/src/novaline/Server/game/src # gmake -j20
  1302. compile FSM.cpp
  1303. compile MarkImage.cpp
  1304. compile MarkManager.cpp
  1305. compile MarkConvert.cpp
  1306. compile BattleArena.cpp
  1307. compile OXEvent.cpp
  1308. compile TrafficProfiler.cpp
  1309. compile ani.cpp
  1310. compile arena.cpp
  1311. compile banword.cpp
  1312. g++: warning: '-mcpu=' is deprecated; use '-mtune=' or '-march=' instead
  1313. g++: warning: '-mcpu=' is deprecated; use '-mtune=' or '-march=' instead
  1314. g++: warning: '-mcpu=' is deprecated; use '-mtune=' or '-march=' instead
  1315. compile battle.cpp
  1316. compile blend_item.cpp
  1317. compile block_country.cpp
  1318. compile buffer_manager.cpp
  1319. compile building.cpp
  1320. compile castle.cpp
  1321. compile char.cpp
  1322. compile char_affect.cpp
  1323. compile char_battle.cpp
  1324. compile char_change_empire.cpp
  1325. g++: warning: '-mcpu=' is deprecated; use '-mtune=' or '-march=' instead
  1326. g++: warning: '-mcpu=' is deprecated; use '-mtune=' or '-march=' instead
  1327. g++: warning: '-mcpu=' is deprecated; use '-mtune=' or '-march=' instead
  1328. g++: warning: '-mcpu=' is deprecated; use '-mtune=' or '-march=' instead
  1329. g++: warning: '-mcpu=' is deprecated; use '-mtune=' or '-march=' instead
  1330. g++: warning: '-mcpu=' is deprecated; use '-mtune=' or '-march=' instead
  1331. g++: warning: '-mcpu=' is deprecated; use '-mtune=' or '-march=' instead
  1332. g++: warning: '-mcpu=' is deprecated; use '-mtune=' or '-march=' instead
  1333. g++: warning: '-mcpu=' is deprecated; use '-mtune=' or '-march=' instead
  1334. g++: warning: '-mcpu=' is deprecated; use '-mtune=' or '-march=' instead
  1335. g++: warning: '-mcpu=' is deprecated; use '-mtune=' or '-march=' instead
  1336. g++: warning: '-mcpu=' is deprecated; use '-mtune=' or '-march=' instead
  1337. g++: warning: '-mcpu=' is deprecated; use '-mtune=' or '-march=' instead
  1338. g++: warning: '-mcpu=' is deprecated; use '-mtune=' or '-march=' instead
  1339. g++: warning: '-mcpu=' is deprecated; use '-mtune=' or '-march=' instead
  1340. g++: warning: '-mcpu=' is deprecated; use '-mtune=' or '-march=' instead
  1341. g++: warning: '-mcpu=' is deprecated; use '-mtune=' or '-march=' instead
  1342. In file included from FSM.cpp:4:0:
  1343. /usr/local/lib/gcc48/include/c++/cstdlib:178:10: error: expected unqualified-id before '__int128'
  1344. inline __int128
  1345. ^
  1346. Makefile:119: recipe for target 'OBJDIR/FSM.o' failed
  1347. gmake: *** [OBJDIR/FSM.o] Error 1
  1348. gmake: *** Waiting for unfinished jobs....
  1349. In file included from debug_allocator.h:4:0,
  1350. from stdafx.h:7,
  1351. from block_country.cpp:10:
  1352. /usr/local/lib/gcc48/include/c++/cstdlib:178:10: error: expected unqualified-id before '__int128'
  1353. inline __int128
  1354. ^
  1355. In file included from debug_allocator.h:4:0,
  1356. from stdafx.h:7,
  1357. from buffer_manager.cpp:1:
  1358. /usr/local/lib/gcc48/include/c++/cstdlib:178:10: error: expected unqualified-id before '__int128'
  1359. inline __int128
  1360. ^
  1361. In file included from MarkImage.cpp:2:0:
  1362. MarkImage.h:4:19: fatal error: IL/il.h: No such file or directory
  1363. #include <IL/il.h>
  1364. ^
  1365. compilation terminated.
  1366. In file included from desc.h:7:0,
  1367. from arena.cpp:5:
  1368. cipher.h:6:31: fatal error: cryptopp/cryptlib.h: No such file or directory
  1369. #include <cryptopp/cryptlib.h>
  1370. ^
  1371. In file included from desc.h:7:0,
  1372. from char_battle.cpp:4:
  1373. cipher.h:6:31: fatal error: cryptopp/cryptlib.h: No such file or directory
  1374. #include <cryptopp/cryptlib.h>
  1375. ^
  1376. In file included from desc.h:7:0,
  1377. from battle.cpp:4:
  1378. cipher.h:6:31: fatal error: cryptopp/cryptlib.h: No such file or directory
  1379. #include <cryptopp/cryptlib.h>
  1380. ^
  1381. In file included from MarkManager.h:4:0,
  1382. from MarkManager.cpp:2:
  1383. MarkImage.h:4:19: fatal error: IL/il.h: No such file or directory
  1384. #include <IL/il.h>
  1385. ^
  1386. compilation terminated.
  1387. compilation terminated.
  1388. compilation terminated.
  1389. compilation terminated.
  1390. Makefile:119: recipe for target 'OBJDIR/MarkImage.o' failed
  1391. gmake: *** [OBJDIR/MarkImage.o] Error 1
  1392. Makefile:119: recipe for target 'OBJDIR/arena.o' failed
  1393. gmake: *** [OBJDIR/arena.o] Error 1
  1394. Makefile:119: recipe for target 'OBJDIR/char_battle.o' failed
  1395. gmake: *** [OBJDIR/char_battle.o] Error 1
  1396. Makefile:119: recipe for target 'OBJDIR/battle.o' failed
  1397. gmake: *** [OBJDIR/battle.o] Error 1
  1398. In file included from MarkManager.h:4:0,
  1399. from MarkConvert.cpp:2:
  1400. MarkImage.h:4:19: fatal error: IL/il.h: No such file or directory
  1401. #include <IL/il.h>
  1402. ^
  1403. In file included from debug_allocator.h:4:0,
  1404. from stdafx.h:7,
  1405. from blend_item.cpp:10:
  1406. /usr/local/lib/gcc48/include/c++/cstdlib:178:10: error: expected unqualified-id before '__int128'
  1407. inline __int128
  1408. ^
  1409. compilation terminated.
  1410. Makefile:119: recipe for target 'OBJDIR/MarkManager.o' failed
  1411. gmake: *** [OBJDIR/MarkManager.o] Error 1
  1412. In file included from debug_allocator.h:4:0,
  1413. from stdafx.h:7,
  1414. from TrafficProfiler.cpp:10:
  1415. /usr/local/lib/gcc48/include/c++/cstdlib:178:10: error: expected unqualified-id before '__int128'
  1416. inline __int128
  1417. ^
  1418. Makefile:119: recipe for target 'OBJDIR/MarkConvert.o' failed
  1419. gmake: *** [OBJDIR/MarkConvert.o] Error 1
  1420. Makefile:119: recipe for target 'OBJDIR/block_country.o' failed
  1421. gmake: *** [OBJDIR/block_country.o] Error 1
  1422. Makefile:119: recipe for target 'OBJDIR/buffer_manager.o' failed
  1423. gmake: *** [OBJDIR/buffer_manager.o] Error 1
  1424. Makefile:119: recipe for target 'OBJDIR/TrafficProfiler.o' failed
  1425. gmake: *** [OBJDIR/TrafficProfiler.o] Error 1
  1426. Makefile:119: recipe for target 'OBJDIR/blend_item.o' failed
  1427. gmake: *** [OBJDIR/blend_item.o] Error 1
  1428. In file included from debug_allocator.h:4:0,
  1429. from stdafx.h:7,
  1430. from banword.cpp:1:
  1431. /usr/local/lib/gcc48/include/c++/cstdlib:178:10: error: expected unqualified-id before '__int128'
  1432. inline __int128
  1433. ^
  1434. In file included from debug_allocator.h:4:0,
  1435. from stdafx.h:7,
  1436. from char_change_empire.cpp:2:
  1437. /usr/local/lib/gcc48/include/c++/cstdlib:178:10: error: expected unqualified-id before '__int128'
  1438. inline __int128
  1439. ^
  1440. In file included from desc.h:7:0,
  1441. from building.cpp:12:
  1442. cipher.h:6:31: fatal error: cryptopp/cryptlib.h: No such file or directory
  1443. #include <cryptopp/cryptlib.h>
  1444. ^
  1445. compilation terminated.
  1446. In file included from debug_allocator.h:4:0,
  1447. from stdafx.h:7,
  1448. from BattleArena.cpp:1:
  1449. /usr/local/lib/gcc48/include/c++/cstdlib:178:10: error: expected unqualified-id before '__int128'
  1450. inline __int128
  1451. ^
  1452. In file included from debug_allocator.h:4:0,
  1453. from stdafx.h:7,
  1454. from castle.cpp:12:
  1455. /usr/local/lib/gcc48/include/c++/cstdlib:178:10: error: expected unqualified-id before '__int128'
  1456. inline __int128
  1457. ^
  1458. Makefile:119: recipe for target 'OBJDIR/building.o' failed
  1459. gmake: *** [OBJDIR/building.o] Error 1
  1460. In file included from desc.h:7:0,
  1461. from desc_client.h:4,
  1462. from char_affect.cpp:10:
  1463. cipher.h:6:31: fatal error: cryptopp/cryptlib.h: No such file or directory
  1464. #include <cryptopp/cryptlib.h>
  1465. ^
  1466. In file included from desc.h:7:0,
  1467. from desc_client.h:4,
  1468. from char.cpp:12:
  1469. cipher.h:6:31: fatal error: cryptopp/cryptlib.h: No such file or directory
  1470. #include <cryptopp/cryptlib.h>
  1471. ^
  1472. compilation terminated.
  1473. compilation terminated.
  1474. In file included from desc.h:7:0,
  1475. from OXEvent.cpp:12:
  1476. cipher.h:6:31: fatal error: cryptopp/cryptlib.h: No such file or directory
  1477. #include <cryptopp/cryptlib.h>
  1478. ^
  1479. In file included from debug_allocator.h:4:0,
  1480. from stdafx.h:7,
  1481. from ani.cpp:10:
  1482. /usr/local/lib/gcc48/include/c++/cstdlib:178:10: error: expected unqualified-id before '__int128'
  1483. inline __int128
  1484. ^
  1485. compilation terminated.
  1486. Makefile:119: recipe for target 'OBJDIR/char.o' failed
  1487. gmake: *** [OBJDIR/char.o] Error 1
  1488. Makefile:119: recipe for target 'OBJDIR/char_affect.o' failed
  1489. gmake: *** [OBJDIR/char_affect.o] Error 1
  1490. Makefile:119: recipe for target 'OBJDIR/OXEvent.o' failed
  1491. gmake: *** [OBJDIR/OXEvent.o] Error 1
  1492. In file included from /usr/local/include/boost/limits.hpp:19:0,
  1493. from /usr/local/include/boost/unordered/detail/allocate.hpp:340 ,
  1494. from /usr/local/include/boost/unordered/detail/buckets.hpp:15,
  1495. from /usr/local/include/boost/unordered/detail/table.hpp:10,
  1496. from /usr/local/include/boost/unordered/detail/equivalent.hpp:1 4,
  1497. from /usr/local/include/boost/unordered/unordered_map.hpp:17,
  1498. from /usr/local/include/boost/unordered_map.hpp:16,
  1499. from banword.h:5,
  1500. from banword.cpp:3:
  1501. /usr/local/lib/gcc48/include/c++/limits:1405:35: error: template argument 1 is i nvalid
  1502. struct numeric_limits<__int128>
  1503. ^
  1504. In file included from /usr/local/include/boost/limits.hpp:19:0,
  1505. from /usr/local/include/boost/unordered/detail/allocate.hpp:340 ,
  1506. from /usr/local/include/boost/unordered/detail/buckets.hpp:15,
  1507. from /usr/local/include/boost/unordered/detail/table.hpp:10,
  1508. from /usr/local/include/boost/unordered/detail/equivalent.hpp:1 4,
  1509. from /usr/local/include/boost/unordered/unordered_map.hpp:17,
  1510. from /usr/local/include/boost/unordered_map.hpp:16,
  1511. from char.h:4,
  1512. from char_change_empire.cpp:4:
  1513. /usr/local/lib/gcc48/include/c++/limits:1405:35: error: template argument 1 is i nvalid
  1514. struct numeric_limits<__int128>
  1515. ^
  1516. /usr/local/lib/gcc48/include/c++/limits:1479:44: error: template argument 1 is i nvalid
  1517. struct numeric_limits<unsigned __int128>
  1518. ^
  1519. /usr/local/lib/gcc48/include/c++/limits:1479:44: error: template argument 1 is i nvalid
  1520. struct numeric_limits<unsigned __int128>
  1521. ^
  1522. In file included from /usr/local/include/boost/limits.hpp:19:0,
  1523. from /usr/local/include/boost/unordered/detail/allocate.hpp:340 ,
  1524. from /usr/local/include/boost/unordered/detail/buckets.hpp:15,
  1525. from /usr/local/include/boost/unordered/detail/table.hpp:10,
  1526. from /usr/local/include/boost/unordered/detail/equivalent.hpp:1 4,
  1527. from /usr/local/include/boost/unordered/unordered_map.hpp:17,
  1528. from /usr/local/include/boost/unordered_map.hpp:16,
  1529. from char.h:4,
  1530. from BattleArena.cpp:6:
  1531. /usr/local/lib/gcc48/include/c++/limits:1405:35: error: template argument 1 is i nvalid
  1532. struct numeric_limits<__int128>
  1533. ^
  1534. /usr/local/lib/gcc48/include/c++/limits:1479:44: error: template argument 1 is i nvalid
  1535. struct numeric_limits<unsigned __int128>
  1536. ^
  1537. In file included from /usr/local/include/boost/limits.hpp:19:0,
  1538. from /usr/local/include/boost/unordered/detail/allocate.hpp:340 ,
  1539. from /usr/local/include/boost/unordered/detail/buckets.hpp:15,
  1540. from /usr/local/include/boost/unordered/detail/table.hpp:10,
  1541. from /usr/local/include/boost/unordered/detail/equivalent.hpp:1 4,
  1542. from /usr/local/include/boost/unordered/unordered_map.hpp:17,
  1543. from /usr/local/include/boost/unordered_map.hpp:16,
  1544. from char.h:4,
  1545. from castle.cpp:21:
  1546. /usr/local/lib/gcc48/include/c++/limits:1405:35: error: template argument 1 is i nvalid
  1547. struct numeric_limits<__int128>
  1548. ^
  1549. /usr/local/lib/gcc48/include/c++/limits:1479:44: error: template argument 1 is i nvalid
  1550. struct numeric_limits<unsigned __int128>
  1551. ^
  1552. In file included from /usr/local/include/boost/limits.hpp:19:0,
  1553. from /usr/local/include/boost/unordered/detail/allocate.hpp:340 ,
  1554. from /usr/local/include/boost/unordered/detail/buckets.hpp:15,
  1555. from /usr/local/include/boost/unordered/detail/table.hpp:10,
  1556. from /usr/local/include/boost/unordered/detail/equivalent.hpp:1 4,
  1557. from /usr/local/include/boost/unordered/unordered_map.hpp:17,
  1558. from /usr/local/include/boost/unordered_map.hpp:16,
  1559. from char.h:4,
  1560. from ani.cpp:11:
  1561. /usr/local/lib/gcc48/include/c++/limits:1405:35: error: template argument 1 is i nvalid
  1562. struct numeric_limits<__int128>
  1563. ^
  1564. /usr/local/lib/gcc48/include/c++/limits:1479:44: error: template argument 1 is i nvalid
  1565. struct numeric_limits<unsigned __int128>
  1566. ^
  1567. Makefile:119: recipe for target 'OBJDIR/banword.o' failed
  1568. gmake: *** [OBJDIR/banword.o] Error 1
  1569. Makefile:119: recipe for target 'OBJDIR/char_change_empire.o' failed
  1570. gmake: *** [OBJDIR/char_change_empire.o] Error 1
  1571. Makefile:119: recipe for target 'OBJDIR/ani.o' failed
  1572. gmake: *** [OBJDIR/ani.o] Error 1
  1573. Makefile:119: recipe for target 'OBJDIR/BattleArena.o' failed
  1574. gmake: *** [OBJDIR/BattleArena.o] Error 1
  1575. Makefile:119: recipe for target 'OBJDIR/castle.o' failed
  1576. gmake: *** [OBJDIR/castle.o] Error 1
  1577. root@HOSTNAME:/usr/src/novaline/Server/game/src # cd /usr/home/compile/Server/gam e
  1578. root@HOSTNAME:/usr/home/compile/Server/game # gmake all
  1579. gmake: *** No rule to make target 'all'. Stop.
  1580. root@HOSTNAME:/usr/home/compile/Server/game # gmake -j20
  1581. gmake: *** No targets specified and no makefile found. Stop.
  1582. root@HOSTNAME:/usr/home/compile/Server/game # grep -r "70048" /usr/home/compile/S erver/game
  1583. /usr/home/compile/Server/game/src/fishing.cpp: { "▒▒▒▒▒▒▒ ▒▒▒▒", 70048, 0000 0, 00000, { 8, 8, 0 }, 60, FISHING_LIMIT_NONE, { 0, 0, 0}, FISHING _TIME_NORMAL, {0, },
  1584. /usr/home/compile/Server/game/src/unique_item.h: UNIQUE_ITEM_HIDE_ALIGNME NT_TITLE = 70048,
  1585. root@HOSTNAME:/usr/home/compile/Server/game # grep -r "70048" /usr/src/novaline/S erver/game/src
  1586. /usr/src/novaline/Server/game/src/fishing.cpp: { "▒▒▒▒▒▒▒ ▒▒▒▒", 70048, 0000 0, 00000, { 8, 8, 0 }, 60, FISHING_LIMIT_NONE, { 0, 0, 0}, FISHING _TIME_NORMAL, {0, },
  1587. /usr/src/novaline/Server/game/src/unique_item.h: UNIQUE_ITEM_HIDE_ALIGNME NT_TITLE = 70048,
  1588. root@HOSTNAME:/usr/home/compile/Server/game # grep -r "UNIQUE_ITEM_HIDE_ALIGNMENT _TITLE" /usr/src/novaline/Server/game/src
  1589. /usr/src/novaline/Server/game/src/char_item.cpp: if (item->GetVnum() == U NIQUE_ITEM_HIDE_ALIGNMENT_TITLE)
  1590. /usr/src/novaline/Server/game/src/char_item.cpp: if (item->GetVnu m() == UNIQUE_ITEM_HIDE_ALIGNMENT_TITLE)
  1591. /usr/src/novaline/Server/game/src/item.cpp: if (GetVnum() == UNIQUE_ITEM_HID E_ALIGNMENT_TITLE)
  1592. /usr/src/novaline/Server/game/src/item.cpp: if (GetVnum() == UNIQUE_ITEM_HID E_ALIGNMENT_TITLE)
  1593. Binary file /usr/src/novaline/Server/game/src/ld.core matches
  1594. /usr/src/novaline/Server/game/src/unique_item.h: UNIQUE_ITEM_HIDE_ALIGNME NT_TITLE = 70048,
  1595. root@HOSTNAME:/usr/home/compile/Server/game # grep -r "UNIQUE_ITEM_HIDE_ALIGNMENT _TITLE" /usr/src/novaline/Server/game/src
  1596. /usr/src/novaline/Server/game/src/char_item.cpp: if (item->GetVnum() == U NIQUE_ITEM_HIDE_ALIGNMENT_TITLE)
  1597. /usr/src/novaline/Server/game/src/char_item.cpp: if (item->GetVnu m() == UNIQUE_ITEM_HIDE_ALIGNMENT_TITLE)
  1598. /usr/src/novaline/Server/game/src/item.cpp: if (GetVnum() == UNIQUE_ITEM_HID E_ALIGNMENT_TITLE)
  1599. /usr/src/novaline/Server/game/src/item.cpp: if (GetVnum() == UNIQUE_ITEM_HID E_ALIGNMENT_TITLE)
  1600. Binary file /usr/src/novaline/Server/game/src/ld.core matches
  1601. /usr/src/novaline/Server/game/src/unique_item.h: UNIQUE_ITEM_HIDE_ALIGNME NT_TITLE = 70048,
  1602. root@HOSTNAME:/usr/home/compile/Server/game # grep -r "39006" /usr/src/novaline/Server/game/src
  1603. root@HOSTNAME:/usr/home/compile/Server/game # grep -r "39006" /usr/src/novaline/Server/game/src
  1604. root@HOSTNAME:/usr/home/compile/Server/game # grep -r "39006" /usr/src/novaline/Server/
  1605. root@HOSTNAME:/usr/home/compile/Server/game # grep -r "brave" /usr/src/novaline/Server/
  1606. root@HOSTNAME:/usr/home/compile/Server/game # grep -r "BRAVE" /usr/src/novaline/Server/
  1607. root@HOSTNAME:/usr/home/compile/Server/game # grep -r "Brave" /usr/src/novaline/Server/
  1608. root@HOSTNAME:/usr/home/compile/Server/game # grep -r "ITEM_IRREMOVABLE" /usr/src/novaline/Server/
  1609. /usr/src/novaline/Server/db/src/ProtoReader.cpp: "ITEM_MAKECOUNT", "ITEM_IRREMOVABLE", "CONFIRM_WHEN_USE", "QUEST_USE", "QUEST_USE_MULTIPLE",
  1610. Binary file /usr/src/novaline/Server/db/src/.obj/ProtoReader.o matches
  1611. root@HOSTNAME:/usr/home/compile/Server/game # gmake -j20
  1612. gmake: *** No targets specified and no makefile found. Stop.
  1613. root@HOSTNAME:/usr/home/compile/Server/game # gmake -j20
  1614. gmake: *** No targets specified and no makefile found. Stop.
  1615. root@HOSTNAME:/usr/home/compile/Server/game # jmake clear
  1616. jmake: Command not found.
  1617. root@HOSTNAME:/usr/home/compile/Server/game # jmake -j20
  1618. jmake: Command not found.
  1619. root@HOSTNAME:/usr/home/compile/Server/game # gmake -j20
  1620. gmake: *** No targets specified and no makefile found. Stop.
  1621. root@HOSTNAME:/usr/home/compile/Server/game # gmake all
  1622. gmake: *** No rule to make target 'all'. Stop.
  1623. root@HOSTNAME:/usr/home/compile/Server/game # cd /usr/src/novaline/Server/game/src
  1624. root@HOSTNAME:/usr/src/novaline/Server/game/src # gmake all
  1625. gmake: *** No rule to make target 'all'. Stop.
  1626. root@HOSTNAME:/usr/src/novaline/Server/game/src # gmake -j20
  1627. compile FSM.cpp
  1628. compile BattleArena.cpp
  1629. compile MarkConvert.cpp
  1630. compile MarkImage.cpp
  1631. compile OXEvent.cpp
  1632. compile TrafficProfiler.cpp
  1633. compile MarkManager.cpp
  1634. compile ani.cpp
  1635. g++: warning: '-mcpu=' is deprecated; use '-mtune=' or '-march=' instead
  1636. compile arena.cpp
  1637. compile banword.cpp
  1638. g++: warning: '-mcpu=' is deprecated; use '-mtune=' or '-march=' instead
  1639. g++: warning: '-mcpu=' is deprecated; use '-mtune=' or '-march=' instead
  1640. compile blend_item.cpp
  1641. compile char_affect.cpp
  1642. compile buffer_manager.cpp
  1643. compile building.cpp
  1644. compile castle.cpp
  1645. g++: warning: '-mcpu=' is deprecated; use '-mtune=' or '-march=' instead
  1646. compile battle.cpp
  1647. compile char_battle.cpp
  1648. g++: warning: '-mcpu=' is deprecated; use '-mtune=' or '-march=' instead
  1649. g++: warning: '-mcpu=' is deprecated; use '-mtune=' or '-march=' instead
  1650. compile char.cpp
  1651. g++: warning: '-mcpu=' is deprecated; use '-mtune=' or '-march=' instead
  1652. g++: warning: '-mcpu=' is deprecated; use '-mtune=' or '-march=' instead
  1653. compile char_change_empire.cpp
  1654. In file included from FSM.cpp:4:0:
  1655. /usr/local/lib/gcc48/include/c++/cstdlib:178:10: error: expected unqualified-id before '__int128'
  1656. inline __int128
  1657. ^
  1658. compile block_country.cpp
  1659. g++: warning: '-mcpu=' is deprecated; use '-mtune=' or '-march=' instead
  1660. g++: warning: '-mcpu=' is deprecated; use '-mtune=' or '-march=' instead
  1661. g++: warning: '-mcpu=' is deprecated; use '-mtune=' or '-march=' instead
  1662. g++: warning: '-mcpu=' is deprecated; use '-mtune=' or '-march=' instead
  1663. g++: warning: '-mcpu=' is deprecated; use '-mtune=' or '-march=' instead
  1664. Makefile:119: recipe for target 'OBJDIR/FSM.o' failed
  1665. g++: warning: '-mcpu=' is deprecated; use '-mtune=' or '-march=' instead
  1666. g++: warning: '-mcpu=' is deprecated; use '-mtune=' or '-march=' instead
  1667. g++: warning: '-mcpu=' is deprecated; use '-mtune=' or '-march=' instead
  1668. gmake: *** [OBJDIR/FSM.o] Error 1
  1669. gmake: *** Waiting for unfinished jobs....
  1670. g++: warning: '-mcpu=' is deprecated; use '-mtune=' or '-march=' instead
  1671. g++: warning: '-mcpu=' is deprecated; use '-mtune=' or '-march=' instead
  1672. g++: warning: '-mcpu=' is deprecated; use '-mtune=' or '-march=' instead
  1673. g++: warning: '-mcpu=' is deprecated; use '-mtune=' or '-march=' instead
  1674. In file included from MarkManager.h:4:0,
  1675. from MarkConvert.cpp:2:
  1676. MarkImage.h:4:19: fatal error: IL/il.h: No such file or directory
  1677. #include <IL/il.h>
  1678. ^
  1679. In file included from debug_allocator.h:4:0,
  1680. from stdafx.h:7,
  1681. from buffer_manager.cpp:1:
  1682. /usr/local/lib/gcc48/include/c++/cstdlib:178:10: error: expected unqualified-id before '__int128'
  1683. inline __int128
  1684. ^
  1685. compilation terminated.
  1686. In file included from debug_allocator.h:4:0,
  1687. from stdafx.h:7,
  1688. from TrafficProfiler.cpp:10:
  1689. /usr/local/lib/gcc48/include/c++/cstdlib:178:10: error: expected unqualified-id before '__int128'
  1690. inline __int128
  1691. ^
  1692. In file included from desc.h:7:0,
  1693. from arena.cpp:5:
  1694. cipher.h:6:31: fatal error: cryptopp/cryptlib.h: No such file or directory
  1695. #include <cryptopp/cryptlib.h>
  1696. ^
  1697. compilation terminated.
  1698. Makefile:119: recipe for target 'OBJDIR/MarkConvert.o' failed
  1699. In file included from MarkImage.cpp:2:0:
  1700. MarkImage.h:4:19: fatal error: IL/il.h: No such file or directory
  1701. #include <IL/il.h>
  1702. ^
  1703. gmake: *** [OBJDIR/MarkConvert.o] Error 1
  1704. compilation terminated.
  1705. Makefile:119: recipe for target 'OBJDIR/arena.o' failed
  1706. gmake: *** [OBJDIR/arena.o] Error 1
  1707. In file included from debug_allocator.h:4:0,
  1708. from stdafx.h:7,
  1709. from blend_item.cpp:10:
  1710. /usr/local/lib/gcc48/include/c++/cstdlib:178:10: error: expected unqualified-id before '__int128'
  1711. inline __int128
  1712. ^
  1713. In file included from MarkManager.h:4:0,
  1714. from MarkManager.cpp:2:
  1715. MarkImage.h:4:19: fatal error: IL/il.h: No such file or directory
  1716. #include <IL/il.h>
  1717. ^
  1718. compilation terminated.
  1719. Makefile:119: recipe for target 'OBJDIR/MarkImage.o' failed
  1720. gmake: *** [OBJDIR/MarkImage.o] Error 1
  1721. Makefile:119: recipe for target 'OBJDIR/MarkManager.o' failed
  1722. gmake: *** [OBJDIR/MarkManager.o] Error 1
  1723. In file included from debug_allocator.h:4:0,
  1724. from stdafx.h:7,
  1725. from block_country.cpp:10:
  1726. /usr/local/lib/gcc48/include/c++/cstdlib:178:10: error: expected unqualified-id before '__int128'
  1727. inline __int128
  1728. ^
  1729. In file included from desc.h:7:0,
  1730. from battle.cpp:4:
  1731. cipher.h:6:31: fatal error: cryptopp/cryptlib.h: No such file or directory
  1732. #include <cryptopp/cryptlib.h>
  1733. ^
  1734. compilation terminated.
  1735. Makefile:119: recipe for target 'OBJDIR/battle.o' failed
  1736. gmake: *** [OBJDIR/battle.o] Error 1
  1737. In file included from desc.h:7:0,
  1738. from char_battle.cpp:4:
  1739. cipher.h:6:31: fatal error: cryptopp/cryptlib.h: No such file or directory
  1740. #include <cryptopp/cryptlib.h>
  1741. ^
  1742. compilation terminated.
  1743. Makefile:119: recipe for target 'OBJDIR/buffer_manager.o' failed
  1744. gmake: *** [OBJDIR/buffer_manager.o] Error 1
  1745. Makefile:119: recipe for target 'OBJDIR/char_battle.o' failed
  1746. gmake: *** [OBJDIR/char_battle.o] Error 1
  1747. Makefile:119: recipe for target 'OBJDIR/blend_item.o' failed
  1748. gmake: *** [OBJDIR/blend_item.o] Error 1
  1749. Makefile:119: recipe for target 'OBJDIR/TrafficProfiler.o' failed
  1750. gmake: *** [OBJDIR/TrafficProfiler.o] Error 1
  1751. Makefile:119: recipe for target 'OBJDIR/block_country.o' failed
  1752. gmake: *** [OBJDIR/block_country.o] Error 1
  1753. In file included from desc.h:7:0,
  1754. from desc_client.h:4,
  1755. from char.cpp:12:
  1756. cipher.h:6:31: fatal error: cryptopp/cryptlib.h: No such file or directory
  1757. #include <cryptopp/cryptlib.h>
  1758. ^
  1759. In file included from debug_allocator.h:4:0,
  1760. from stdafx.h:7,
  1761. from char_change_empire.cpp:2:
  1762. /usr/local/lib/gcc48/include/c++/cstdlib:178:10: error: expected unqualified-id before '__int128'
  1763. inline __int128
  1764. ^
  1765. compilation terminated.
  1766. In file included from debug_allocator.h:4:0,
  1767. from stdafx.h:7,
  1768. from ani.cpp:10:
  1769. /usr/local/lib/gcc48/include/c++/cstdlib:178:10: error: expected unqualified-id before '__int128'
  1770. inline __int128
  1771. ^
  1772. Makefile:119: recipe for target 'OBJDIR/char.o' failed
  1773. gmake: *** [OBJDIR/char.o] Error 1
  1774. In file included from debug_allocator.h:4:0,
  1775. from stdafx.h:7,
  1776. from BattleArena.cpp:1:
  1777. /usr/local/lib/gcc48/include/c++/cstdlib:178:10: error: expected unqualified-id before '__int128'
  1778. inline __int128
  1779. ^
  1780. In file included from desc.h:7:0,
  1781. from OXEvent.cpp:12:
  1782. cipher.h:6:31: fatal error: cryptopp/cryptlib.h: No such file or directory
  1783. #include <cryptopp/cryptlib.h>
  1784. ^
  1785. compilation terminated.
  1786. In file included from debug_allocator.h:4:0,
  1787. from stdafx.h:7,
  1788. from banword.cpp:1:
  1789. /usr/local/lib/gcc48/include/c++/cstdlib:178:10: error: expected unqualified-id before '__int128'
  1790. inline __int128
  1791. ^
  1792. Makefile:119: recipe for target 'OBJDIR/OXEvent.o' failed
  1793. In file included from desc.h:7:0,
  1794. from desc_client.h:4,
  1795. from char_affect.cpp:10:
  1796. cipher.h:6:31: fatal error: cryptopp/cryptlib.h: No such file or directory
  1797. #include <cryptopp/cryptlib.h>
  1798. ^
  1799. gmake: *** [OBJDIR/OXEvent.o] Error 1
  1800. compilation terminated.
  1801. In file included from desc.h:7:0,
  1802. from building.cpp:12:
  1803. cipher.h:6:31: fatal error: cryptopp/cryptlib.h: No such file or directory
  1804. #include <cryptopp/cryptlib.h>
  1805. ^
  1806. compilation terminated.
  1807. Makefile:119: recipe for target 'OBJDIR/char_affect.o' failed
  1808. gmake: *** [OBJDIR/char_affect.o] Error 1
  1809. In file included from debug_allocator.h:4:0,
  1810. from stdafx.h:7,
  1811. from castle.cpp:12:
  1812. /usr/local/lib/gcc48/include/c++/cstdlib:178:10: error: expected unqualified-id before '__int128'
  1813. inline __int128
  1814. ^
  1815. Makefile:119: recipe for target 'OBJDIR/building.o' failed
  1816. gmake: *** [OBJDIR/building.o] Error 1
  1817. In file included from /usr/local/include/boost/limits.hpp:19:0,
  1818. from /usr/local/include/boost/unordered/detail/allocate.hpp:340,
  1819. from /usr/local/include/boost/unordered/detail/buckets.hpp:15,
  1820. from /usr/local/include/boost/unordered/detail/table.hpp:10,
  1821. from /usr/local/include/boost/unordered/detail/equivalent.hpp:14,
  1822. from /usr/local/include/boost/unordered/unordered_map.hpp:17,
  1823. from /usr/local/include/boost/unordered_map.hpp:16,
  1824. from char.h:4,
  1825. from ani.cpp:11:
  1826. /usr/local/lib/gcc48/include/c++/limits:1405:35: error: template argument 1 is invalid
  1827. struct numeric_limits<__int128>
  1828. ^
  1829. /usr/local/lib/gcc48/include/c++/limits:1479:44: error: template argument 1 is invalid
  1830. struct numeric_limits<unsigned __int128>
  1831. ^
  1832. In file included from /usr/local/include/boost/limits.hpp:19:0,
  1833. from /usr/local/include/boost/unordered/detail/allocate.hpp:340,
  1834. from /usr/local/include/boost/unordered/detail/buckets.hpp:15,
  1835. from /usr/local/include/boost/unordered/detail/table.hpp:10,
  1836. from /usr/local/include/boost/unordered/detail/equivalent.hpp:14,
  1837. from /usr/local/include/boost/unordered/unordered_map.hpp:17,
  1838. from /usr/local/include/boost/unordered_map.hpp:16,
  1839. from char.h:4,
  1840. from char_change_empire.cpp:4:
  1841. /usr/local/lib/gcc48/include/c++/limits:1405:35: error: template argument 1 is invalid
  1842. struct numeric_limits<__int128>
  1843. ^
  1844. /usr/local/lib/gcc48/include/c++/limits:1479:44: error: template argument 1 is invalid
  1845. struct numeric_limits<unsigned __int128>
  1846. ^
  1847. In file included from /usr/local/include/boost/limits.hpp:19:0,
  1848. from /usr/local/include/boost/unordered/detail/allocate.hpp:340,
  1849. from /usr/local/include/boost/unordered/detail/buckets.hpp:15,
  1850. from /usr/local/include/boost/unordered/detail/table.hpp:10,
  1851. from /usr/local/include/boost/unordered/detail/equivalent.hpp:14,
  1852. from /usr/local/include/boost/unordered/unordered_map.hpp:17,
  1853. from /usr/local/include/boost/unordered_map.hpp:16,
  1854. from banword.h:5,
  1855. from banword.cpp:3:
  1856. /usr/local/lib/gcc48/include/c++/limits:1405:35: error: template argument 1 is invalid
  1857. struct numeric_limits<__int128>
  1858. ^
  1859. /usr/local/lib/gcc48/include/c++/limits:1479:44: error: template argument 1 is invalid
  1860. struct numeric_limits<unsigned __int128>
  1861. ^
  1862. In file included from /usr/local/include/boost/limits.hpp:19:0,
  1863. from /usr/local/include/boost/unordered/detail/allocate.hpp:340,
  1864. from /usr/local/include/boost/unordered/detail/buckets.hpp:15,
  1865. from /usr/local/include/boost/unordered/detail/table.hpp:10,
  1866. from /usr/local/include/boost/unordered/detail/equivalent.hpp:14,
  1867. from /usr/local/include/boost/unordered/unordered_map.hpp:17,
  1868. from /usr/local/include/boost/unordered_map.hpp:16,
  1869. from char.h:4,
  1870. from BattleArena.cpp:6:
  1871. /usr/local/lib/gcc48/include/c++/limits:1405:35: error: template argument 1 is invalid
  1872. struct numeric_limits<__int128>
  1873. ^
  1874. /usr/local/lib/gcc48/include/c++/limits:1479:44: error: template argument 1 is invalid
  1875. struct numeric_limits<unsigned __int128>
  1876. ^
  1877. In file included from /usr/local/include/boost/limits.hpp:19:0,
  1878. from /usr/local/include/boost/unordered/detail/allocate.hpp:340,
  1879. from /usr/local/include/boost/unordered/detail/buckets.hpp:15,
  1880. from /usr/local/include/boost/unordered/detail/table.hpp:10,
  1881. from /usr/local/include/boost/unordered/detail/equivalent.hpp:14,
  1882. from /usr/local/include/boost/unordered/unordered_map.hpp:17,
  1883. from /usr/local/include/boost/unordered_map.hpp:16,
  1884. from char.h:4,
  1885. from castle.cpp:21:
  1886. /usr/local/lib/gcc48/include/c++/limits:1405:35: error: template argument 1 is invalid
  1887. struct numeric_limits<__int128>
  1888. ^
  1889. /usr/local/lib/gcc48/include/c++/limits:1479:44: error: template argument 1 is invalid
  1890. struct numeric_limits<unsigned __int128>
  1891. ^
  1892. Makefile:119: recipe for target 'OBJDIR/ani.o' failed
  1893. gmake: *** [OBJDIR/ani.o] Error 1
  1894. Makefile:119: recipe for target 'OBJDIR/banword.o' failed
  1895. gmake: *** [OBJDIR/banword.o] Error 1
  1896. Makefile:119: recipe for target 'OBJDIR/char_change_empire.o' failed
  1897. gmake: *** [OBJDIR/char_change_empire.o] Error 1
  1898. Makefile:119: recipe for target 'OBJDIR/castle.o' failed
  1899. gmake: *** [OBJDIR/castle.o] Error 1
  1900. Makefile:119: recipe for target 'OBJDIR/BattleArena.o' failed
  1901. gmake: *** [OBJDIR/BattleArena.o] Error 1
Advertisement
Add Comment
Please, Sign In to add comment