Pastebin launched a little side project called VERYVIRAL.com, check it out ;-) Want more features on Pastebin? Sign Up, it's FREE!
Guest

Untitled

By: a guest on Jan 11th, 2013  |  syntax: None  |  size: 5.44 KB  |  views: 13  |  expires: Never
download  |  raw  |  embed  |  report abuse  |  print
This paste has a previous version, view the difference. Text below is selected. Please press Ctrl+C to copy to your clipboard. (⌘+C on Mac)
  1. patching file cnijfilter-source-3.60-1/backend/src/cnij_backend_common.c
  2. patching file cnijfilter-source-3.60-1/cngpij/cngpij/bjcups.c
  3. patching file cnijfilter-source-3.60-1/cngpijmon/src/bjcupsmon_cups.c
  4. patching file cnijfilter-source-3.60-1/cnijfilter/src/bjfimage.c
  5. processing .
  6. Running aclocal  ...
  7. aclocal: warning: autoconf input should be named 'configure.ac', not 'configure.in'
  8. Running automake --gnu  ...
  9. automake: warning: autoconf input should be named 'configure.ac', not 'configure.in'
  10. configure.in:2: warning: AM_INIT_AUTOMAKE: two- and three-arguments forms are deprecated.  For more info, see:
  11. configure.in:2: http://www.gnu.org/software/automake/manual/automake.html#Modernize-AM_INIT_AUTOMAKE-invocation
  12. configure.in:2: installing './install-sh'
  13. configure.in:2: installing './missing'
  14. Makefile.am: installing './COPYING' using GNU General Public License v3 file
  15. Makefile.am:     Consider adding the COPYING file to the version control system
  16. Makefile.am:     for your code, to avoid questions about which license your project uses
  17. automake: warning: autoconf input should be named 'configure.ac', not 'configure.in'
  18. Running autoconf ...
  19. Running ./configure --prefix=/usr --enable-ppdpath=/usr/share/cups/model --program-suffix=mg5300 ...
  20. checking for a BSD-compatible install... /usr/bin/install -c
  21. checking whether build environment is sane... yes
  22. checking for a thread-safe mkdir -p... /usr/bin/mkdir -p
  23. checking for gawk... gawk
  24. checking whether make sets $(MAKE)... yes
  25. checking whether make supports nested variables... yes
  26. checking that generated files are newer than configure... done
  27. configure: creating ./config.status
  28. config.status: creating Makefile
  29. Now type `make' to compile
  30. make: Nothing to be done for `clean'.
  31. make: Nothing to be done for `all'.
  32. make[1]: Entering directory `/home/halfur/build/cnijfilter-mg5300/src/cnijfilter-source-3.60-1/ppd'
  33. make[1]: Nothing to be done for `install-exec-am'.
  34.  /usr/bin/mkdir -p '/home/halfur/build/cnijfilter-mg5300/pkg/usr/share/cups/model'
  35.  /usr/bin/install -c -m 644 canonmg5300.ppd '/home/halfur/build/cnijfilter-mg5300/pkg/usr/share/cups/model'
  36. make[1]: Leaving directory `/home/halfur/build/cnijfilter-mg5300/src/cnijfilter-source-3.60-1/ppd'
  37. processing .
  38. Running aclocal  ...
  39. aclocal: warning: autoconf input should be named 'configure.ac', not 'configure.in'
  40. configure.in:28: error: 'AM_CONFIG_HEADER': this macro is obsolete.
  41.     You should use the 'AC_CONFIG_HEADERS' macro instead.
  42. /usr/share/aclocal-1.13/obsolete-err.m4:12: AM_CONFIG_HEADER is expanded from...
  43. configure.in:28: the top level
  44. autom4te: /usr/bin/m4 failed with exit status: 1
  45. aclocal: error: echo failed with exit status: 1
  46. Running autoheader...
  47. autoheader: WARNING: Using auxiliary files such as `acconfig.h', `config.h.bot'
  48. autoheader: WARNING: and `config.h.top', to define templates for `config.h.in'
  49. autoheader: WARNING: is deprecated and discouraged.
  50. autoheader:
  51. autoheader: WARNING: Using the third argument of `AC_DEFINE' and
  52. autoheader: WARNING: `AC_DEFINE_UNQUOTED' allows one to define a template without
  53. autoheader: WARNING: `acconfig.h':
  54. autoheader:
  55. autoheader: WARNING:   AC_DEFINE([NEED_FUNC_MAIN], 1,
  56. autoheader:             [Define if a function `main' is needed.])
  57. autoheader:
  58. autoheader: WARNING: More sophisticated templates can also be produced, see the
  59. autoheader: WARNING: documentation.
  60. autoheader: error: AC_CONFIG_HEADERS not found in configure.in
  61. Running automake --gnu  ...
  62. automake: warning: autoconf input should be named 'configure.ac', not 'configure.in'
  63. configure.in: error: no proper invocation of AM_INIT_AUTOMAKE was found.
  64. configure.in: You should verify that configure.in invokes AM_INIT_AUTOMAKE,
  65. configure.in: that aclocal.m4 is present in the top-level directory,
  66. configure.in: and that aclocal.m4 was recently regenerated (using aclocal)
  67. src/Makefile.am:1: warning: 'INCLUDES' is the old name for 'AM_CPPFLAGS' (or '*_CPPFLAGS')
  68. src/Makefile.am: installing './depcomp'
  69. /usr/share/automake-1.13/am/depend2.am: error: am__fastdepCC does not appear in AM_CONDITIONAL
  70. /usr/share/automake-1.13/am/depend2.am:   The usual way to define 'am__fastdepCC' is to add 'AC_PROG_CC'
  71. /usr/share/automake-1.13/am/depend2.am:   to 'configure.in' and run 'aclocal' and 'autoconf' again
  72. /usr/share/automake-1.13/am/depend2.am: error: AMDEP does not appear in AM_CONDITIONAL
  73. /usr/share/automake-1.13/am/depend2.am:   The usual way to define 'AMDEP' is to add one of the compiler tests
  74. /usr/share/automake-1.13/am/depend2.am:     AC_PROG_CC, AC_PROG_CXX, AC_PROG_OBJC, AC_PROG_OBJCXX,
  75. /usr/share/automake-1.13/am/depend2.am:     AM_PROG_AS, AM_PROG_GCJ, AM_PROG_UPC
  76. /usr/share/automake-1.13/am/depend2.am:   to 'configure.in' and run 'aclocal' and 'autoconf' again
  77. automake: warning: autoconf input should be named 'configure.ac', not 'configure.in'
  78. Running autoconf ...
  79. configure.in:27: error: possibly undefined macro: AM_INIT_AUTOMAKE
  80.       If this token and others are legitimate, please use m4_pattern_allow.
  81.       See the Autoconf documentation.
  82. configure.in:28: error: possibly undefined macro: AM_CONFIG_HEADER
  83. configure.in:50: error: possibly undefined macro: AM_PROG_CC_STDC
  84. Running ./configure --prefix=/usr --enable-libpath=/usr/lib/bjlib --enable-binpath=/usr/bin --program-suffix=mg5300 ...
  85. ./configure: line 2181: syntax error near unexpected token `cif${program_suffix},'
  86. ./configure: line 2181: `AM_INIT_AUTOMAKE(cif${program_suffix}, 3.60-1)'
  87. ==> ERROR: A failure occurred in build().
  88.     Aborting...