Guest User

gradlew clean and gradlew setupDecompWorkspace errors

a guest
Jul 15th, 2014
307
0
Never
Not a member of Pastebin yet? Sign Up, it unlocks many cool features!
text 3.97 KB | None | 0 0
  1. ]
  2. 16:10:13.171 [ERROR] [org.gradle.BuildExceptionReporter] * What went wrong:
  3. 16:10:13.171 [ERROR] [org.gradle.BuildExceptionReporter] A problem occurred config
  4. uring root project 'NotJustFish'.
  5. 16:10:13.203 [ERROR] [org.gradle.BuildExceptionReporter] > com.google.gson.stream.
  6. MalformedJsonException: Unterminated string at line 528 column 33
  7. 16:10:13.218 [ERROR] [org.gradle.BuildExceptionReporter]
  8. 16:10:13.234 [ERROR] [org.gradle.BuildExceptionReporter] * Try:
  9. 16:10:13.250 [ERROR] [org.gradle.BuildExceptionReporter] Run with --stacktrace opt
  10. ion to get the stack trace.
  11. 16:10:13.265 [LIFECYCLE] [org.gradle.BuildResultLogger]
  12. 16:10:13.281 [LIFECYCLE] [org.gradle.BuildResultLogger] BUILD FAILED
  13. 16:10:13.281 [LIFECYCLE] [org.gradle.BuildResultLogger]
  14. 16:10:13.296 [LIFECYCLE] [org.gradle.BuildResultLogger] Total time: 1 mins 37.703
  15. secs
  16. 16:10:13.375 [DEBUG] [org.gradle.cache.internal.DefaultFileLockManager] Releasing
  17. lock on buildscript class cache for build file 'C:\Documents and Settings\Owner\My
  18. Documents\Minecraft Mods\NotJustFish\NotJustFish\build.gradle' (C:\Documents and
  19. Settings\Owner\.gradle\caches\2.0\scripts\build_286d6ei38ivb8p3kvob4r19h7k\Project
  20. Script\buildscript).
  21. 16:10:13.375 [DEBUG] [org.gradle.cache.internal.DefaultFileLockManager] Releasing
  22. lock on no_buildscript class cache for build file 'C:\Documents and Settings\Owner
  23. \My Documents\Minecraft Mods\NotJustFish\NotJustFish\build.gradle' (C:\Documents a
  24. nd Settings\Owner\.gradle\caches\2.0\scripts\build_286d6ei38ivb8p3kvob4r19h7k\Proj
  25. ectScript\no_buildscript).
  26. 16:10:13.390 [DEBUG] [org.gradle.cache.internal.btree.BTreePersistentIndexedCache]
  27. C
  28. losing cache module-metadata.bin (C:\Documents and Settings\Owner\.gradle\caches\m
  29. odules-2\metadata-2.12\module-metadata.bin)
  30. 16:10:13.390 [DEBUG] [org.gradle.cache.internal.btree.BTreePersistentIndexedCache]
  31. C
  32. losing cache artifact-at-repository.bin (C:\Documents and Settings\Owner\.gradle\c
  33. aches\modules-2\metadata-2.12\artifact-at-repository.bin)
  34. 16:10:13.390 [DEBUG] [org.gradle.cache.internal.btree.BTreePersistentIndexedCache]
  35. C
  36. losing cache module-versions.bin (C:\Documents and Settings\Owner\.gradle\caches\m
  37. odules-2\metadata-2.12\module-versions.bin)
  38. 16:10:13.406 [DEBUG] [org.gradle.cache.internal.DefaultFileLockManager] Releasing
  39. lock on artifact cache (C:\Documents and Settings\Owner\.gradle\caches\modules-2).
  40.  
  41. 16:10:13.453 [DEBUG] [org.gradle.api.internal.artifacts.ivyservice.ivyresolve.memc
  42. ache.InMemoryCachedRepositoryFactory ]
  43. I
  44. n-memory dependency metadata cache closed. Repos cached: 3, cache instances: 3, mo
  45. dules served from cache: 12, artifacts: 0
  46. 16:10:13.484 [DEBUG] [org.gradle.api.internal.artifacts.ivyservice.resolveengine.s
  47. tore.CachedStoreFactory ]
  48. R
  49. esolution result cache closed. Cache reads: 0, disk reads: 0 (avg: 0.0 secs, total
  50. : 0.0 secs)
  51. 16:10:13.515 [DEBUG] [org.gradle.api.internal.artifacts.ivyservice.resolveengine.s
  52. tore.CachedStoreFactory ]
  53. R
  54. esolved configuration cache closed. Cache reads: 0, disk reads: 0 (avg: 0.0 secs,
  55. total: 0.0 secs)
  56. 16:10:13.546 [DEBUG] [org.gradle.api.internal.artifacts.ivyservice.resolveengine.s
  57. tore.ResolutionResultsStoreFactory ]
  58.  
  59. Deleted 2 resolution results binary files in 0.078 secs
Advertisement
Add Comment
Please, Sign In to add comment