Pastebin launched a little side project called VERYVIRAL.com, check it out ;-) Want more features on Pastebin? Sign Up, it's FREE!
Guest

libeo compilation fail

By: a guest on Apr 26th, 2012  |  syntax: None  |  size: 12.25 KB  |  views: 27  |  expires: Never
download  |  raw  |  embed  |  report abuse  |  print
Text below is selected. Please press Ctrl+C to copy to your clipboard. (⌘+C on Mac)
  1. Scanning dependencies of target es
  2. [ 21%] Building CXX object src/es/CMakeFiles/es.dir/make_algo_scalar_es.cpp.o                                                                                                                              
  3. In file included from /var/tmp/yaourt-tmp-fleger/aur-libeo/src/eo/src/eoFitnessScalingSelect.h:32:0,                                                                                                      
  4.                  from /var/tmp/yaourt-tmp-fleger/aur-libeo/src/eo/src/do/make_algo_scalar.h:39,
  5.                  from /var/tmp/yaourt-tmp-fleger/aur-libeo/src/eo/src/es/make_algo_scalar_es.cpp:44:
  6. /var/tmp/yaourt-tmp-fleger/aur-libeo/src/eo/src/eoSelectFromWorth.h: In instantiation of ‘const EOT& eoRouletteWorthSelect<EOT, WorthT>::operator()(const eoPop<EOT>&) [with EOT = eoEsFull<eoScalarFitness<double, std::greater<double> > >; WorthT = double]’:
  7. /var/tmp/yaourt-tmp-fleger/aur-libeo/src/eo/src/es/make_algo_scalar_es.cpp:84:1:   required from here
  8. /var/tmp/yaourt-tmp-fleger/aur-libeo/src/eo/src/eoSelectFromWorth.h:220:3: erreur: ‘check_sync’ was not declared in this scope, and no declarations were found by argument-dependent lookup at the point of instantiation [-fpermissive]
  9. /var/tmp/yaourt-tmp-fleger/aur-libeo/src/eo/src/eoSelectFromWorth.h:220:3: note: declarations in dependent base ‘eoSelectFromWorth<eoEsFull<eoScalarFitness<double, std::greater<double> > >, double>’ are not found by unqualified lookup
  10. /var/tmp/yaourt-tmp-fleger/aur-libeo/src/eo/src/eoSelectFromWorth.h:220:3: note: use ‘this->check_sync’ instead
  11. /var/tmp/yaourt-tmp-fleger/aur-libeo/src/eo/src/eoSelectFromWorth.h: In instantiation of ‘const EOT& eoRouletteWorthSelect<EOT, WorthT>::operator()(const eoPop<EOT>&) [with EOT = eoEsFull<double>; WorthT = double]’:
  12. /var/tmp/yaourt-tmp-fleger/aur-libeo/src/eo/src/es/make_algo_scalar_es.cpp:84:1:   required from here
  13. /var/tmp/yaourt-tmp-fleger/aur-libeo/src/eo/src/eoSelectFromWorth.h:220:3: erreur: ‘check_sync’ was not declared in this scope, and no declarations were found by argument-dependent lookup at the point of instantiation [-fpermissive]
  14. /var/tmp/yaourt-tmp-fleger/aur-libeo/src/eo/src/eoSelectFromWorth.h:220:3: note: declarations in dependent base ‘eoSelectFromWorth<eoEsFull<double>, double>’ are not found by unqualified lookup
  15. /var/tmp/yaourt-tmp-fleger/aur-libeo/src/eo/src/eoSelectFromWorth.h:220:3: note: use ‘this->check_sync’ instead
  16. /var/tmp/yaourt-tmp-fleger/aur-libeo/src/eo/src/eoSelectFromWorth.h: In instantiation of ‘const EOT& eoRouletteWorthSelect<EOT, WorthT>::operator()(const eoPop<EOT>&) [with EOT = eoEsStdev<eoScalarFitness<double, std::greater<double> > >; WorthT = double]’:
  17. /var/tmp/yaourt-tmp-fleger/aur-libeo/src/eo/src/es/make_algo_scalar_es.cpp:84:1:   required from here
  18. /var/tmp/yaourt-tmp-fleger/aur-libeo/src/eo/src/eoSelectFromWorth.h:220:3: erreur: ‘check_sync’ was not declared in this scope, and no declarations were found by argument-dependent lookup at the point of instantiation [-fpermissive]
  19. /var/tmp/yaourt-tmp-fleger/aur-libeo/src/eo/src/eoSelectFromWorth.h:220:3: note: declarations in dependent base ‘eoSelectFromWorth<eoEsStdev<eoScalarFitness<double, std::greater<double> > >, double>’ are not found by unqualified lookup
  20. /var/tmp/yaourt-tmp-fleger/aur-libeo/src/eo/src/eoSelectFromWorth.h:220:3: note: use ‘this->check_sync’ instead
  21. /var/tmp/yaourt-tmp-fleger/aur-libeo/src/eo/src/eoSelectFromWorth.h: In instantiation of ‘const EOT& eoRouletteWorthSelect<EOT, WorthT>::operator()(const eoPop<EOT>&) [with EOT = eoEsStdev<double>; WorthT = double]’:
  22. /var/tmp/yaourt-tmp-fleger/aur-libeo/src/eo/src/es/make_algo_scalar_es.cpp:84:1:   required from here
  23. /var/tmp/yaourt-tmp-fleger/aur-libeo/src/eo/src/eoSelectFromWorth.h:220:3: erreur: ‘check_sync’ was not declared in this scope, and no declarations were found by argument-dependent lookup at the point of instantiation [-fpermissive]
  24. /var/tmp/yaourt-tmp-fleger/aur-libeo/src/eo/src/eoSelectFromWorth.h:220:3: note: declarations in dependent base ‘eoSelectFromWorth<eoEsStdev<double>, double>’ are not found by unqualified lookup
  25. /var/tmp/yaourt-tmp-fleger/aur-libeo/src/eo/src/eoSelectFromWorth.h:220:3: note: use ‘this->check_sync’ instead
  26. /var/tmp/yaourt-tmp-fleger/aur-libeo/src/eo/src/eoSelectFromWorth.h: In instantiation of ‘const EOT& eoRouletteWorthSelect<EOT, WorthT>::operator()(const eoPop<EOT>&) [with EOT = eoEsSimple<eoScalarFitness<double, std::greater<double> > >; WorthT = double]’:
  27. /var/tmp/yaourt-tmp-fleger/aur-libeo/src/eo/src/es/make_algo_scalar_es.cpp:84:1:   required from here
  28. /var/tmp/yaourt-tmp-fleger/aur-libeo/src/eo/src/eoSelectFromWorth.h:220:3: erreur: ‘check_sync’ was not declared in this scope, and no declarations were found by argument-dependent lookup at the point of instantiation [-fpermissive]
  29. /var/tmp/yaourt-tmp-fleger/aur-libeo/src/eo/src/eoSelectFromWorth.h:220:3: note: declarations in dependent base ‘eoSelectFromWorth<eoEsSimple<eoScalarFitness<double, std::greater<double> > >, double>’ are not found by unqualified lookup
  30. /var/tmp/yaourt-tmp-fleger/aur-libeo/src/eo/src/eoSelectFromWorth.h:220:3: note: use ‘this->check_sync’ instead
  31. /var/tmp/yaourt-tmp-fleger/aur-libeo/src/eo/src/eoSelectFromWorth.h: In instantiation of ‘const EOT& eoRouletteWorthSelect<EOT, WorthT>::operator()(const eoPop<EOT>&) [with EOT = eoEsSimple<double>; WorthT = double]’:
  32. /var/tmp/yaourt-tmp-fleger/aur-libeo/src/eo/src/es/make_algo_scalar_es.cpp:84:1:   required from here
  33. /var/tmp/yaourt-tmp-fleger/aur-libeo/src/eo/src/eoSelectFromWorth.h:220:3: erreur: ‘check_sync’ was not declared in this scope, and no declarations were found by argument-dependent lookup at the point of instantiation [-fpermissive]
  34. /var/tmp/yaourt-tmp-fleger/aur-libeo/src/eo/src/eoSelectFromWorth.h:220:3: note: declarations in dependent base ‘eoSelectFromWorth<eoEsSimple<double>, double>’ are not found by unqualified lookup
  35. /var/tmp/yaourt-tmp-fleger/aur-libeo/src/eo/src/eoSelectFromWorth.h:220:3: note: use ‘this->check_sync’ instead
  36. make[2]: *** [src/es/CMakeFiles/es.dir/make_algo_scalar_es.cpp.o] Erreur 1
  37. make[1]: *** [src/es/CMakeFiles/es.dir/all] Erreur 2
  38. make: *** [all] Erreur 2
  39. [ 13%] Built target eo
  40. [ 19%] Built target cma
  41. [ 21%] Building CXX object src/es/CMakeFiles/es.dir/make_algo_scalar_es.cpp.o
  42. In file included from /var/tmp/yaourt-tmp-fleger/aur-libeo/src/eo/src/eoFitnessScalingSelect.h:32:0,                                                                                                      
  43.                  from /var/tmp/yaourt-tmp-fleger/aur-libeo/src/eo/src/do/make_algo_scalar.h:39,
  44.                  from /var/tmp/yaourt-tmp-fleger/aur-libeo/src/eo/src/es/make_algo_scalar_es.cpp:44:
  45. /var/tmp/yaourt-tmp-fleger/aur-libeo/src/eo/src/eoSelectFromWorth.h: In instantiation of ‘const EOT& eoRouletteWorthSelect<EOT, WorthT>::operator()(const eoPop<EOT>&) [with EOT = eoEsFull<eoScalarFitness<double, std::greater<double> > >; WorthT = double]’:
  46. /var/tmp/yaourt-tmp-fleger/aur-libeo/src/eo/src/es/make_algo_scalar_es.cpp:84:1:   required from here
  47. /var/tmp/yaourt-tmp-fleger/aur-libeo/src/eo/src/eoSelectFromWorth.h:220:3: erreur: ‘check_sync’ was not declared in this scope, and no declarations were found by argument-dependent lookup at the point of instantiation [-fpermissive]
  48. /var/tmp/yaourt-tmp-fleger/aur-libeo/src/eo/src/eoSelectFromWorth.h:220:3: note: declarations in dependent base ‘eoSelectFromWorth<eoEsFull<eoScalarFitness<double, std::greater<double> > >, double>’ are not found by unqualified lookup
  49. /var/tmp/yaourt-tmp-fleger/aur-libeo/src/eo/src/eoSelectFromWorth.h:220:3: note: use ‘this->check_sync’ instead
  50. /var/tmp/yaourt-tmp-fleger/aur-libeo/src/eo/src/eoSelectFromWorth.h: In instantiation of ‘const EOT& eoRouletteWorthSelect<EOT, WorthT>::operator()(const eoPop<EOT>&) [with EOT = eoEsFull<double>; WorthT = double]’:
  51. /var/tmp/yaourt-tmp-fleger/aur-libeo/src/eo/src/es/make_algo_scalar_es.cpp:84:1:   required from here
  52. /var/tmp/yaourt-tmp-fleger/aur-libeo/src/eo/src/eoSelectFromWorth.h:220:3: erreur: ‘check_sync’ was not declared in this scope, and no declarations were found by argument-dependent lookup at the point of instantiation [-fpermissive]
  53. /var/tmp/yaourt-tmp-fleger/aur-libeo/src/eo/src/eoSelectFromWorth.h:220:3: note: declarations in dependent base ‘eoSelectFromWorth<eoEsFull<double>, double>’ are not found by unqualified lookup
  54. /var/tmp/yaourt-tmp-fleger/aur-libeo/src/eo/src/eoSelectFromWorth.h:220:3: note: use ‘this->check_sync’ instead
  55. /var/tmp/yaourt-tmp-fleger/aur-libeo/src/eo/src/eoSelectFromWorth.h: In instantiation of ‘const EOT& eoRouletteWorthSelect<EOT, WorthT>::operator()(const eoPop<EOT>&) [with EOT = eoEsStdev<eoScalarFitness<double, std::greater<double> > >; WorthT = double]’:
  56. /var/tmp/yaourt-tmp-fleger/aur-libeo/src/eo/src/es/make_algo_scalar_es.cpp:84:1:   required from here
  57. /var/tmp/yaourt-tmp-fleger/aur-libeo/src/eo/src/eoSelectFromWorth.h:220:3: erreur: ‘check_sync’ was not declared in this scope, and no declarations were found by argument-dependent lookup at the point of instantiation [-fpermissive]
  58. /var/tmp/yaourt-tmp-fleger/aur-libeo/src/eo/src/eoSelectFromWorth.h:220:3: note: declarations in dependent base ‘eoSelectFromWorth<eoEsStdev<eoScalarFitness<double, std::greater<double> > >, double>’ are not found by unqualified lookup
  59. /var/tmp/yaourt-tmp-fleger/aur-libeo/src/eo/src/eoSelectFromWorth.h:220:3: note: use ‘this->check_sync’ instead
  60. /var/tmp/yaourt-tmp-fleger/aur-libeo/src/eo/src/eoSelectFromWorth.h: In instantiation of ‘const EOT& eoRouletteWorthSelect<EOT, WorthT>::operator()(const eoPop<EOT>&) [with EOT = eoEsStdev<double>; WorthT = double]’:
  61. /var/tmp/yaourt-tmp-fleger/aur-libeo/src/eo/src/es/make_algo_scalar_es.cpp:84:1:   required from here
  62. /var/tmp/yaourt-tmp-fleger/aur-libeo/src/eo/src/eoSelectFromWorth.h:220:3: erreur: ‘check_sync’ was not declared in this scope, and no declarations were found by argument-dependent lookup at the point of instantiation [-fpermissive]
  63. /var/tmp/yaourt-tmp-fleger/aur-libeo/src/eo/src/eoSelectFromWorth.h:220:3: note: declarations in dependent base ‘eoSelectFromWorth<eoEsStdev<double>, double>’ are not found by unqualified lookup
  64. /var/tmp/yaourt-tmp-fleger/aur-libeo/src/eo/src/eoSelectFromWorth.h:220:3: note: use ‘this->check_sync’ instead
  65. /var/tmp/yaourt-tmp-fleger/aur-libeo/src/eo/src/eoSelectFromWorth.h: In instantiation of ‘const EOT& eoRouletteWorthSelect<EOT, WorthT>::operator()(const eoPop<EOT>&) [with EOT = eoEsSimple<eoScalarFitness<double, std::greater<double> > >; WorthT = double]’:
  66. /var/tmp/yaourt-tmp-fleger/aur-libeo/src/eo/src/es/make_algo_scalar_es.cpp:84:1:   required from here
  67. /var/tmp/yaourt-tmp-fleger/aur-libeo/src/eo/src/eoSelectFromWorth.h:220:3: erreur: ‘check_sync’ was not declared in this scope, and no declarations were found by argument-dependent lookup at the point of instantiation [-fpermissive]
  68. /var/tmp/yaourt-tmp-fleger/aur-libeo/src/eo/src/eoSelectFromWorth.h:220:3: note: declarations in dependent base ‘eoSelectFromWorth<eoEsSimple<eoScalarFitness<double, std::greater<double> > >, double>’ are not found by unqualified lookup
  69. /var/tmp/yaourt-tmp-fleger/aur-libeo/src/eo/src/eoSelectFromWorth.h:220:3: note: use ‘this->check_sync’ instead
  70. /var/tmp/yaourt-tmp-fleger/aur-libeo/src/eo/src/eoSelectFromWorth.h: In instantiation of ‘const EOT& eoRouletteWorthSelect<EOT, WorthT>::operator()(const eoPop<EOT>&) [with EOT = eoEsSimple<double>; WorthT = double]’:
  71. /var/tmp/yaourt-tmp-fleger/aur-libeo/src/eo/src/es/make_algo_scalar_es.cpp:84:1:   required from here
  72. /var/tmp/yaourt-tmp-fleger/aur-libeo/src/eo/src/eoSelectFromWorth.h:220:3: erreur: ‘check_sync’ was not declared in this scope, and no declarations were found by argument-dependent lookup at the point of instantiation [-fpermissive]
  73. /var/tmp/yaourt-tmp-fleger/aur-libeo/src/eo/src/eoSelectFromWorth.h:220:3: note: declarations in dependent base ‘eoSelectFromWorth<eoEsSimple<double>, double>’ are not found by unqualified lookup
  74. /var/tmp/yaourt-tmp-fleger/aur-libeo/src/eo/src/eoSelectFromWorth.h:220:3: note: use ‘this->check_sync’ instead
  75. make[2]: *** [src/es/CMakeFiles/es.dir/make_algo_scalar_es.cpp.o] Erreur 1
  76. make[1]: *** [src/es/CMakeFiles/es.dir/all] Erreur 2
  77. make: *** [all] Erreur 2