Want more features on Pastebin? Sign Up, it's FREE!
Guest

gst-plugins-base-0.10.35/config.log

By: namuol on Feb 6th, 2012  |  syntax: None  |  size: 141.55 KB  |  views: 97  |  expires: Never
download  |  raw  |  embed  |  report abuse  |  print
Text below is selected. Please press Ctrl+C to copy to your clipboard. (⌘+C on Mac)
  1. This file contains any messages produced by compilers while
  2. running configure, to aid debugging if configure makes a mistake.
  3.  
  4. It was created by GStreamer Base Plug-ins configure 0.10.35, which was
  5. generated by GNU Autoconf 2.68.  Invocation command line was
  6.  
  7.   $ ./configure --prefix=/usr --sysconfdir=/etc --localstatedir=/var --disable-static --enable-experimental --disable-gnome_vfs --with-package-name=GStreamer Base Plugins (Archlinux) --with-package-origin=http://www.archlinux.org/ --libdir=/usr/lib32 --enable-introspection=no
  8.  
  9. ## --------- ##
  10. ## Platform. ##
  11. ## --------- ##
  12.  
  13. hostname = jupiter
  14. uname -m = x86_64
  15. uname -r = 3.2.2-1-ARCH
  16. uname -s = Linux
  17. uname -v = #1 SMP PREEMPT Thu Jan 26 08:40:20 CET 2012
  18.  
  19. /usr/bin/uname -p = unknown
  20. /bin/uname -X     = unknown
  21.  
  22. /bin/arch              = x86_64
  23. /usr/bin/arch -k       = unknown
  24. /usr/convex/getsysinfo = unknown
  25. /usr/bin/hostinfo      = unknown
  26. /bin/machine           = unknown
  27. /usr/bin/oslevel       = unknown
  28. /bin/universe          = unknown
  29.  
  30. PATH: /opt/android-sdk/tools
  31. PATH: /opt/android-sdk/platform-tools
  32. PATH: /opt/adobe-flex-sdk/bin
  33. PATH: /opt/adobe-air-sdk/bin
  34. PATH: /opt/glassfishv3/bin
  35. PATH: /opt/glassfishv3/glassfish/bin
  36. PATH: .
  37. PATH: /home/louman/bin
  38. PATH: /home/louman/local/bin
  39. PATH: /usr/local/bin
  40. PATH: /opt/android-sdk/tools
  41. PATH: /opt/android-sdk/platform-tools
  42. PATH: /opt/adobe-flex-sdk/bin
  43. PATH: /opt/adobe-air-sdk/bin
  44. PATH: /opt/glassfishv3/bin
  45. PATH: /opt/glassfishv3/glassfish/bin
  46. PATH: .
  47. PATH: /home/louman/bin
  48. PATH: /home/louman/local/bin
  49. PATH: /usr/local/bin
  50. PATH: /home/louman/GNUstep/Tools
  51. PATH: /bin
  52. PATH: /usr/bin
  53. PATH: /sbin
  54. PATH: /usr/sbin
  55. PATH: /opt/adobe-flex-sdk/bin
  56. PATH: /opt/android-sdk/platform-tools
  57. PATH: /opt/android-sdk/tools
  58. PATH: /usr/share/java/apache-ant/bin
  59. PATH: /usr/share/java/gradle/bin
  60. PATH: /opt/java/bin
  61. PATH: /opt/java/db/bin
  62. PATH: /opt/java/jre/bin
  63. PATH: /opt/kde/bin
  64. PATH: /usr/bin/vendor_perl
  65. PATH: /usr/bin/core_perl
  66. PATH: /opt/qt/bin
  67.  
  68.  
  69. ## ----------- ##
  70. ## Core tests. ##
  71. ## ----------- ##
  72.  
  73. configure:3264: checking for a BSD-compatible install
  74. configure:3332: result: /bin/install -c
  75. configure:3343: checking whether build environment is sane
  76. configure:3393: result: yes
  77. configure:3534: checking for a thread-safe mkdir -p
  78. configure:3573: result: /bin/mkdir -p
  79. configure:3586: checking for gawk
  80. configure:3602: found /bin/gawk
  81. configure:3613: result: gawk
  82. configure:3624: checking whether make sets $(MAKE)
  83. configure:3646: result: yes
  84. configure:3738: checking nano version
  85. configure:3744: result: 0 (release)
  86. configure:3770: checking whether to enable maintainer-specific portions of Makefiles
  87. configure:3779: result: no
  88. configure:3797: checking build system type
  89. configure:3811: result: x86_64-unknown-linux-gnu
  90. configure:3831: checking host system type
  91. configure:3844: result: x86_64-unknown-linux-gnu
  92. configure:3876: checking whether make supports nested variables
  93. configure:3893: result: yes
  94. configure:4282: checking how to print strings
  95. configure:4309: result: printf
  96. configure:4342: checking for style of include used by make
  97. configure:4370: result: GNU
  98. configure:4441: checking for gcc
  99. configure:4468: result: gcc -m32
  100. configure:4697: checking for C compiler version
  101. configure:4706: gcc -m32 --version >&5
  102. gcc (GCC) 4.6.2 20120120 (prerelease)
  103. Copyright (C) 2011 Free Software Foundation, Inc.
  104. This is free software; see the source for copying conditions.  There is NO
  105. warranty; not even for MERCHANTABILITY or FITNESS FOR A PARTICULAR PURPOSE.
  106.  
  107. configure:4717: $? = 0
  108. configure:4706: gcc -m32 -v >&5
  109. Using built-in specs.
  110. COLLECT_GCC=gcc
  111. COLLECT_LTO_WRAPPER=/usr/lib/gcc/x86_64-unknown-linux-gnu/4.6.2/lto-wrapper
  112. Target: x86_64-unknown-linux-gnu
  113. Configured with: /build/src/gcc-4.6-20120120/configure --prefix=/usr --libdir=/usr/lib --libexecdir=/usr/lib --mandir=/usr/share/man --infodir=/usr/share/info --with-bugurl=https://bugs.archlinux.org/ --enable-languages=c,c++,ada,fortran,go,lto,objc,obj-c++ --enable-shared --enable-threads=posix --with-system-zlib --enable-__cxa_atexit --disable-libunwind-exceptions --enable-clocale=gnu --disable-libstdcxx-pch --enable-libstdcxx-time --enable-gnu-unique-object --enable-linker-build-id --with-ppl --enable-cloog-backend=isl --enable-lto --enable-gold --enable-ld=default --enable-plugin --with-plugin-ld=ld.gold --enable-multilib --disable-libssp --enable-checking=release --with-fpmath=sse
  114. Thread model: posix
  115. gcc version 4.6.2 20120120 (prerelease) (GCC)
  116. configure:4717: $? = 0
  117. configure:4706: gcc -m32 -V >&5
  118. gcc: error: unrecognized option '-V'
  119. gcc: fatal error: no input files
  120. compilation terminated.
  121. configure:4717: $? = 1
  122. configure:4706: gcc -m32 -qversion >&5
  123. gcc: error: unrecognized option '-qversion'
  124. gcc: fatal error: no input files
  125. compilation terminated.
  126. configure:4717: $? = 1
  127. configure:4737: checking whether the C compiler works
  128. configure:4759: gcc -m32 -march=x86-64 -mtune=generic -O2 -pipe -fstack-protector --param=ssp-buffer-size=4 -D_FORTIFY_SOURCE=2  -Wl,-O1,--sort-common,--as-needed,-z,relro,--hash-style=gnu conftest.c  >&5
  129. configure:4763: $? = 0
  130. configure:4811: result: yes
  131. configure:4814: checking for C compiler default output file name
  132. configure:4816: result: a.out
  133. configure:4822: checking for suffix of executables
  134. configure:4829: gcc -m32 -o conftest -march=x86-64 -mtune=generic -O2 -pipe -fstack-protector --param=ssp-buffer-size=4 -D_FORTIFY_SOURCE=2  -Wl,-O1,--sort-common,--as-needed,-z,relro,--hash-style=gnu conftest.c  >&5
  135. configure:4833: $? = 0
  136. configure:4855: result:
  137. configure:4877: checking whether we are cross compiling
  138. configure:4885: gcc -m32 -o conftest -march=x86-64 -mtune=generic -O2 -pipe -fstack-protector --param=ssp-buffer-size=4 -D_FORTIFY_SOURCE=2  -Wl,-O1,--sort-common,--as-needed,-z,relro,--hash-style=gnu conftest.c  >&5
  139. configure:4889: $? = 0
  140. configure:4896: ./conftest
  141. configure:4900: $? = 0
  142. configure:4915: result: no
  143. configure:4920: checking for suffix of object files
  144. configure:4942: gcc -m32 -c -march=x86-64 -mtune=generic -O2 -pipe -fstack-protector --param=ssp-buffer-size=4 -D_FORTIFY_SOURCE=2  conftest.c >&5
  145. configure:4946: $? = 0
  146. configure:4967: result: o
  147. configure:4971: checking whether we are using the GNU C compiler
  148. configure:4990: gcc -m32 -c -march=x86-64 -mtune=generic -O2 -pipe -fstack-protector --param=ssp-buffer-size=4 -D_FORTIFY_SOURCE=2  conftest.c >&5
  149. configure:4990: $? = 0
  150. configure:4999: result: yes
  151. configure:5008: checking whether gcc -m32 accepts -g
  152. configure:5028: gcc -m32 -c -g  conftest.c >&5
  153. configure:5028: $? = 0
  154. configure:5069: result: yes
  155. configure:5086: checking for gcc -m32 option to accept ISO C89
  156. configure:5150: gcc -m32  -c -march=x86-64 -mtune=generic -O2 -pipe -fstack-protector --param=ssp-buffer-size=4 -D_FORTIFY_SOURCE=2  conftest.c >&5
  157. configure:5150: $? = 0
  158. configure:5163: result: none needed
  159. configure:5185: checking dependency style of gcc -m32
  160. configure:5296: result: gcc3
  161. configure:5311: checking for a sed that does not truncate output
  162. configure:5375: result: /bin/sed
  163. configure:5393: checking for grep that handles long lines and -e
  164. configure:5451: result: /bin/grep
  165. configure:5456: checking for egrep
  166. configure:5518: result: /bin/grep -E
  167. configure:5523: checking for fgrep
  168. configure:5585: result: /bin/grep -F
  169. configure:5620: checking for ld used by gcc -m32
  170. configure:5687: result: /usr/bin/ld
  171. configure:5694: checking if the linker (/usr/bin/ld) is GNU ld
  172. configure:5709: result: yes
  173. configure:5721: checking for BSD- or MS-compatible name lister (nm)
  174. configure:5770: result: /usr/bin/nm -B
  175. configure:5900: checking the name lister (/usr/bin/nm -B) interface
  176. configure:5907: gcc -m32 -c -march=x86-64 -mtune=generic -O2 -pipe -fstack-protector --param=ssp-buffer-size=4 -D_FORTIFY_SOURCE=2  conftest.c >&5
  177. configure:5910: /usr/bin/nm -B "conftest.o"
  178. configure:5913: output
  179. 00000000 B some_variable
  180. configure:5920: result: BSD nm
  181. configure:5923: checking whether ln -s works
  182. configure:5927: result: yes
  183. configure:5935: checking the maximum length of command line arguments
  184. configure:6060: result: 1572864
  185. configure:6077: checking whether the shell understands some XSI constructs
  186. configure:6087: result: yes
  187. configure:6091: checking whether the shell understands "+="
  188. configure:6097: result: yes
  189. configure:6132: checking how to convert x86_64-unknown-linux-gnu file names to x86_64-unknown-linux-gnu format
  190. configure:6172: result: func_convert_file_noop
  191. configure:6179: checking how to convert x86_64-unknown-linux-gnu file names to toolchain format
  192. configure:6199: result: func_convert_file_noop
  193. configure:6206: checking for /usr/bin/ld option to reload object files
  194. configure:6213: result: -r
  195. configure:6287: checking for objdump
  196. configure:6314: result: objdump
  197. configure:6343: checking how to recognize dependent libraries
  198. configure:6545: result: pass_all
  199. configure:6630: checking for dlltool
  200. configure:6657: result: dlltool
  201. configure:6687: checking how to associate runtime and link libraries
  202. configure:6714: result: printf %s\n
  203. configure:6775: checking for ar
  204. configure:6791: found /usr/bin/ar
  205. configure:6802: result: ar
  206. configure:6839: checking for archiver @FILE support
  207. configure:6856: gcc -m32 -c -march=x86-64 -mtune=generic -O2 -pipe -fstack-protector --param=ssp-buffer-size=4 -D_FORTIFY_SOURCE=2  conftest.c >&5
  208. configure:6856: $? = 0
  209. configure:6859: ar cru libconftest.a @conftest.lst >&5
  210. configure:6862: $? = 0
  211. configure:6867: ar cru libconftest.a @conftest.lst >&5
  212. ar: conftest.o: No such file or directory
  213. configure:6870: $? = 1
  214. configure:6882: result: @
  215. configure:6940: checking for strip
  216. configure:6956: found /usr/bin/strip
  217. configure:6967: result: strip
  218. configure:7039: checking for ranlib
  219. configure:7055: found /usr/bin/ranlib
  220. configure:7066: result: ranlib
  221. configure:7168: checking command to parse /usr/bin/nm -B output from gcc -m32 object
  222. configure:7287: gcc -m32 -c -march=x86-64 -mtune=generic -O2 -pipe -fstack-protector --param=ssp-buffer-size=4 -D_FORTIFY_SOURCE=2  conftest.c >&5
  223. configure:7290: $? = 0
  224. configure:7294: /usr/bin/nm -B conftest.o \| sed -n -e 's/^.*[ ]\([ABCDGIRSTW][ABCDGIRSTW]*\)[ ][ ]*\([_A-Za-z][_A-Za-z0-9]*\)$/\1 \2 \2/p' | sed '/ __gnu_lto/d' \> conftest.nm
  225. configure:7297: $? = 0
  226. configure:7363: gcc -m32 -o conftest -march=x86-64 -mtune=generic -O2 -pipe -fstack-protector --param=ssp-buffer-size=4 -D_FORTIFY_SOURCE=2  -Wl,-O1,--sort-common,--as-needed,-z,relro,--hash-style=gnu conftest.c conftstm.o >&5
  227. configure:7366: $? = 0
  228. configure:7404: result: ok
  229. configure:7441: checking for sysroot
  230. configure:7471: result: no
  231. configure:7548: gcc -m32 -c -march=x86-64 -mtune=generic -O2 -pipe -fstack-protector --param=ssp-buffer-size=4 -D_FORTIFY_SOURCE=2  conftest.c >&5
  232. configure:7551: $? = 0
  233. configure:7714: checking for mt
  234. configure:7744: result: no
  235. configure:7764: checking if : is a manifest tool
  236. configure:7770: : '-?'
  237. configure:7778: result: no
  238. configure:8410: checking how to run the C preprocessor
  239. configure:8441: gcc -m32 -E  conftest.c
  240. configure:8441: $? = 0
  241. configure:8455: gcc -m32 -E  conftest.c
  242. conftest.c:11:28: fatal error: ac_nonexistent.h: No such file or directory
  243. compilation terminated.
  244. configure:8455: $? = 1
  245. configure: failed program was:
  246. | /* confdefs.h */
  247. | #define PACKAGE_NAME "GStreamer Base Plug-ins"
  248. | #define PACKAGE_TARNAME "gst-plugins-base"
  249. | #define PACKAGE_VERSION "0.10.35"
  250. | #define PACKAGE_STRING "GStreamer Base Plug-ins 0.10.35"
  251. | #define PACKAGE_BUGREPORT "http://bugzilla.gnome.org/enter_bug.cgi?product=GStreamer"
  252. | #define PACKAGE_URL ""
  253. | #define PACKAGE "gst-plugins-base"
  254. | #define VERSION "0.10.35"
  255. | /* end confdefs.h.  */
  256. | #include <ac_nonexistent.h>
  257. configure:8480: result: gcc -m32 -E
  258. configure:8500: gcc -m32 -E  conftest.c
  259. configure:8500: $? = 0
  260. configure:8514: gcc -m32 -E  conftest.c
  261. conftest.c:11:28: fatal error: ac_nonexistent.h: No such file or directory
  262. compilation terminated.
  263. configure:8514: $? = 1
  264. configure: failed program was:
  265. | /* confdefs.h */
  266. | #define PACKAGE_NAME "GStreamer Base Plug-ins"
  267. | #define PACKAGE_TARNAME "gst-plugins-base"
  268. | #define PACKAGE_VERSION "0.10.35"
  269. | #define PACKAGE_STRING "GStreamer Base Plug-ins 0.10.35"
  270. | #define PACKAGE_BUGREPORT "http://bugzilla.gnome.org/enter_bug.cgi?product=GStreamer"
  271. | #define PACKAGE_URL ""
  272. | #define PACKAGE "gst-plugins-base"
  273. | #define VERSION "0.10.35"
  274. | /* end confdefs.h.  */
  275. | #include <ac_nonexistent.h>
  276. configure:8543: checking for ANSI C header files
  277. configure:8563: gcc -m32 -c -march=x86-64 -mtune=generic -O2 -pipe -fstack-protector --param=ssp-buffer-size=4 -D_FORTIFY_SOURCE=2  conftest.c >&5
  278. configure:8563: $? = 0
  279. configure:8636: gcc -m32 -o conftest -march=x86-64 -mtune=generic -O2 -pipe -fstack-protector --param=ssp-buffer-size=4 -D_FORTIFY_SOURCE=2  -Wl,-O1,--sort-common,--as-needed,-z,relro,--hash-style=gnu conftest.c  >&5
  280. configure:8636: $? = 0
  281. configure:8636: ./conftest
  282. configure:8636: $? = 0
  283. configure:8647: result: yes
  284. configure:8660: checking for sys/types.h
  285. configure:8660: gcc -m32 -c -march=x86-64 -mtune=generic -O2 -pipe -fstack-protector --param=ssp-buffer-size=4 -D_FORTIFY_SOURCE=2  conftest.c >&5
  286. configure:8660: $? = 0
  287. configure:8660: result: yes
  288. configure:8660: checking for sys/stat.h
  289. configure:8660: gcc -m32 -c -march=x86-64 -mtune=generic -O2 -pipe -fstack-protector --param=ssp-buffer-size=4 -D_FORTIFY_SOURCE=2  conftest.c >&5
  290. configure:8660: $? = 0
  291. configure:8660: result: yes
  292. configure:8660: checking for stdlib.h
  293. configure:8660: gcc -m32 -c -march=x86-64 -mtune=generic -O2 -pipe -fstack-protector --param=ssp-buffer-size=4 -D_FORTIFY_SOURCE=2  conftest.c >&5
  294. configure:8660: $? = 0
  295. configure:8660: result: yes
  296. configure:8660: checking for string.h
  297. configure:8660: gcc -m32 -c -march=x86-64 -mtune=generic -O2 -pipe -fstack-protector --param=ssp-buffer-size=4 -D_FORTIFY_SOURCE=2  conftest.c >&5
  298. configure:8660: $? = 0
  299. configure:8660: result: yes
  300. configure:8660: checking for memory.h
  301. configure:8660: gcc -m32 -c -march=x86-64 -mtune=generic -O2 -pipe -fstack-protector --param=ssp-buffer-size=4 -D_FORTIFY_SOURCE=2  conftest.c >&5
  302. configure:8660: $? = 0
  303. configure:8660: result: yes
  304. configure:8660: checking for strings.h
  305. configure:8660: gcc -m32 -c -march=x86-64 -mtune=generic -O2 -pipe -fstack-protector --param=ssp-buffer-size=4 -D_FORTIFY_SOURCE=2  conftest.c >&5
  306. configure:8660: $? = 0
  307. configure:8660: result: yes
  308. configure:8660: checking for inttypes.h
  309. configure:8660: gcc -m32 -c -march=x86-64 -mtune=generic -O2 -pipe -fstack-protector --param=ssp-buffer-size=4 -D_FORTIFY_SOURCE=2  conftest.c >&5
  310. configure:8660: $? = 0
  311. configure:8660: result: yes
  312. configure:8660: checking for stdint.h
  313. configure:8660: gcc -m32 -c -march=x86-64 -mtune=generic -O2 -pipe -fstack-protector --param=ssp-buffer-size=4 -D_FORTIFY_SOURCE=2  conftest.c >&5
  314. configure:8660: $? = 0
  315. configure:8660: result: yes
  316. configure:8660: checking for unistd.h
  317. configure:8660: gcc -m32 -c -march=x86-64 -mtune=generic -O2 -pipe -fstack-protector --param=ssp-buffer-size=4 -D_FORTIFY_SOURCE=2  conftest.c >&5
  318. configure:8660: $? = 0
  319. configure:8660: result: yes
  320. configure:8674: checking for dlfcn.h
  321. configure:8674: gcc -m32 -c -march=x86-64 -mtune=generic -O2 -pipe -fstack-protector --param=ssp-buffer-size=4 -D_FORTIFY_SOURCE=2  conftest.c >&5
  322. configure:8674: $? = 0
  323. configure:8674: result: yes
  324. configure:8857: checking for objdir
  325. configure:8872: result: .libs
  326. configure:9143: checking if gcc -m32 supports -fno-rtti -fno-exceptions
  327. configure:9161: gcc -m32 -c -march=x86-64 -mtune=generic -O2 -pipe -fstack-protector --param=ssp-buffer-size=4 -D_FORTIFY_SOURCE=2  -fno-rtti -fno-exceptions conftest.c >&5
  328. cc1: warning: command line option '-fno-rtti' is valid for C++/ObjC++ but not for C [enabled by default]
  329. configure:9165: $? = 0
  330. configure:9178: result: no
  331. configure:9488: checking for gcc -m32 option to produce PIC
  332. configure:9495: result: -fPIC -DPIC
  333. configure:9503: checking if gcc -m32 PIC flag -fPIC -DPIC works
  334. configure:9521: gcc -m32 -c -march=x86-64 -mtune=generic -O2 -pipe -fstack-protector --param=ssp-buffer-size=4 -D_FORTIFY_SOURCE=2  -fPIC -DPIC -DPIC conftest.c >&5
  335. configure:9525: $? = 0
  336. configure:9538: result: yes
  337. configure:9567: checking if gcc -m32 static flag -static works
  338. configure:9595: result: yes
  339. configure:9610: checking if gcc -m32 supports -c -o file.o
  340. configure:9631: gcc -m32 -c -march=x86-64 -mtune=generic -O2 -pipe -fstack-protector --param=ssp-buffer-size=4 -D_FORTIFY_SOURCE=2  -o out/conftest2.o conftest.c >&5
  341. configure:9635: $? = 0
  342. configure:9657: result: yes
  343. configure:9665: checking if gcc -m32 supports -c -o file.o
  344. configure:9712: result: yes
  345. configure:9745: checking whether the gcc -m32 linker (/usr/bin/ld -m elf_i386) supports shared libraries
  346. configure:10907: result: yes
  347. configure:10944: checking whether -lc should be explicitly linked in
  348. configure:10952: gcc -m32 -c -march=x86-64 -mtune=generic -O2 -pipe -fstack-protector --param=ssp-buffer-size=4 -D_FORTIFY_SOURCE=2  conftest.c >&5
  349. configure:10955: $? = 0
  350. configure:10970: gcc -m32 -shared  -fPIC -DPIC conftest.o  -v -Wl,-soname -Wl,conftest -o conftest 2\>\&1 \| /bin/grep  -lc  \>/dev/null 2\>\&1
  351. configure:10973: $? = 0
  352. configure:10987: result: no
  353. configure:11152: checking dynamic linker characteristics
  354. configure:11667: gcc -m32 -o conftest -march=x86-64 -mtune=generic -O2 -pipe -fstack-protector --param=ssp-buffer-size=4 -D_FORTIFY_SOURCE=2  -Wl,-O1,--sort-common,--as-needed,-z,relro,--hash-style=gnu -Wl,-rpath -Wl,/foo conftest.c  >&5
  355. configure:11667: $? = 0
  356. configure:11901: result: GNU/Linux ld.so
  357. configure:12008: checking how to hardcode library paths into programs
  358. configure:12033: result: immediate
  359. configure:12127: checking for shl_load
  360. configure:12127: gcc -m32 -o conftest -march=x86-64 -mtune=generic -O2 -pipe -fstack-protector --param=ssp-buffer-size=4 -D_FORTIFY_SOURCE=2  -Wl,-O1,--sort-common,--as-needed,-z,relro,--hash-style=gnu conftest.c  >&5
  361. /tmp/ccZhddsO.o: In function `main':
  362. conftest.c:(.text.startup+0x7): undefined reference to `shl_load'
  363. collect2: ld returned 1 exit status
  364. configure:12127: $? = 1
  365. configure: failed program was:
  366. | /* confdefs.h */
  367. | #define PACKAGE_NAME "GStreamer Base Plug-ins"
  368. | #define PACKAGE_TARNAME "gst-plugins-base"
  369. | #define PACKAGE_VERSION "0.10.35"
  370. | #define PACKAGE_STRING "GStreamer Base Plug-ins 0.10.35"
  371. | #define PACKAGE_BUGREPORT "http://bugzilla.gnome.org/enter_bug.cgi?product=GStreamer"
  372. | #define PACKAGE_URL ""
  373. | #define PACKAGE "gst-plugins-base"
  374. | #define VERSION "0.10.35"
  375. | #define STDC_HEADERS 1
  376. | #define HAVE_SYS_TYPES_H 1
  377. | #define HAVE_SYS_STAT_H 1
  378. | #define HAVE_STDLIB_H 1
  379. | #define HAVE_STRING_H 1
  380. | #define HAVE_MEMORY_H 1
  381. | #define HAVE_STRINGS_H 1
  382. | #define HAVE_INTTYPES_H 1
  383. | #define HAVE_STDINT_H 1
  384. | #define HAVE_UNISTD_H 1
  385. | #define HAVE_DLFCN_H 1
  386. | #define LT_OBJDIR ".libs/"
  387. | /* end confdefs.h.  */
  388. | /* Define shl_load to an innocuous variant, in case <limits.h> declares shl_load.
  389. |    For example, HP-UX 11i <limits.h> declares gettimeofday.  */
  390. | #define shl_load innocuous_shl_load
  391. |
  392. | /* System header to define __stub macros and hopefully few prototypes,
  393. |     which can conflict with char shl_load (); below.
  394. |     Prefer <limits.h> to <assert.h> if __STDC__ is defined, since
  395. |     <limits.h> exists even on freestanding compilers.  */
  396. |
  397. | #ifdef __STDC__
  398. | # include <limits.h>
  399. | #else
  400. | # include <assert.h>
  401. | #endif
  402. |
  403. | #undef shl_load
  404. |
  405. | /* Override any GCC internal prototype to avoid an error.
  406. |    Use char because int might match the return type of a GCC
  407. |    builtin and then its argument prototype would still apply.  */
  408. | #ifdef __cplusplus
  409. | extern "C"
  410. | #endif
  411. | char shl_load ();
  412. | /* The GNU C library defines this for functions which it implements
  413. |     to always fail with ENOSYS.  Some functions are actually named
  414. |     something starting with __ and the normal name is an alias.  */
  415. | #if defined __stub_shl_load || defined __stub___shl_load
  416. | choke me
  417. | #endif
  418. |
  419. | int
  420. | main ()
  421. | {
  422. | return shl_load ();
  423. |   ;
  424. |   return 0;
  425. | }
  426. configure:12127: result: no
  427. configure:12131: checking for shl_load in -ldld
  428. configure:12156: gcc -m32 -o conftest -march=x86-64 -mtune=generic -O2 -pipe -fstack-protector --param=ssp-buffer-size=4 -D_FORTIFY_SOURCE=2  -Wl,-O1,--sort-common,--as-needed,-z,relro,--hash-style=gnu conftest.c -ldld   >&5
  429. /usr/bin/ld: cannot find -ldld
  430. collect2: ld returned 1 exit status
  431. configure:12156: $? = 1
  432. configure: failed program was:
  433. | /* confdefs.h */
  434. | #define PACKAGE_NAME "GStreamer Base Plug-ins"
  435. | #define PACKAGE_TARNAME "gst-plugins-base"
  436. | #define PACKAGE_VERSION "0.10.35"
  437. | #define PACKAGE_STRING "GStreamer Base Plug-ins 0.10.35"
  438. | #define PACKAGE_BUGREPORT "http://bugzilla.gnome.org/enter_bug.cgi?product=GStreamer"
  439. | #define PACKAGE_URL ""
  440. | #define PACKAGE "gst-plugins-base"
  441. | #define VERSION "0.10.35"
  442. | #define STDC_HEADERS 1
  443. | #define HAVE_SYS_TYPES_H 1
  444. | #define HAVE_SYS_STAT_H 1
  445. | #define HAVE_STDLIB_H 1
  446. | #define HAVE_STRING_H 1
  447. | #define HAVE_MEMORY_H 1
  448. | #define HAVE_STRINGS_H 1
  449. | #define HAVE_INTTYPES_H 1
  450. | #define HAVE_STDINT_H 1
  451. | #define HAVE_UNISTD_H 1
  452. | #define HAVE_DLFCN_H 1
  453. | #define LT_OBJDIR ".libs/"
  454. | /* end confdefs.h.  */
  455. |
  456. | /* Override any GCC internal prototype to avoid an error.
  457. |    Use char because int might match the return type of a GCC
  458. |    builtin and then its argument prototype would still apply.  */
  459. | #ifdef __cplusplus
  460. | extern "C"
  461. | #endif
  462. | char shl_load ();
  463. | int
  464. | main ()
  465. | {
  466. | return shl_load ();
  467. |   ;
  468. |   return 0;
  469. | }
  470. configure:12165: result: no
  471. configure:12170: checking for dlopen
  472. configure:12170: gcc -m32 -o conftest -march=x86-64 -mtune=generic -O2 -pipe -fstack-protector --param=ssp-buffer-size=4 -D_FORTIFY_SOURCE=2  -Wl,-O1,--sort-common,--as-needed,-z,relro,--hash-style=gnu conftest.c  >&5
  473. /tmp/ccxkHlsT.o: In function `main':
  474. conftest.c:(.text.startup+0x7): undefined reference to `dlopen'
  475. collect2: ld returned 1 exit status
  476. configure:12170: $? = 1
  477. configure: failed program was:
  478. | /* confdefs.h */
  479. | #define PACKAGE_NAME "GStreamer Base Plug-ins"
  480. | #define PACKAGE_TARNAME "gst-plugins-base"
  481. | #define PACKAGE_VERSION "0.10.35"
  482. | #define PACKAGE_STRING "GStreamer Base Plug-ins 0.10.35"
  483. | #define PACKAGE_BUGREPORT "http://bugzilla.gnome.org/enter_bug.cgi?product=GStreamer"
  484. | #define PACKAGE_URL ""
  485. | #define PACKAGE "gst-plugins-base"
  486. | #define VERSION "0.10.35"
  487. | #define STDC_HEADERS 1
  488. | #define HAVE_SYS_TYPES_H 1
  489. | #define HAVE_SYS_STAT_H 1
  490. | #define HAVE_STDLIB_H 1
  491. | #define HAVE_STRING_H 1
  492. | #define HAVE_MEMORY_H 1
  493. | #define HAVE_STRINGS_H 1
  494. | #define HAVE_INTTYPES_H 1
  495. | #define HAVE_STDINT_H 1
  496. | #define HAVE_UNISTD_H 1
  497. | #define HAVE_DLFCN_H 1
  498. | #define LT_OBJDIR ".libs/"
  499. | /* end confdefs.h.  */
  500. | /* Define dlopen to an innocuous variant, in case <limits.h> declares dlopen.
  501. |    For example, HP-UX 11i <limits.h> declares gettimeofday.  */
  502. | #define dlopen innocuous_dlopen
  503. |
  504. | /* System header to define __stub macros and hopefully few prototypes,
  505. |     which can conflict with char dlopen (); below.
  506. |     Prefer <limits.h> to <assert.h> if __STDC__ is defined, since
  507. |     <limits.h> exists even on freestanding compilers.  */
  508. |
  509. | #ifdef __STDC__
  510. | # include <limits.h>
  511. | #else
  512. | # include <assert.h>
  513. | #endif
  514. |
  515. | #undef dlopen
  516. |
  517. | /* Override any GCC internal prototype to avoid an error.
  518. |    Use char because int might match the return type of a GCC
  519. |    builtin and then its argument prototype would still apply.  */
  520. | #ifdef __cplusplus
  521. | extern "C"
  522. | #endif
  523. | char dlopen ();
  524. | /* The GNU C library defines this for functions which it implements
  525. |     to always fail with ENOSYS.  Some functions are actually named
  526. |     something starting with __ and the normal name is an alias.  */
  527. | #if defined __stub_dlopen || defined __stub___dlopen
  528. | choke me
  529. | #endif
  530. |
  531. | int
  532. | main ()
  533. | {
  534. | return dlopen ();
  535. |   ;
  536. |   return 0;
  537. | }
  538. configure:12170: result: no
  539. configure:12174: checking for dlopen in -ldl
  540. configure:12199: gcc -m32 -o conftest -march=x86-64 -mtune=generic -O2 -pipe -fstack-protector --param=ssp-buffer-size=4 -D_FORTIFY_SOURCE=2  -Wl,-O1,--sort-common,--as-needed,-z,relro,--hash-style=gnu conftest.c -ldl   >&5
  541. configure:12199: $? = 0
  542. configure:12208: result: yes
  543. configure:12327: checking whether a program can dlopen itself
  544. configure:12407: gcc -m32 -o conftest -march=x86-64 -mtune=generic -O2 -pipe -fstack-protector --param=ssp-buffer-size=4 -D_FORTIFY_SOURCE=2  -DHAVE_DLFCN_H -Wl,-O1,--sort-common,--as-needed,-z,relro,--hash-style=gnu -Wl,--export-dynamic conftest.c -ldl  >&5
  545. configure:12410: $? = 0
  546. configure:12428: result: yes
  547. configure:12433: checking whether a statically linked program can dlopen itself
  548. configure:12513: gcc -m32 -o conftest -march=x86-64 -mtune=generic -O2 -pipe -fstack-protector --param=ssp-buffer-size=4 -D_FORTIFY_SOURCE=2  -DHAVE_DLFCN_H -Wl,-O1,--sort-common,--as-needed,-z,relro,--hash-style=gnu -Wl,--export-dynamic -static conftest.c -ldl  >&5
  549. /tmp/ccGJoxI7.o: In function `main':
  550. conftest.c:(.text.startup+0x1a): warning: Using 'dlopen' in statically linked applications requires at runtime the shared libraries from the glibc version used for linking
  551. /usr/bin/ld: dynamic STT_GNU_IFUNC symbol `strcmp' with pointer equality in `/usr/lib/gcc/x86_64-unknown-linux-gnu/4.6.2/../../../../lib32/libc.a(strcmp.o)' can not be used when making an executable; recompile with -fPIE and relink with -pie
  552. collect2: ld returned 1 exit status
  553. configure:12516: $? = 1
  554. configure:12534: result: no
  555. configure:12573: checking whether stripping libraries is possible
  556. configure:12578: result: yes
  557. configure:12613: checking if libtool supports shared libraries
  558. configure:12615: result: yes
  559. configure:12618: checking whether to build shared libraries
  560. configure:12639: result: yes
  561. configure:12642: checking whether to build static libraries
  562. configure:12646: result: no
  563. configure:12748: checking whether NLS is requested
  564. configure:12757: result: yes
  565. configure:12798: checking for msgfmt
  566. configure: trying /usr/bin/msgfmt...
  567. 0 translated messages.
  568. configure:12830: result: /usr/bin/msgfmt
  569. configure:12839: checking for gmsgfmt
  570. configure:12870: result: /usr/bin/msgfmt
  571. configure:12921: checking for xgettext
  572. configure: trying /usr/bin/xgettext...
  573. /usr/bin/xgettext: warning: file `/dev/null' extension `' is unknown; will try C
  574. configure:12953: result: /usr/bin/xgettext
  575. configure:12999: checking for msgmerge
  576. configure: trying /usr/bin/msgmerge...
  577. configure:13030: result: /usr/bin/msgmerge
  578. configure:13087: checking for ld used by GCC
  579. configure:13151: result: /usr/bin/ld -m elf_i386
  580. configure:13158: checking if the linker (/usr/bin/ld -m elf_i386) is GNU ld
  581. configure:13171: result: yes
  582. configure:13178: checking for shared library run path origin
  583. configure:13191: result: done
  584. configure:13692: checking for CFPreferencesCopyAppValue
  585. configure:13710: gcc -m32 -o conftest -march=x86-64 -mtune=generic -O2 -pipe -fstack-protector --param=ssp-buffer-size=4 -D_FORTIFY_SOURCE=2  -Wl,-O1,--sort-common,--as-needed,-z,relro,--hash-style=gnu conftest.c  -Wl,-framework -Wl,CoreFoundation >&5
  586. conftest.c:23:42: fatal error: CoreFoundation/CFPreferences.h: No such file or directory
  587. compilation terminated.
  588. configure:13710: $? = 1
  589. configure: failed program was:
  590. | /* confdefs.h */
  591. | #define PACKAGE_NAME "GStreamer Base Plug-ins"
  592. | #define PACKAGE_TARNAME "gst-plugins-base"
  593. | #define PACKAGE_VERSION "0.10.35"
  594. | #define PACKAGE_STRING "GStreamer Base Plug-ins 0.10.35"
  595. | #define PACKAGE_BUGREPORT "http://bugzilla.gnome.org/enter_bug.cgi?product=GStreamer"
  596. | #define PACKAGE_URL ""
  597. | #define PACKAGE "gst-plugins-base"
  598. | #define VERSION "0.10.35"
  599. | #define STDC_HEADERS 1
  600. | #define HAVE_SYS_TYPES_H 1
  601. | #define HAVE_SYS_STAT_H 1
  602. | #define HAVE_STDLIB_H 1
  603. | #define HAVE_STRING_H 1
  604. | #define HAVE_MEMORY_H 1
  605. | #define HAVE_STRINGS_H 1
  606. | #define HAVE_INTTYPES_H 1
  607. | #define HAVE_STDINT_H 1
  608. | #define HAVE_UNISTD_H 1
  609. | #define HAVE_DLFCN_H 1
  610. | #define LT_OBJDIR ".libs/"
  611. | /* end confdefs.h.  */
  612. | #include <CoreFoundation/CFPreferences.h>
  613. | int
  614. | main ()
  615. | {
  616. | CFPreferencesCopyAppValue(NULL, NULL)
  617. |   ;
  618. |   return 0;
  619. | }
  620. configure:13719: result: no
  621. configure:13726: checking for CFLocaleCopyCurrent
  622. configure:13744: gcc -m32 -o conftest -march=x86-64 -mtune=generic -O2 -pipe -fstack-protector --param=ssp-buffer-size=4 -D_FORTIFY_SOURCE=2  -Wl,-O1,--sort-common,--as-needed,-z,relro,--hash-style=gnu conftest.c  -Wl,-framework -Wl,CoreFoundation >&5
  623. conftest.c:23:37: fatal error: CoreFoundation/CFLocale.h: No such file or directory
  624. compilation terminated.
  625. configure:13744: $? = 1
  626. configure: failed program was:
  627. | /* confdefs.h */
  628. | #define PACKAGE_NAME "GStreamer Base Plug-ins"
  629. | #define PACKAGE_TARNAME "gst-plugins-base"
  630. | #define PACKAGE_VERSION "0.10.35"
  631. | #define PACKAGE_STRING "GStreamer Base Plug-ins 0.10.35"
  632. | #define PACKAGE_BUGREPORT "http://bugzilla.gnome.org/enter_bug.cgi?product=GStreamer"
  633. | #define PACKAGE_URL ""
  634. | #define PACKAGE "gst-plugins-base"
  635. | #define VERSION "0.10.35"
  636. | #define STDC_HEADERS 1
  637. | #define HAVE_SYS_TYPES_H 1
  638. | #define HAVE_SYS_STAT_H 1
  639. | #define HAVE_STDLIB_H 1
  640. | #define HAVE_STRING_H 1
  641. | #define HAVE_MEMORY_H 1
  642. | #define HAVE_STRINGS_H 1
  643. | #define HAVE_INTTYPES_H 1
  644. | #define HAVE_STDINT_H 1
  645. | #define HAVE_UNISTD_H 1
  646. | #define HAVE_DLFCN_H 1
  647. | #define LT_OBJDIR ".libs/"
  648. | /* end confdefs.h.  */
  649. | #include <CoreFoundation/CFLocale.h>
  650. | int
  651. | main ()
  652. | {
  653. | CFLocaleCopyCurrent();
  654. |   ;
  655. |   return 0;
  656. | }
  657. configure:13753: result: no
  658. configure:13802: checking for GNU gettext in libc
  659. configure:13822: gcc -m32 -o conftest -march=x86-64 -mtune=generic -O2 -pipe -fstack-protector --param=ssp-buffer-size=4 -D_FORTIFY_SOURCE=2  -Wl,-O1,--sort-common,--as-needed,-z,relro,--hash-style=gnu conftest.c  >&5
  660. configure:13822: $? = 0
  661. configure:13831: result: yes
  662. configure:14577: checking whether to use NLS
  663. configure:14579: result: yes
  664. configure:14582: checking where the gettext function comes from
  665. configure:14593: result: libc
  666. configure:14776: checking for pkg-config
  667. configure:14794: found /usr/bin/pkg-config
  668. configure:14806: result: /usr/bin/pkg-config
  669. configure:14831: checking pkg-config is at least version 0.9.0
  670. configure:14834: result: yes
  671. configure:14860: checking for VALGRIND
  672. configure:14868: $PKG_CONFIG --exists --print-errors "valgrind >= $VALGRIND_REQ"
  673. Package valgrind was not found in the pkg-config search path.
  674. Perhaps you should add the directory containing `valgrind.pc'
  675. to the PKG_CONFIG_PATH environment variable
  676. No package 'valgrind' found
  677. configure:14871: $? = 1
  678. configure:14886: $PKG_CONFIG --exists --print-errors "valgrind >= $VALGRIND_REQ"
  679. Package valgrind was not found in the pkg-config search path.
  680. Perhaps you should add the directory containing `valgrind.pc'
  681. to the PKG_CONFIG_PATH environment variable
  682. No package 'valgrind' found
  683. configure:14889: $? = 1
  684. No package 'valgrind' found
  685. configure:14917: result: no
  686. configure:14921: result: no
  687. configure:15138: Using GStreamer Base Plugins (Archlinux) as package name
  688. configure:15162: Using http://www.archlinux.org/ as package origin
  689. configure:15178: Using GST_PKG_CONFIG_PATH = $(top_builddir)/pkgconfig:/usr/lib32/pkgconfig
  690. configure:15226: Using /usr/libexec/gst-install-plugins-helper as plugin install helper
  691. configure:15254: *** checking feature: building of plug-ins with external deps ***
  692. configure:15309: building external plug-ins
  693. configure:15352: *** checking feature: building of experimental plug-ins ***
  694. configure:15407: WARNING: building experimental plug-ins
  695. configure:15567: checking whether byte ordering is bigendian
  696. configure:15582: gcc -m32 -c -march=x86-64 -mtune=generic -O2 -pipe -fstack-protector --param=ssp-buffer-size=4 -D_FORTIFY_SOURCE=2  conftest.c >&5
  697. conftest.c:35:9: error: unknown type name 'not'
  698. conftest.c:35:15: error: expected '=', ',', ';', 'asm' or '__attribute__' before 'universal'
  699. conftest.c:35:15: error: unknown type name 'universal'
  700. configure:15582: $? = 1
  701. configure: failed program was:
  702. | /* confdefs.h */
  703. | #define PACKAGE_NAME "GStreamer Base Plug-ins"
  704. | #define PACKAGE_TARNAME "gst-plugins-base"
  705. | #define PACKAGE_VERSION "0.10.35"
  706. | #define PACKAGE_STRING "GStreamer Base Plug-ins 0.10.35"
  707. | #define PACKAGE_BUGREPORT "http://bugzilla.gnome.org/enter_bug.cgi?product=GStreamer"
  708. | #define PACKAGE_URL ""
  709. | #define PACKAGE "gst-plugins-base"
  710. | #define VERSION "0.10.35"
  711. | #define STDC_HEADERS 1
  712. | #define HAVE_SYS_TYPES_H 1
  713. | #define HAVE_SYS_STAT_H 1
  714. | #define HAVE_STDLIB_H 1
  715. | #define HAVE_STRING_H 1
  716. | #define HAVE_MEMORY_H 1
  717. | #define HAVE_STRINGS_H 1
  718. | #define HAVE_INTTYPES_H 1
  719. | #define HAVE_STDINT_H 1
  720. | #define HAVE_UNISTD_H 1
  721. | #define HAVE_DLFCN_H 1
  722. | #define LT_OBJDIR ".libs/"
  723. | #define ENABLE_NLS 1
  724. | #define HAVE_GETTEXT 1
  725. | #define HAVE_DCGETTEXT 1
  726. | #define GETTEXT_PACKAGE "gst-plugins-base-0.10"
  727. | #define LOCALEDIR "/usr/share/locale"
  728. | #define GST_PACKAGE_NAME "GStreamer Base Plugins (Archlinux)"
  729. | #define GST_PACKAGE_ORIGIN "http://www.archlinux.org/"
  730. | #define GST_INSTALL_PLUGINS_HELPER "/usr/libexec/gst-install-plugins-helper"
  731. | #define HAVE_EXTERNAL /**/
  732. | #define HAVE_EXPERIMENTAL /**/
  733. | #define HAVE_CPU_X86_64 1
  734. | /* end confdefs.h.  */
  735. | #ifndef __APPLE_CC__
  736. |              not a universal capable compiler
  737. |            #endif
  738. |            typedef int dummy;
  739. |
  740. configure:15627: gcc -m32 -c -march=x86-64 -mtune=generic -O2 -pipe -fstack-protector --param=ssp-buffer-size=4 -D_FORTIFY_SOURCE=2  conftest.c >&5
  741. configure:15627: $? = 0
  742. configure:15645: gcc -m32 -c -march=x86-64 -mtune=generic -O2 -pipe -fstack-protector --param=ssp-buffer-size=4 -D_FORTIFY_SOURCE=2  conftest.c >&5
  743. conftest.c: In function 'main':
  744. conftest.c:41:4: error: unknown type name 'not'
  745. conftest.c:41:12: error: expected '=', ',', ';', 'asm' or '__attribute__' before 'endian'
  746. configure:15645: $? = 1
  747. configure: failed program was:
  748. | /* confdefs.h */
  749. | #define PACKAGE_NAME "GStreamer Base Plug-ins"
  750. | #define PACKAGE_TARNAME "gst-plugins-base"
  751. | #define PACKAGE_VERSION "0.10.35"
  752. | #define PACKAGE_STRING "GStreamer Base Plug-ins 0.10.35"
  753. | #define PACKAGE_BUGREPORT "http://bugzilla.gnome.org/enter_bug.cgi?product=GStreamer"
  754. | #define PACKAGE_URL ""
  755. | #define PACKAGE "gst-plugins-base"
  756. | #define VERSION "0.10.35"
  757. | #define STDC_HEADERS 1
  758. | #define HAVE_SYS_TYPES_H 1
  759. | #define HAVE_SYS_STAT_H 1
  760. | #define HAVE_STDLIB_H 1
  761. | #define HAVE_STRING_H 1
  762. | #define HAVE_MEMORY_H 1
  763. | #define HAVE_STRINGS_H 1
  764. | #define HAVE_INTTYPES_H 1
  765. | #define HAVE_STDINT_H 1
  766. | #define HAVE_UNISTD_H 1
  767. | #define HAVE_DLFCN_H 1
  768. | #define LT_OBJDIR ".libs/"
  769. | #define ENABLE_NLS 1
  770. | #define HAVE_GETTEXT 1
  771. | #define HAVE_DCGETTEXT 1
  772. | #define GETTEXT_PACKAGE "gst-plugins-base-0.10"
  773. | #define LOCALEDIR "/usr/share/locale"
  774. | #define GST_PACKAGE_NAME "GStreamer Base Plugins (Archlinux)"
  775. | #define GST_PACKAGE_ORIGIN "http://www.archlinux.org/"
  776. | #define GST_INSTALL_PLUGINS_HELPER "/usr/libexec/gst-install-plugins-helper"
  777. | #define HAVE_EXTERNAL /**/
  778. | #define HAVE_EXPERIMENTAL /**/
  779. | #define HAVE_CPU_X86_64 1
  780. | /* end confdefs.h.  */
  781. | #include <sys/types.h>
  782. |               #include <sys/param.h>
  783. |
  784. | int
  785. | main ()
  786. | {
  787. | #if BYTE_ORDER != BIG_ENDIAN
  788. |                not big endian
  789. |               #endif
  790. |
  791. |   ;
  792. |   return 0;
  793. | }
  794. configure:15773: result: no
  795. configure:15919: checking for special C compiler options needed for large files
  796. configure:15964: result: no
  797. configure:15970: checking for _FILE_OFFSET_BITS value needed for large files
  798. configure:15995: gcc -m32 -c -march=x86-64 -mtune=generic -O2 -pipe -fstack-protector --param=ssp-buffer-size=4 -D_FORTIFY_SOURCE=2  conftest.c >&5
  799. conftest.c:41:3: warning: left shift count >= width of type [enabled by default]
  800. conftest.c:41:3: warning: left shift count >= width of type [enabled by default]
  801. conftest.c:42:10: warning: left shift count >= width of type [enabled by default]
  802. conftest.c:42:10: warning: left shift count >= width of type [enabled by default]
  803. conftest.c:41:7: error: size of array 'off_t_is_large' is negative
  804. conftest.c:43:9: warning: variably modified 'off_t_is_large' at file scope [enabled by default]
  805. configure:15995: $? = 1
  806. configure: failed program was:
  807. | /* confdefs.h */
  808. | #define PACKAGE_NAME "GStreamer Base Plug-ins"
  809. | #define PACKAGE_TARNAME "gst-plugins-base"
  810. | #define PACKAGE_VERSION "0.10.35"
  811. | #define PACKAGE_STRING "GStreamer Base Plug-ins 0.10.35"
  812. | #define PACKAGE_BUGREPORT "http://bugzilla.gnome.org/enter_bug.cgi?product=GStreamer"
  813. | #define PACKAGE_URL ""
  814. | #define PACKAGE "gst-plugins-base"
  815. | #define VERSION "0.10.35"
  816. | #define STDC_HEADERS 1
  817. | #define HAVE_SYS_TYPES_H 1
  818. | #define HAVE_SYS_STAT_H 1
  819. | #define HAVE_STDLIB_H 1
  820. | #define HAVE_STRING_H 1
  821. | #define HAVE_MEMORY_H 1
  822. | #define HAVE_STRINGS_H 1
  823. | #define HAVE_INTTYPES_H 1
  824. | #define HAVE_STDINT_H 1
  825. | #define HAVE_UNISTD_H 1
  826. | #define HAVE_DLFCN_H 1
  827. | #define LT_OBJDIR ".libs/"
  828. | #define ENABLE_NLS 1
  829. | #define HAVE_GETTEXT 1
  830. | #define HAVE_DCGETTEXT 1
  831. | #define GETTEXT_PACKAGE "gst-plugins-base-0.10"
  832. | #define LOCALEDIR "/usr/share/locale"
  833. | #define GST_PACKAGE_NAME "GStreamer Base Plugins (Archlinux)"
  834. | #define GST_PACKAGE_ORIGIN "http://www.archlinux.org/"
  835. | #define GST_INSTALL_PLUGINS_HELPER "/usr/libexec/gst-install-plugins-helper"
  836. | #define HAVE_EXTERNAL /**/
  837. | #define HAVE_EXPERIMENTAL /**/
  838. | #define HAVE_CPU_X86_64 1
  839. | #define HOST_CPU "x86_64"
  840. | /* end confdefs.h.  */
  841. | #include <sys/types.h>
  842. |  /* Check that off_t can represent 2**63 - 1 correctly.
  843. |     We can't simply define LARGE_OFF_T to be 9223372036854775807,
  844. |     since some C++ compilers masquerading as C compilers
  845. |     incorrectly reject 9223372036854775807.  */
  846. | #define LARGE_OFF_T (((off_t) 1 << 62) - 1 + ((off_t) 1 << 62))
  847. |   int off_t_is_large[(LARGE_OFF_T % 2147483629 == 721
  848. |                      && LARGE_OFF_T % 2147483647 == 1)
  849. |                     ? 1 : -1];
  850. | int
  851. | main ()
  852. | {
  853. |
  854. |   ;
  855. |   return 0;
  856. | }
  857. configure:16019: gcc -m32 -c -march=x86-64 -mtune=generic -O2 -pipe -fstack-protector --param=ssp-buffer-size=4 -D_FORTIFY_SOURCE=2  conftest.c >&5
  858. configure:16019: $? = 0
  859. configure:16027: result: 64
  860. configure:16160: checking for gcc
  861. configure:16187: result: gcc -m32
  862. configure:16416: checking for C compiler version
  863. configure:16425: gcc -m32 --version >&5
  864. gcc (GCC) 4.6.2 20120120 (prerelease)
  865. Copyright (C) 2011 Free Software Foundation, Inc.
  866. This is free software; see the source for copying conditions.  There is NO
  867. warranty; not even for MERCHANTABILITY or FITNESS FOR A PARTICULAR PURPOSE.
  868.  
  869. configure:16436: $? = 0
  870. configure:16425: gcc -m32 -v >&5
  871. Using built-in specs.
  872. COLLECT_GCC=gcc
  873. COLLECT_LTO_WRAPPER=/usr/lib/gcc/x86_64-unknown-linux-gnu/4.6.2/lto-wrapper
  874. Target: x86_64-unknown-linux-gnu
  875. Configured with: /build/src/gcc-4.6-20120120/configure --prefix=/usr --libdir=/usr/lib --libexecdir=/usr/lib --mandir=/usr/share/man --infodir=/usr/share/info --with-bugurl=https://bugs.archlinux.org/ --enable-languages=c,c++,ada,fortran,go,lto,objc,obj-c++ --enable-shared --enable-threads=posix --with-system-zlib --enable-__cxa_atexit --disable-libunwind-exceptions --enable-clocale=gnu --disable-libstdcxx-pch --enable-libstdcxx-time --enable-gnu-unique-object --enable-linker-build-id --with-ppl --enable-cloog-backend=isl --enable-lto --enable-gold --enable-ld=default --enable-plugin --with-plugin-ld=ld.gold --enable-multilib --disable-libssp --enable-checking=release --with-fpmath=sse
  876. Thread model: posix
  877. gcc version 4.6.2 20120120 (prerelease) (GCC)
  878. configure:16436: $? = 0
  879. configure:16425: gcc -m32 -V >&5
  880. gcc: error: unrecognized option '-V'
  881. gcc: fatal error: no input files
  882. compilation terminated.
  883. configure:16436: $? = 1
  884. configure:16425: gcc -m32 -qversion >&5
  885. gcc: error: unrecognized option '-qversion'
  886. gcc: fatal error: no input files
  887. compilation terminated.
  888. configure:16436: $? = 1
  889. configure:16440: checking whether we are using the GNU C compiler
  890. configure:16468: result: yes
  891. configure:16477: checking whether gcc -m32 accepts -g
  892. configure:16538: result: yes
  893. configure:16555: checking for gcc -m32 option to accept ISO C89
  894. configure:16632: result: none needed
  895. configure:16654: checking dependency style of gcc -m32
  896. configure:16765: result: gcc3
  897. configure:16784: checking for gcc -m32 option to accept ISO C99
  898. configure:16933: gcc -m32  -c -march=x86-64 -mtune=generic -O2 -pipe -fstack-protector --param=ssp-buffer-size=4 -D_FORTIFY_SOURCE=2  conftest.c >&5
  899. conftest.c:86:29: error: expected ';', ',' or ')' before 'text'
  900. conftest.c: In function 'main':
  901. conftest.c:140:18: error: expected '=', ',', ';', 'asm' or '__attribute__' before 'newvar'
  902. conftest.c:140:18: error: 'newvar' undeclared (first use in this function)
  903. conftest.c:140:18: note: each undeclared identifier is reported only once for each function it appears in
  904. conftest.c:150:3: error: 'for' loop initial declarations are only allowed in C99 mode
  905. conftest.c:150:3: note: use option -std=c99 or -std=gnu99 to compile your code
  906. configure:16933: $? = 1
  907. configure: failed program was:
  908. | /* confdefs.h */
  909. | #define PACKAGE_NAME "GStreamer Base Plug-ins"
  910. | #define PACKAGE_TARNAME "gst-plugins-base"
  911. | #define PACKAGE_VERSION "0.10.35"
  912. | #define PACKAGE_STRING "GStreamer Base Plug-ins 0.10.35"
  913. | #define PACKAGE_BUGREPORT "http://bugzilla.gnome.org/enter_bug.cgi?product=GStreamer"
  914. | #define PACKAGE_URL ""
  915. | #define PACKAGE "gst-plugins-base"
  916. | #define VERSION "0.10.35"
  917. | #define STDC_HEADERS 1
  918. | #define HAVE_SYS_TYPES_H 1
  919. | #define HAVE_SYS_STAT_H 1
  920. | #define HAVE_STDLIB_H 1
  921. | #define HAVE_STRING_H 1
  922. | #define HAVE_MEMORY_H 1
  923. | #define HAVE_STRINGS_H 1
  924. | #define HAVE_INTTYPES_H 1
  925. | #define HAVE_STDINT_H 1
  926. | #define HAVE_UNISTD_H 1
  927. | #define HAVE_DLFCN_H 1
  928. | #define LT_OBJDIR ".libs/"
  929. | #define ENABLE_NLS 1
  930. | #define HAVE_GETTEXT 1
  931. | #define HAVE_DCGETTEXT 1
  932. | #define GETTEXT_PACKAGE "gst-plugins-base-0.10"
  933. | #define LOCALEDIR "/usr/share/locale"
  934. | #define GST_PACKAGE_NAME "GStreamer Base Plugins (Archlinux)"
  935. | #define GST_PACKAGE_ORIGIN "http://www.archlinux.org/"
  936. | #define GST_INSTALL_PLUGINS_HELPER "/usr/libexec/gst-install-plugins-helper"
  937. | #define HAVE_EXTERNAL /**/
  938. | #define HAVE_EXPERIMENTAL /**/
  939. | #define HAVE_CPU_X86_64 1
  940. | #define HOST_CPU "x86_64"
  941. | #define _FILE_OFFSET_BITS 64
  942. | /* end confdefs.h.  */
  943. | #include <stdarg.h>
  944. | #include <stdbool.h>
  945. | #include <stdlib.h>
  946. | #include <wchar.h>
  947. | #include <stdio.h>
  948. |
  949. | // Check varargs macros.  These examples are taken from C99 6.10.3.5.
  950. | #define debug(...) fprintf (stderr, __VA_ARGS__)
  951. | #define showlist(...) puts (#__VA_ARGS__)
  952. | #define report(test,...) ((test) ? puts (#test) : printf (__VA_ARGS__))
  953. | static void
  954. | test_varargs_macros (void)
  955. | {
  956. |   int x = 1234;
  957. |   int y = 5678;
  958. |   debug ("Flag");
  959. |   debug ("X = %d\n", x);
  960. |   showlist (The first, second, and third items.);
  961. |   report (x>y, "x is %d but y is %d", x, y);
  962. | }
  963. |
  964. | // Check long long types.
  965. | #define BIG64 18446744073709551615ull
  966. | #define BIG32 4294967295ul
  967. | #define BIG_OK (BIG64 / BIG32 == 4294967297ull && BIG64 % BIG32 == 0)
  968. | #if !BIG_OK
  969. |   your preprocessor is broken;
  970. | #endif
  971. | #if BIG_OK
  972. | #else
  973. |   your preprocessor is broken;
  974. | #endif
  975. | static long long int bignum = -9223372036854775807LL;
  976. | static unsigned long long int ubignum = BIG64;
  977. |
  978. | struct incomplete_array
  979. | {
  980. |   int datasize;
  981. |   double data[];
  982. | };
  983. |
  984. | struct named_init {
  985. |   int number;
  986. |   const wchar_t *name;
  987. |   double average;
  988. | };
  989. |
  990. | typedef const char *ccp;
  991. |
  992. | static inline int
  993. | test_restrict (ccp restrict text)
  994. | {
  995. |   // See if C++-style comments work.
  996. |   // Iterate through items via the restricted pointer.
  997. |   // Also check for declarations in for loops.
  998. |   for (unsigned int i = 0; *(text+i) != '\0'; ++i)
  999. |     continue;
  1000. |   return 0;
  1001. | }
  1002. |
  1003. | // Check varargs and va_copy.
  1004. | static void
  1005. | test_varargs (const char *format, ...)
  1006. | {
  1007. |   va_list args;
  1008. |   va_start (args, format);
  1009. |   va_list args_copy;
  1010. |   va_copy (args_copy, args);
  1011. |
  1012. |   const char *str;
  1013. |   int number;
  1014. |   float fnumber;
  1015. |
  1016. |   while (*format)
  1017. |     {
  1018. |       switch (*format++)
  1019. |       {
  1020. |       case 's': // string
  1021. |         str = va_arg (args_copy, const char *);
  1022. |         break;
  1023. |       case 'd': // int
  1024. |         number = va_arg (args_copy, int);
  1025. |         break;
  1026. |       case 'f': // float
  1027. |         fnumber = va_arg (args_copy, double);
  1028. |         break;
  1029. |       default:
  1030. |         break;
  1031. |       }
  1032. |     }
  1033. |   va_end (args_copy);
  1034. |   va_end (args);
  1035. | }
  1036. |
  1037. | int
  1038. | main ()
  1039. | {
  1040. |
  1041. |   // Check bool.
  1042. |   _Bool success = false;
  1043. |
  1044. |   // Check restrict.
  1045. |   if (test_restrict ("String literal") == 0)
  1046. |     success = true;
  1047. |   char *restrict newvar = "Another string";
  1048. |
  1049. |   // Check varargs.
  1050. |   test_varargs ("s, d' f .", "string", 65, 34.234);
  1051. |   test_varargs_macros ();
  1052. |
  1053. |   // Check flexible array members.
  1054. |   struct incomplete_array *ia =
  1055. |     malloc (sizeof (struct incomplete_array) + (sizeof (double) * 10));
  1056. |   ia->datasize = 10;
  1057. |   for (int i = 0; i < ia->datasize; ++i)
  1058. |     ia->data[i] = i * 1.234;
  1059. |
  1060. |   // Check named initializers.
  1061. |   struct named_init ni = {
  1062. |     .number = 34,
  1063. |     .name = L"Test wide string",
  1064. |     .average = 543.34343,
  1065. |   };
  1066. |
  1067. |   ni.number = 58;
  1068. |
  1069. |   int dynamic_array[ni.number];
  1070. |   dynamic_array[ni.number - 1] = 543;
  1071. |
  1072. |   // work around unused variable warnings
  1073. |   return (!success || bignum == 0LL || ubignum == 0uLL || newvar[0] == 'x'
  1074. |         || dynamic_array[ni.number - 1] != 543);
  1075. |
  1076. |   ;
  1077. |   return 0;
  1078. | }
  1079. configure:16933: gcc -m32 -std=gnu99 -c -march=x86-64 -mtune=generic -O2 -pipe -fstack-protector --param=ssp-buffer-size=4 -D_FORTIFY_SOURCE=2  conftest.c >&5
  1080. configure:16933: $? = 0
  1081. configure:16953: result: -std=gnu99
  1082. configure:17055: checking for gcc -m32 -std=gnu99 option to accept ISO Standard C
  1083. configure:17069: result: -std=gnu99
  1084. configure:17075: checking whether gcc -m32 -std=gnu99 and cc understand -c and -o together
  1085. configure:17106: gcc -m32 -std=gnu99 -c conftest.c -o conftest2.o >&5
  1086. configure:17110: $? = 0
  1087. configure:17116: gcc -m32 -std=gnu99 -c conftest.c -o conftest2.o >&5
  1088. configure:17120: $? = 0
  1089. configure:17131: cc -c conftest.c >&5
  1090. configure:17135: $? = 0
  1091. configure:17143: cc -c conftest.c -o conftest2.o >&5
  1092. configure:17147: $? = 0
  1093. configure:17153: cc -c conftest.c -o conftest2.o >&5
  1094. configure:17157: $? = 0
  1095. configure:17175: result: yes
  1096. configure:17313: checking for C++ compiler version
  1097. configure:17322: g++ -m32 --version >&5
  1098. g++ (GCC) 4.6.2 20120120 (prerelease)
  1099. Copyright (C) 2011 Free Software Foundation, Inc.
  1100. This is free software; see the source for copying conditions.  There is NO
  1101. warranty; not even for MERCHANTABILITY or FITNESS FOR A PARTICULAR PURPOSE.
  1102.  
  1103. configure:17333: $? = 0
  1104. configure:17322: g++ -m32 -v >&5
  1105. Using built-in specs.
  1106. COLLECT_GCC=g++
  1107. COLLECT_LTO_WRAPPER=/usr/lib/gcc/x86_64-unknown-linux-gnu/4.6.2/lto-wrapper
  1108. Target: x86_64-unknown-linux-gnu
  1109. Configured with: /build/src/gcc-4.6-20120120/configure --prefix=/usr --libdir=/usr/lib --libexecdir=/usr/lib --mandir=/usr/share/man --infodir=/usr/share/info --with-bugurl=https://bugs.archlinux.org/ --enable-languages=c,c++,ada,fortran,go,lto,objc,obj-c++ --enable-shared --enable-threads=posix --with-system-zlib --enable-__cxa_atexit --disable-libunwind-exceptions --enable-clocale=gnu --disable-libstdcxx-pch --enable-libstdcxx-time --enable-gnu-unique-object --enable-linker-build-id --with-ppl --enable-cloog-backend=isl --enable-lto --enable-gold --enable-ld=default --enable-plugin --with-plugin-ld=ld.gold --enable-multilib --disable-libssp --enable-checking=release --with-fpmath=sse
  1110. Thread model: posix
  1111. gcc version 4.6.2 20120120 (prerelease) (GCC)
  1112. configure:17333: $? = 0
  1113. configure:17322: g++ -m32 -V >&5
  1114. g++: error: unrecognized option '-V'
  1115. g++: fatal error: no input files
  1116. compilation terminated.
  1117. configure:17333: $? = 1
  1118. configure:17322: g++ -m32 -qversion >&5
  1119. g++: error: unrecognized option '-qversion'
  1120. g++: fatal error: no input files
  1121. compilation terminated.
  1122. configure:17333: $? = 1
  1123. configure:17337: checking whether we are using the GNU C++ compiler
  1124. configure:17356: g++ -m32 -c -march=x86-64 -mtune=generic -O2 -pipe -fstack-protector --param=ssp-buffer-size=4 -D_FORTIFY_SOURCE=2  conftest.cpp >&5
  1125. configure:17356: $? = 0
  1126. configure:17365: result: yes
  1127. configure:17374: checking whether g++ -m32 accepts -g
  1128. configure:17394: g++ -m32 -c -g  conftest.cpp >&5
  1129. configure:17394: $? = 0
  1130. configure:17435: result: yes
  1131. configure:17460: checking dependency style of g++ -m32
  1132. configure:17571: result: gcc3
  1133. configure:17604: checking how to run the C++ preprocessor
  1134. configure:17631: g++ -m32 -E  conftest.cpp
  1135. configure:17631: $? = 0
  1136. configure:17645: g++ -m32 -E  conftest.cpp
  1137. conftest.cpp:36:28: fatal error: ac_nonexistent.h: No such file or directory
  1138. compilation terminated.
  1139. configure:17645: $? = 1
  1140. configure: failed program was:
  1141. | /* confdefs.h */
  1142. | #define PACKAGE_NAME "GStreamer Base Plug-ins"
  1143. | #define PACKAGE_TARNAME "gst-plugins-base"
  1144. | #define PACKAGE_VERSION "0.10.35"
  1145. | #define PACKAGE_STRING "GStreamer Base Plug-ins 0.10.35"
  1146. | #define PACKAGE_BUGREPORT "http://bugzilla.gnome.org/enter_bug.cgi?product=GStreamer"
  1147. | #define PACKAGE_URL ""
  1148. | #define PACKAGE "gst-plugins-base"
  1149. | #define VERSION "0.10.35"
  1150. | #define STDC_HEADERS 1
  1151. | #define HAVE_SYS_TYPES_H 1
  1152. | #define HAVE_SYS_STAT_H 1
  1153. | #define HAVE_STDLIB_H 1
  1154. | #define HAVE_STRING_H 1
  1155. | #define HAVE_MEMORY_H 1
  1156. | #define HAVE_STRINGS_H 1
  1157. | #define HAVE_INTTYPES_H 1
  1158. | #define HAVE_STDINT_H 1
  1159. | #define HAVE_UNISTD_H 1
  1160. | #define HAVE_DLFCN_H 1
  1161. | #define LT_OBJDIR ".libs/"
  1162. | #define ENABLE_NLS 1
  1163. | #define HAVE_GETTEXT 1
  1164. | #define HAVE_DCGETTEXT 1
  1165. | #define GETTEXT_PACKAGE "gst-plugins-base-0.10"
  1166. | #define LOCALEDIR "/usr/share/locale"
  1167. | #define GST_PACKAGE_NAME "GStreamer Base Plugins (Archlinux)"
  1168. | #define GST_PACKAGE_ORIGIN "http://www.archlinux.org/"
  1169. | #define GST_INSTALL_PLUGINS_HELPER "/usr/libexec/gst-install-plugins-helper"
  1170. | #define HAVE_EXTERNAL /**/
  1171. | #define HAVE_EXPERIMENTAL /**/
  1172. | #define HAVE_CPU_X86_64 1
  1173. | #define HOST_CPU "x86_64"
  1174. | #define _FILE_OFFSET_BITS 64
  1175. | /* end confdefs.h.  */
  1176. | #include <ac_nonexistent.h>
  1177. configure:17670: result: g++ -m32 -E
  1178. configure:17690: g++ -m32 -E  conftest.cpp
  1179. configure:17690: $? = 0
  1180. configure:17704: g++ -m32 -E  conftest.cpp
  1181. conftest.cpp:36:28: fatal error: ac_nonexistent.h: No such file or directory
  1182. compilation terminated.
  1183. configure:17704: $? = 1
  1184. configure: failed program was:
  1185. | /* confdefs.h */
  1186. | #define PACKAGE_NAME "GStreamer Base Plug-ins"
  1187. | #define PACKAGE_TARNAME "gst-plugins-base"
  1188. | #define PACKAGE_VERSION "0.10.35"
  1189. | #define PACKAGE_STRING "GStreamer Base Plug-ins 0.10.35"
  1190. | #define PACKAGE_BUGREPORT "http://bugzilla.gnome.org/enter_bug.cgi?product=GStreamer"
  1191. | #define PACKAGE_URL ""
  1192. | #define PACKAGE "gst-plugins-base"
  1193. | #define VERSION "0.10.35"
  1194. | #define STDC_HEADERS 1
  1195. | #define HAVE_SYS_TYPES_H 1
  1196. | #define HAVE_SYS_STAT_H 1
  1197. | #define HAVE_STDLIB_H 1
  1198. | #define HAVE_STRING_H 1
  1199. | #define HAVE_MEMORY_H 1
  1200. | #define HAVE_STRINGS_H 1
  1201. | #define HAVE_INTTYPES_H 1
  1202. | #define HAVE_STDINT_H 1
  1203. | #define HAVE_UNISTD_H 1
  1204. | #define HAVE_DLFCN_H 1
  1205. | #define LT_OBJDIR ".libs/"
  1206. | #define ENABLE_NLS 1
  1207. | #define HAVE_GETTEXT 1
  1208. | #define HAVE_DCGETTEXT 1
  1209. | #define GETTEXT_PACKAGE "gst-plugins-base-0.10"
  1210. | #define LOCALEDIR "/usr/share/locale"
  1211. | #define GST_PACKAGE_NAME "GStreamer Base Plugins (Archlinux)"
  1212. | #define GST_PACKAGE_ORIGIN "http://www.archlinux.org/"
  1213. | #define GST_INSTALL_PLUGINS_HELPER "/usr/libexec/gst-install-plugins-helper"
  1214. | #define HAVE_EXTERNAL /**/
  1215. | #define HAVE_EXPERIMENTAL /**/
  1216. | #define HAVE_CPU_X86_64 1
  1217. | #define HOST_CPU "x86_64"
  1218. | #define _FILE_OFFSET_BITS 64
  1219. | /* end confdefs.h.  */
  1220. | #include <ac_nonexistent.h>
  1221. configure:17874: checking for ld used by g++ -m32
  1222. configure:17941: result: /usr/bin/ld -m elf_i386
  1223. configure:17948: checking if the linker (/usr/bin/ld -m elf_i386) is GNU ld
  1224. configure:17963: result: yes
  1225. configure:18018: checking whether the g++ -m32 linker (/usr/bin/ld -m elf_i386) supports shared libraries
  1226. configure:19022: result: yes
  1227. configure:19057: g++ -m32 -c -march=x86-64 -mtune=generic -O2 -pipe -fstack-protector --param=ssp-buffer-size=4 -D_FORTIFY_SOURCE=2  conftest.cpp >&5
  1228. configure:19060: $? = 0
  1229. configure:19580: checking for g++ -m32 option to produce PIC
  1230. configure:19587: result: -fPIC -DPIC
  1231. configure:19595: checking if g++ -m32 PIC flag -fPIC -DPIC works
  1232. configure:19613: g++ -m32 -c -march=x86-64 -mtune=generic -O2 -pipe -fstack-protector --param=ssp-buffer-size=4 -D_FORTIFY_SOURCE=2  -fPIC -DPIC -DPIC conftest.cpp >&5
  1233. configure:19617: $? = 0
  1234. configure:19630: result: yes
  1235. configure:19653: checking if g++ -m32 static flag -static works
  1236. configure:19681: result: yes
  1237. configure:19693: checking if g++ -m32 supports -c -o file.o
  1238. configure:19714: g++ -m32 -c -march=x86-64 -mtune=generic -O2 -pipe -fstack-protector --param=ssp-buffer-size=4 -D_FORTIFY_SOURCE=2  -o out/conftest2.o conftest.cpp >&5
  1239. configure:19718: $? = 0
  1240. configure:19740: result: yes
  1241. configure:19745: checking if g++ -m32 supports -c -o file.o
  1242. configure:19792: result: yes
  1243. configure:19822: checking whether the g++ -m32 linker (/usr/bin/ld -m elf_i386) supports shared libraries
  1244. configure:19859: result: yes
  1245. configure:20002: checking dynamic linker characteristics
  1246. configure:20685: result: GNU/Linux ld.so
  1247. configure:20738: checking how to hardcode library paths into programs
  1248. configure:20763: result: immediate
  1249. configure:20820: g++ -m32 -c -march=x86-64 -mtune=generic -O2 -pipe -fstack-protector --param=ssp-buffer-size=4 -D_FORTIFY_SOURCE=2  conftest.cpp >&5
  1250. configure:20820: $? = 0
  1251. configure:20832: working c++ compiler found: yes
  1252. configure:20845: checking for valgrind
  1253. configure:20876: result: no
  1254. configure:20904: checking for gobject-introspection
  1255. configure:20949: result: no (disabled, use --enable-introspection to enable)
  1256. configure:21085: checking whether to build gtk-doc documentation
  1257. configure:21087: result: no
  1258. configure:21094: checking for gtkdoc-check
  1259. configure:21112: found /usr/bin/gtkdoc-check
  1260. configure:21124: result: /usr/bin/gtkdoc-check
  1261. configure:21158: Looking for Python version >= 2.1
  1262. configure:21176: checking for python
  1263. configure:21194: found /usr/bin/python
  1264. configure:21206: result: /usr/bin/python
  1265. configure:21218: checking "/usr/bin/python":
  1266. configure:21220: result: okay
  1267. configure:21236: checking local Python configuration
  1268. configure:21273: result: looks good
  1269. configure:21281: checking whether to build plugin documentation
  1270. configure:21288: result: no (gtk-doc disabled or not available)
  1271. configure:21391: checking for cos in -lm
  1272. configure:21416: gcc -m32 -std=gnu99 -o conftest -march=x86-64 -mtune=generic -O2 -pipe -fstack-protector --param=ssp-buffer-size=4 -D_FORTIFY_SOURCE=2  -Wl,-O1,--sort-common,--as-needed,-z,relro,--hash-style=gnu conftest.c -lm   >&5
  1273. conftest.c:43:6: warning: conflicting types for built-in function 'cos' [enabled by default]
  1274. configure:21416: $? = 0
  1275. configure:21425: result: yes
  1276. configure:21438: checking for ANSI C header files
  1277. configure:21542: result: yes
  1278. configure:21553: checking malloc.h usability
  1279. configure:21553: gcc -m32 -std=gnu99 -c -march=x86-64 -mtune=generic -O2 -pipe -fstack-protector --param=ssp-buffer-size=4 -D_FORTIFY_SOURCE=2  conftest.c >&5
  1280. configure:21553: $? = 0
  1281. configure:21553: result: yes
  1282. configure:21553: checking malloc.h presence
  1283. configure:21553: gcc -m32 -E  conftest.c
  1284. configure:21553: $? = 0
  1285. configure:21553: result: yes
  1286. configure:21553: checking for malloc.h
  1287. configure:21553: result: yes
  1288. configure:21583: gcc -m32 -std=gnu99 -c -march=x86-64 -mtune=generic -O2 -pipe -fstack-protector --param=ssp-buffer-size=4 -D_FORTIFY_SOURCE=2 -I/usr/include/libxml2   conftest.c >&5
  1289. configure:21583: $? = 0
  1290. configure:21601: checking sys/socket.h usability
  1291. configure:21601: gcc -m32 -std=gnu99 -c -march=x86-64 -mtune=generic -O2 -pipe -fstack-protector --param=ssp-buffer-size=4 -D_FORTIFY_SOURCE=2  conftest.c >&5
  1292. configure:21601: $? = 0
  1293. configure:21601: result: yes
  1294. configure:21601: checking sys/socket.h presence
  1295. configure:21601: gcc -m32 -E  conftest.c
  1296. configure:21601: $? = 0
  1297. configure:21601: result: yes
  1298. configure:21601: checking for sys/socket.h
  1299. configure:21601: result: yes
  1300. configure:21624: checking winsock2.h usability
  1301. configure:21624: gcc -m32 -std=gnu99 -c -march=x86-64 -mtune=generic -O2 -pipe -fstack-protector --param=ssp-buffer-size=4 -D_FORTIFY_SOURCE=2  conftest.c >&5
  1302. conftest.c:72:22: fatal error: winsock2.h: No such file or directory
  1303. compilation terminated.
  1304. configure:21624: $? = 1
  1305. configure: failed program was:
  1306. | /* confdefs.h */
  1307. | #define PACKAGE_NAME "GStreamer Base Plug-ins"
  1308. | #define PACKAGE_TARNAME "gst-plugins-base"
  1309. | #define PACKAGE_VERSION "0.10.35"
  1310. | #define PACKAGE_STRING "GStreamer Base Plug-ins 0.10.35"
  1311. | #define PACKAGE_BUGREPORT "http://bugzilla.gnome.org/enter_bug.cgi?product=GStreamer"
  1312. | #define PACKAGE_URL ""
  1313. | #define PACKAGE "gst-plugins-base"
  1314. | #define VERSION "0.10.35"
  1315. | #define STDC_HEADERS 1
  1316. | #define HAVE_SYS_TYPES_H 1
  1317. | #define HAVE_SYS_STAT_H 1
  1318. | #define HAVE_STDLIB_H 1
  1319. | #define HAVE_STRING_H 1
  1320. | #define HAVE_MEMORY_H 1
  1321. | #define HAVE_STRINGS_H 1
  1322. | #define HAVE_INTTYPES_H 1
  1323. | #define HAVE_STDINT_H 1
  1324. | #define HAVE_UNISTD_H 1
  1325. | #define HAVE_DLFCN_H 1
  1326. | #define LT_OBJDIR ".libs/"
  1327. | #define ENABLE_NLS 1
  1328. | #define HAVE_GETTEXT 1
  1329. | #define HAVE_DCGETTEXT 1
  1330. | #define GETTEXT_PACKAGE "gst-plugins-base-0.10"
  1331. | #define LOCALEDIR "/usr/share/locale"
  1332. | #define GST_PACKAGE_NAME "GStreamer Base Plugins (Archlinux)"
  1333. | #define GST_PACKAGE_ORIGIN "http://www.archlinux.org/"
  1334. | #define GST_INSTALL_PLUGINS_HELPER "/usr/libexec/gst-install-plugins-helper"
  1335. | #define HAVE_EXTERNAL /**/
  1336. | #define HAVE_EXPERIMENTAL /**/
  1337. | #define HAVE_CPU_X86_64 1
  1338. | #define HOST_CPU "x86_64"
  1339. | #define _FILE_OFFSET_BITS 64
  1340. | #define STDC_HEADERS 1
  1341. | #define HAVE_MALLOC_H 1
  1342. | #define HAVE_SYS_SOCKET_H 1
  1343. | /* end confdefs.h.  */
  1344. | #include <stdio.h>
  1345. | #ifdef HAVE_SYS_TYPES_H
  1346. | # include <sys/types.h>
  1347. | #endif
  1348. | #ifdef HAVE_SYS_STAT_H
  1349. | # include <sys/stat.h>
  1350. | #endif
  1351. | #ifdef STDC_HEADERS
  1352. | # include <stdlib.h>
  1353. | # include <stddef.h>
  1354. | #else
  1355. | # ifdef HAVE_STDLIB_H
  1356. | #  include <stdlib.h>
  1357. | # endif
  1358. | #endif
  1359. | #ifdef HAVE_STRING_H
  1360. | # if !defined STDC_HEADERS && defined HAVE_MEMORY_H
  1361. | #  include <memory.h>
  1362. | # endif
  1363. | # include <string.h>
  1364. | #endif
  1365. | #ifdef HAVE_STRINGS_H
  1366. | # include <strings.h>
  1367. | #endif
  1368. | #ifdef HAVE_INTTYPES_H
  1369. | # include <inttypes.h>
  1370. | #endif
  1371. | #ifdef HAVE_STDINT_H
  1372. | # include <stdint.h>
  1373. | #endif
  1374. | #ifdef HAVE_UNISTD_H
  1375. | # include <unistd.h>
  1376. | #endif
  1377. | #include <winsock2.h>
  1378. configure:21624: result: no
  1379. configure:21624: checking winsock2.h presence
  1380. configure:21624: gcc -m32 -E  conftest.c
  1381. conftest.c:39:22: fatal error: winsock2.h: No such file or directory
  1382. compilation terminated.
  1383. configure:21624: $? = 1
  1384. configure: failed program was:
  1385. | /* confdefs.h */
  1386. | #define PACKAGE_NAME "GStreamer Base Plug-ins"
  1387. | #define PACKAGE_TARNAME "gst-plugins-base"
  1388. | #define PACKAGE_VERSION "0.10.35"
  1389. | #define PACKAGE_STRING "GStreamer Base Plug-ins 0.10.35"
  1390. | #define PACKAGE_BUGREPORT "http://bugzilla.gnome.org/enter_bug.cgi?product=GStreamer"
  1391. | #define PACKAGE_URL ""
  1392. | #define PACKAGE "gst-plugins-base"
  1393. | #define VERSION "0.10.35"
  1394. | #define STDC_HEADERS 1
  1395. | #define HAVE_SYS_TYPES_H 1
  1396. | #define HAVE_SYS_STAT_H 1
  1397. | #define HAVE_STDLIB_H 1
  1398. | #define HAVE_STRING_H 1
  1399. | #define HAVE_MEMORY_H 1
  1400. | #define HAVE_STRINGS_H 1
  1401. | #define HAVE_INTTYPES_H 1
  1402. | #define HAVE_STDINT_H 1
  1403. | #define HAVE_UNISTD_H 1
  1404. | #define HAVE_DLFCN_H 1
  1405. | #define LT_OBJDIR ".libs/"
  1406. | #define ENABLE_NLS 1
  1407. | #define HAVE_GETTEXT 1
  1408. | #define HAVE_DCGETTEXT 1
  1409. | #define GETTEXT_PACKAGE "gst-plugins-base-0.10"
  1410. | #define LOCALEDIR "/usr/share/locale"
  1411. | #define GST_PACKAGE_NAME "GStreamer Base Plugins (Archlinux)"
  1412. | #define GST_PACKAGE_ORIGIN "http://www.archlinux.org/"
  1413. | #define GST_INSTALL_PLUGINS_HELPER "/usr/libexec/gst-install-plugins-helper"
  1414. | #define HAVE_EXTERNAL /**/
  1415. | #define HAVE_EXPERIMENTAL /**/
  1416. | #define HAVE_CPU_X86_64 1
  1417. | #define HOST_CPU "x86_64"
  1418. | #define _FILE_OFFSET_BITS 64
  1419. | #define STDC_HEADERS 1
  1420. | #define HAVE_MALLOC_H 1
  1421. | #define HAVE_SYS_SOCKET_H 1
  1422. | /* end confdefs.h.  */
  1423. | #include <winsock2.h>
  1424. configure:21624: result: no
  1425. configure:21624: checking for winsock2.h
  1426. configure:21624: result: no
  1427. configure:21640: checking for hstrerror
  1428. configure:21640: gcc -m32 -std=gnu99 -o conftest -march=x86-64 -mtune=generic -O2 -pipe -fstack-protector --param=ssp-buffer-size=4 -D_FORTIFY_SOURCE=2  -Wl,-O1,--sort-common,--as-needed,-z,relro,--hash-style=gnu conftest.c  >&5
  1429. configure:21640: $? = 0
  1430. configure:21640: result: yes
  1431. configure:21702: checking process.h usability
  1432. configure:21702: gcc -m32 -std=gnu99 -c -march=x86-64 -mtune=generic -O2 -pipe -fstack-protector --param=ssp-buffer-size=4 -D_FORTIFY_SOURCE=2  conftest.c >&5
  1433. conftest.c:72:21: fatal error: process.h: No such file or directory
  1434. compilation terminated.
  1435. configure:21702: $? = 1
  1436. configure: failed program was:
  1437. | /* confdefs.h */
  1438. | #define PACKAGE_NAME "GStreamer Base Plug-ins"
  1439. | #define PACKAGE_TARNAME "gst-plugins-base"
  1440. | #define PACKAGE_VERSION "0.10.35"
  1441. | #define PACKAGE_STRING "GStreamer Base Plug-ins 0.10.35"
  1442. | #define PACKAGE_BUGREPORT "http://bugzilla.gnome.org/enter_bug.cgi?product=GStreamer"
  1443. | #define PACKAGE_URL ""
  1444. | #define PACKAGE "gst-plugins-base"
  1445. | #define VERSION "0.10.35"
  1446. | #define STDC_HEADERS 1
  1447. | #define HAVE_SYS_TYPES_H 1
  1448. | #define HAVE_SYS_STAT_H 1
  1449. | #define HAVE_STDLIB_H 1
  1450. | #define HAVE_STRING_H 1
  1451. | #define HAVE_MEMORY_H 1
  1452. | #define HAVE_STRINGS_H 1
  1453. | #define HAVE_INTTYPES_H 1
  1454. | #define HAVE_STDINT_H 1
  1455. | #define HAVE_UNISTD_H 1
  1456. | #define HAVE_DLFCN_H 1
  1457. | #define LT_OBJDIR ".libs/"
  1458. | #define ENABLE_NLS 1
  1459. | #define HAVE_GETTEXT 1
  1460. | #define HAVE_DCGETTEXT 1
  1461. | #define GETTEXT_PACKAGE "gst-plugins-base-0.10"
  1462. | #define LOCALEDIR "/usr/share/locale"
  1463. | #define GST_PACKAGE_NAME "GStreamer Base Plugins (Archlinux)"
  1464. | #define GST_PACKAGE_ORIGIN "http://www.archlinux.org/"
  1465. | #define GST_INSTALL_PLUGINS_HELPER "/usr/libexec/gst-install-plugins-helper"
  1466. | #define HAVE_EXTERNAL /**/
  1467. | #define HAVE_EXPERIMENTAL /**/
  1468. | #define HAVE_CPU_X86_64 1
  1469. | #define HOST_CPU "x86_64"
  1470. | #define _FILE_OFFSET_BITS 64
  1471. | #define STDC_HEADERS 1
  1472. | #define HAVE_MALLOC_H 1
  1473. | #define HAVE_SYS_SOCKET_H 1
  1474. | /* end confdefs.h.  */
  1475. | #include <stdio.h>
  1476. | #ifdef HAVE_SYS_TYPES_H
  1477. | # include <sys/types.h>
  1478. | #endif
  1479. | #ifdef HAVE_SYS_STAT_H
  1480. | # include <sys/stat.h>
  1481. | #endif
  1482. | #ifdef STDC_HEADERS
  1483. | # include <stdlib.h>
  1484. | # include <stddef.h>
  1485. | #else
  1486. | # ifdef HAVE_STDLIB_H
  1487. | #  include <stdlib.h>
  1488. | # endif
  1489. | #endif
  1490. | #ifdef HAVE_STRING_H
  1491. | # if !defined STDC_HEADERS && defined HAVE_MEMORY_H
  1492. | #  include <memory.h>
  1493. | # endif
  1494. | # include <string.h>
  1495. | #endif
  1496. | #ifdef HAVE_STRINGS_H
  1497. | # include <strings.h>
  1498. | #endif
  1499. | #ifdef HAVE_INTTYPES_H
  1500. | # include <inttypes.h>
  1501. | #endif
  1502. | #ifdef HAVE_STDINT_H
  1503. | # include <stdint.h>
  1504. | #endif
  1505. | #ifdef HAVE_UNISTD_H
  1506. | # include <unistd.h>
  1507. | #endif
  1508. | #include <process.h>
  1509. configure:21702: result: no
  1510. configure:21702: checking process.h presence
  1511. configure:21702: gcc -m32 -E  conftest.c
  1512. conftest.c:39:21: fatal error: process.h: No such file or directory
  1513. compilation terminated.
  1514. configure:21702: $? = 1
  1515. configure: failed program was:
  1516. | /* confdefs.h */
  1517. | #define PACKAGE_NAME "GStreamer Base Plug-ins"
  1518. | #define PACKAGE_TARNAME "gst-plugins-base"
  1519. | #define PACKAGE_VERSION "0.10.35"
  1520. | #define PACKAGE_STRING "GStreamer Base Plug-ins 0.10.35"
  1521. | #define PACKAGE_BUGREPORT "http://bugzilla.gnome.org/enter_bug.cgi?product=GStreamer"
  1522. | #define PACKAGE_URL ""
  1523. | #define PACKAGE "gst-plugins-base"
  1524. | #define VERSION "0.10.35"
  1525. | #define STDC_HEADERS 1
  1526. | #define HAVE_SYS_TYPES_H 1
  1527. | #define HAVE_SYS_STAT_H 1
  1528. | #define HAVE_STDLIB_H 1
  1529. | #define HAVE_STRING_H 1
  1530. | #define HAVE_MEMORY_H 1
  1531. | #define HAVE_STRINGS_H 1
  1532. | #define HAVE_INTTYPES_H 1
  1533. | #define HAVE_STDINT_H 1
  1534. | #define HAVE_UNISTD_H 1
  1535. | #define HAVE_DLFCN_H 1
  1536. | #define LT_OBJDIR ".libs/"
  1537. | #define ENABLE_NLS 1
  1538. | #define HAVE_GETTEXT 1
  1539. | #define HAVE_DCGETTEXT 1
  1540. | #define GETTEXT_PACKAGE "gst-plugins-base-0.10"
  1541. | #define LOCALEDIR "/usr/share/locale"
  1542. | #define GST_PACKAGE_NAME "GStreamer Base Plugins (Archlinux)"
  1543. | #define GST_PACKAGE_ORIGIN "http://www.archlinux.org/"
  1544. | #define GST_INSTALL_PLUGINS_HELPER "/usr/libexec/gst-install-plugins-helper"
  1545. | #define HAVE_EXTERNAL /**/
  1546. | #define HAVE_EXPERIMENTAL /**/
  1547. | #define HAVE_CPU_X86_64 1
  1548. | #define HOST_CPU "x86_64"
  1549. | #define _FILE_OFFSET_BITS 64
  1550. | #define STDC_HEADERS 1
  1551. | #define HAVE_MALLOC_H 1
  1552. | #define HAVE_SYS_SOCKET_H 1
  1553. | /* end confdefs.h.  */
  1554. | #include <process.h>
  1555. configure:21702: result: no
  1556. configure:21702: checking for process.h
  1557. configure:21702: result: no
  1558. configure:21702: checking for sys/types.h
  1559. configure:21702: result: yes
  1560. configure:21702: checking sys/wait.h usability
  1561. configure:21702: gcc -m32 -std=gnu99 -c -march=x86-64 -mtune=generic -O2 -pipe -fstack-protector --param=ssp-buffer-size=4 -D_FORTIFY_SOURCE=2  conftest.c >&5
  1562. configure:21702: $? = 0
  1563. configure:21702: result: yes
  1564. configure:21702: checking sys/wait.h presence
  1565. configure:21702: gcc -m32 -E  conftest.c
  1566. configure:21702: $? = 0
  1567. configure:21702: result: yes
  1568. configure:21702: checking for sys/wait.h
  1569. configure:21702: result: yes
  1570. configure:21702: checking for sys/stat.h
  1571. configure:21702: result: yes
  1572. configure:21714: checking for stdint types
  1573. configure:21737: gcc -m32 -std=gnu99 -c   conftest.c >&5
  1574. configure:21737: $? = 0
  1575. configure:21781: result: stdint.h (shortcircuit)
  1576. configure:22168: result: make use of stdint.h in _stdint.h (assuming C99 compatible system)
  1577. configure:22179: checking for localtime_r
  1578. configure:22179: gcc -m32 -std=gnu99 -o conftest -march=x86-64 -mtune=generic -O2 -pipe -fstack-protector --param=ssp-buffer-size=4 -D_FORTIFY_SOURCE=2  -Wl,-O1,--sort-common,--as-needed,-z,relro,--hash-style=gnu conftest.c  >&5
  1579. configure:22179: $? = 0
  1580. configure:22179: result: yes
  1581. configure:22179: checking for gmtime_r
  1582. configure:22179: gcc -m32 -std=gnu99 -o conftest -march=x86-64 -mtune=generic -O2 -pipe -fstack-protector --param=ssp-buffer-size=4 -D_FORTIFY_SOURCE=2  -Wl,-O1,--sort-common,--as-needed,-z,relro,--hash-style=gnu conftest.c  >&5
  1583. configure:22179: $? = 0
  1584. configure:22179: result: yes
  1585. configure:22193: checking for log2
  1586. configure:22193: gcc -m32 -std=gnu99 -o conftest -march=x86-64 -mtune=generic -O2 -pipe -fstack-protector --param=ssp-buffer-size=4 -D_FORTIFY_SOURCE=2  -Wl,-O1,--sort-common,--as-needed,-z,relro,--hash-style=gnu conftest.c  -lm >&5
  1587. conftest.c:67:6: warning: conflicting types for built-in function 'log2' [enabled by default]
  1588. configure:22193: $? = 0
  1589. configure:22193: result: yes
  1590. configure:22207: checking for FIONREAD in sys/ioctl.h
  1591. configure:22231: gcc -m32 -std=gnu99 -c -march=x86-64 -mtune=generic -O2 -pipe -fstack-protector --param=ssp-buffer-size=4 -D_FORTIFY_SOURCE=2  conftest.c >&5
  1592. configure:22231: $? = 0
  1593. configure:22241: result: yes
  1594. configure:22301: checking for _LARGEFILE_SOURCE value needed for large files
  1595. configure:22320: gcc -m32 -std=gnu99 -o conftest -march=x86-64 -mtune=generic -O2 -pipe -fstack-protector --param=ssp-buffer-size=4 -D_FORTIFY_SOURCE=2  -Wl,-O1,--sort-common,--as-needed,-z,relro,--hash-style=gnu conftest.c  >&5
  1596. configure:22320: $? = 0
  1597. configure:22348: result: no
  1598. configure:22372: checking for lrint
  1599. configure:22393: gcc -m32 -std=gnu99 -o conftest -march=x86-64 -mtune=generic -O2 -pipe -fstack-protector --param=ssp-buffer-size=4 -D_FORTIFY_SOURCE=2  -Wl,-O1,--sort-common,--as-needed,-z,relro,--hash-style=gnu conftest.c  -lm >&5
  1600. configure:22393: $? = 0
  1601. configure:22401: result: yes
  1602. configure:22409: checking for lrintf
  1603. configure:22430: gcc -m32 -std=gnu99 -o conftest -march=x86-64 -mtune=generic -O2 -pipe -fstack-protector --param=ssp-buffer-size=4 -D_FORTIFY_SOURCE=2  -Wl,-O1,--sort-common,--as-needed,-z,relro,--hash-style=gnu conftest.c  -lm >&5
  1604. configure:22430: $? = 0
  1605. configure:22438: result: yes
  1606. configure:22449: checking whether gcc -m32 -std=gnu99 implements __PRETTY_FUNCTION__
  1607. configure:22466: gcc -m32 -std=gnu99 -o conftest -march=x86-64 -mtune=generic -O2 -pipe -fstack-protector --param=ssp-buffer-size=4 -D_FORTIFY_SOURCE=2  -Wl,-O1,--sort-common,--as-needed,-z,relro,--hash-style=gnu conftest.c  >&5
  1608. configure:22466: $? = 0
  1609. configure:22476: result: yes
  1610. configure:22484: checking whether gcc -m32 -std=gnu99 implements __FUNCTION__
  1611. configure:22501: gcc -m32 -std=gnu99 -o conftest -march=x86-64 -mtune=generic -O2 -pipe -fstack-protector --param=ssp-buffer-size=4 -D_FORTIFY_SOURCE=2  -Wl,-O1,--sort-common,--as-needed,-z,relro,--hash-style=gnu conftest.c  >&5
  1612. configure:22501: $? = 0
  1613. configure:22511: result: yes
  1614. configure:22519: checking whether gcc -m32 -std=gnu99 implements __func__
  1615. configure:22536: gcc -m32 -std=gnu99 -o conftest -march=x86-64 -mtune=generic -O2 -pipe -fstack-protector --param=ssp-buffer-size=4 -D_FORTIFY_SOURCE=2  -Wl,-O1,--sort-common,--as-needed,-z,relro,--hash-style=gnu conftest.c  >&5
  1616. configure:22536: $? = 0
  1617. configure:22546: result: yes
  1618. configure:22574: checking for socket
  1619. configure:22574: gcc -m32 -std=gnu99 -o conftest -march=x86-64 -mtune=generic -O2 -pipe -fstack-protector --param=ssp-buffer-size=4 -D_FORTIFY_SOURCE=2  -Wl,-O1,--sort-common,--as-needed,-z,relro,--hash-style=gnu conftest.c  >&5
  1620. configure:22574: $? = 0
  1621. configure:22574: result: yes
  1622. configure:22625: checking for gethostbyname
  1623. configure:22625: gcc -m32 -std=gnu99 -o conftest -march=x86-64 -mtune=generic -O2 -pipe -fstack-protector --param=ssp-buffer-size=4 -D_FORTIFY_SOURCE=2  -Wl,-O1,--sort-common,--as-needed,-z,relro,--hash-style=gnu conftest.c  >&5
  1624. configure:22625: $? = 0
  1625. configure:22625: result: yes
  1626. configure:22694: checking for GLIB
  1627. configure:22702: $PKG_CONFIG --exists --print-errors "$which"
  1628. configure:22705: $? = 0
  1629. configure:22720: $PKG_CONFIG --exists --print-errors "$which"
  1630. configure:22723: $? = 0
  1631. configure:22775: result: yes
  1632. configure:22865: checking for ORC
  1633. configure:22873: $PKG_CONFIG --exists --print-errors "orc-0.4 >= $ORC_REQ"
  1634. configure:22876: $? = 0
  1635. configure:22891: $PKG_CONFIG --exists --print-errors "orc-0.4 >= $ORC_REQ"
  1636. configure:22894: $? = 0
  1637. configure:22948: result: yes
  1638. configure:23001: checking for GST
  1639. configure:23009: $PKG_CONFIG --exists --print-errors "$module >= $minver"
  1640. configure:23012: $? = 0
  1641. configure:23027: $PKG_CONFIG --exists --print-errors "$module >= $minver"
  1642. configure:23030: $? = 0
  1643. configure:23086: result: yes
  1644. configure:23100: using GStreamer tools in /usr/bin
  1645. configure:23110: using GStreamer plug-ins in /usr/lib/gstreamer-0.10
  1646. configure:23122: checking for GST_BASE
  1647. configure:23130: $PKG_CONFIG --exists --print-errors "$module >= $minver"
  1648. configure:23133: $? = 0
  1649. configure:23148: $PKG_CONFIG --exists --print-errors "$module >= $minver"
  1650. configure:23151: $? = 0
  1651. configure:23207: result: yes
  1652. configure:23224: checking for GST_GDP
  1653. configure:23232: $PKG_CONFIG --exists --print-errors "$module >= $minver"
  1654. configure:23235: $? = 0
  1655. configure:23250: $PKG_CONFIG --exists --print-errors "$module >= $minver"
  1656. configure:23253: $? = 0
  1657. configure:23309: result: yes
  1658. configure:23326: checking for GST_CONTROLLER
  1659. configure:23334: $PKG_CONFIG --exists --print-errors "$module >= $minver"
  1660. configure:23337: $? = 0
  1661. configure:23352: $PKG_CONFIG --exists --print-errors "$module >= $minver"
  1662. configure:23355: $? = 0
  1663. configure:23411: result: yes
  1664. configure:23428: checking for GST_CHECK
  1665. configure:23436: $PKG_CONFIG --exists --print-errors "$module >= $minver"
  1666. configure:23439: $? = 0
  1667. configure:23454: $PKG_CONFIG --exists --print-errors "$module >= $minver"
  1668. configure:23457: $? = 0
  1669. configure:23513: result: yes
  1670. configure:23541: checking which gtk+ version to compile examples against (optional)
  1671. configure:23556: result: 2.0 (>= 2.14.0)
  1672. configure:23560: checking for GTK
  1673. configure:23568: $PKG_CONFIG --exists --print-errors "gtk+-$with_gtk >= $GTK_REQ"
  1674. configure:23571: $? = 0
  1675. configure:23586: $PKG_CONFIG --exists --print-errors "gtk+-$with_gtk >= $GTK_REQ"
  1676. configure:23589: $? = 0
  1677. configure:23625: result: yes
  1678. configure:23631: checking for GTK_X11
  1679. configure:23639: $PKG_CONFIG --exists --print-errors "gtk+-x11-$with_gtk >= $GTK_REQ"
  1680. configure:23642: $? = 0
  1681. configure:23657: $PKG_CONFIG --exists --print-errors "gtk+-x11-$with_gtk >= $GTK_REQ"
  1682. configure:23660: $? = 0
  1683. configure:23696: result: yes
  1684. configure:23722: checking for QT
  1685. configure:23730: $PKG_CONFIG --exists --print-errors "QtGui >= 4.6"
  1686. configure:23733: $? = 0
  1687. configure:23748: $PKG_CONFIG --exists --print-errors "QtGui >= 4.6"
  1688. configure:23751: $? = 0
  1689. configure:23933: result: yes
  1690. configure:23941: checking Qt moc
  1691. configure:23944: result: /usr/bin/moc
  1692. configure:23984: gcc -m32 -std=gnu99 -c -march=x86-64 -mtune=generic -O2 -pipe -fstack-protector --param=ssp-buffer-size=4 -D_FORTIFY_SOURCE=2  conftest.c >&5
  1693. configure:23984: $? = 0
  1694. configure:24008: checking for -Bsymbolic-functions linker flag
  1695. configure:24022: gcc -m32 -std=gnu99 -o conftest -march=x86-64 -mtune=generic -O2 -pipe -fstack-protector --param=ssp-buffer-size=4 -D_FORTIFY_SOURCE=2  -Wl,-Bsymbolic-functions conftest.c  >&5
  1696. configure:24022: $? = 0
  1697. configure:24023: result: yes
  1698. configure:24081: Using /usr/lib32/gstreamer-0.10 as the plugin install location
  1699. configure:24118: Setting GST_PACKAGE_RELEASE_DATETIME to 2011-06-15
  1700. configure:24178: checking to see if compiler understands -Wall
  1701. configure:24195: gcc -m32 -std=gnu99 -c -march=x86-64 -mtune=generic -O2 -pipe -fstack-protector --param=ssp-buffer-size=4 -D_FORTIFY_SOURCE=2 -Wall  conftest.c >&5
  1702. configure:24195: $? = 0
  1703. configure:24210: result: yes
  1704. configure:24215: checking to see if compiler understands -Wdeclaration-after-statement
  1705. configure:24232: gcc -m32 -std=gnu99 -c -march=x86-64 -mtune=generic -O2 -pipe -fstack-protector --param=ssp-buffer-size=4 -D_FORTIFY_SOURCE=2 -Wdeclaration-after-statement  conftest.c >&5
  1706. configure:24232: $? = 0
  1707. configure:24247: result: yes
  1708. configure:24252: checking to see if compiler understands -Wvla
  1709. configure:24269: gcc -m32 -std=gnu99 -c -march=x86-64 -mtune=generic -O2 -pipe -fstack-protector --param=ssp-buffer-size=4 -D_FORTIFY_SOURCE=2 -Wvla  conftest.c >&5
  1710. configure:24269: $? = 0
  1711. configure:24284: result: yes
  1712. configure:24289: checking to see if compiler understands -Wpointer-arith
  1713. configure:24306: gcc -m32 -std=gnu99 -c -march=x86-64 -mtune=generic -O2 -pipe -fstack-protector --param=ssp-buffer-size=4 -D_FORTIFY_SOURCE=2 -Wpointer-arith  conftest.c >&5
  1714. configure:24306: $? = 0
  1715. configure:24321: result: yes
  1716. configure:24513: checking to see if compiler understands -Wmissing-declarations
  1717. configure:24530: gcc -m32 -std=gnu99 -c -march=x86-64 -mtune=generic -O2 -pipe -fstack-protector --param=ssp-buffer-size=4 -D_FORTIFY_SOURCE=2 -Wmissing-declarations  conftest.c >&5
  1718. configure:24530: $? = 0
  1719. configure:24545: result: yes
  1720. configure:24513: checking to see if compiler understands -Wmissing-prototypes
  1721. configure:24530: gcc -m32 -std=gnu99 -c -march=x86-64 -mtune=generic -O2 -pipe -fstack-protector --param=ssp-buffer-size=4 -D_FORTIFY_SOURCE=2 -Wmissing-prototypes  conftest.c >&5
  1722. configure:24530: $? = 0
  1723. configure:24545: result: yes
  1724. configure:24513: checking to see if compiler understands -Wredundant-decls
  1725. configure:24530: gcc -m32 -std=gnu99 -c -march=x86-64 -mtune=generic -O2 -pipe -fstack-protector --param=ssp-buffer-size=4 -D_FORTIFY_SOURCE=2 -Wredundant-decls  conftest.c >&5
  1726. configure:24530: $? = 0
  1727. configure:24545: result: yes
  1728. configure:24513: checking to see if compiler understands -Wundef
  1729. configure:24530: gcc -m32 -std=gnu99 -c -march=x86-64 -mtune=generic -O2 -pipe -fstack-protector --param=ssp-buffer-size=4 -D_FORTIFY_SOURCE=2 -Wundef  conftest.c >&5
  1730. configure:24530: $? = 0
  1731. configure:24545: result: yes
  1732. configure:24513: checking to see if compiler understands -Wwrite-strings
  1733. configure:24530: gcc -m32 -std=gnu99 -c -march=x86-64 -mtune=generic -O2 -pipe -fstack-protector --param=ssp-buffer-size=4 -D_FORTIFY_SOURCE=2 -Wwrite-strings  conftest.c >&5
  1734. configure:24530: $? = 0
  1735. configure:24545: result: yes
  1736. configure:24513: checking to see if compiler understands -Wformat-nonliteral
  1737. configure:24530: gcc -m32 -std=gnu99 -c -march=x86-64 -mtune=generic -O2 -pipe -fstack-protector --param=ssp-buffer-size=4 -D_FORTIFY_SOURCE=2 -Wformat-nonliteral  conftest.c >&5
  1738. cc1: warning: -Wformat-nonliteral ignored without -Wformat [-Wformat-nonliteral]
  1739. configure:24530: $? = 0
  1740. configure:24545: result: yes
  1741. configure:24513: checking to see if compiler understands -Wformat-security
  1742. configure:24530: gcc -m32 -std=gnu99 -c -march=x86-64 -mtune=generic -O2 -pipe -fstack-protector --param=ssp-buffer-size=4 -D_FORTIFY_SOURCE=2 -Wformat-security  conftest.c >&5
  1743. cc1: warning: -Wformat-security ignored without -Wformat [-Wformat-security]
  1744. configure:24530: $? = 0
  1745. configure:24545: result: yes
  1746. configure:24513: checking to see if compiler understands -Winit-self
  1747. configure:24530: gcc -m32 -std=gnu99 -c -march=x86-64 -mtune=generic -O2 -pipe -fstack-protector --param=ssp-buffer-size=4 -D_FORTIFY_SOURCE=2 -Winit-self  conftest.c >&5
  1748. configure:24530: $? = 0
  1749. configure:24545: result: yes
  1750. configure:24513: checking to see if compiler understands -Wmissing-include-dirs
  1751. configure:24530: gcc -m32 -std=gnu99 -c -march=x86-64 -mtune=generic -O2 -pipe -fstack-protector --param=ssp-buffer-size=4 -D_FORTIFY_SOURCE=2 -Wmissing-include-dirs  conftest.c >&5
  1752. configure:24530: $? = 0
  1753. configure:24545: result: yes
  1754. configure:24513: checking to see if compiler understands -Waddress
  1755. configure:24530: gcc -m32 -std=gnu99 -c -march=x86-64 -mtune=generic -O2 -pipe -fstack-protector --param=ssp-buffer-size=4 -D_FORTIFY_SOURCE=2 -Waddress  conftest.c >&5
  1756. configure:24530: $? = 0
  1757. configure:24545: result: yes
  1758. configure:24513: checking to see if compiler understands -Waggregate-return
  1759. configure:24530: gcc -m32 -std=gnu99 -c -march=x86-64 -mtune=generic -O2 -pipe -fstack-protector --param=ssp-buffer-size=4 -D_FORTIFY_SOURCE=2 -Waggregate-return  conftest.c >&5
  1760. configure:24530: $? = 0
  1761. configure:24545: result: yes
  1762. configure:24513: checking to see if compiler understands -Wno-multichar
  1763. configure:24530: gcc -m32 -std=gnu99 -c -march=x86-64 -mtune=generic -O2 -pipe -fstack-protector --param=ssp-buffer-size=4 -D_FORTIFY_SOURCE=2 -Wno-multichar  conftest.c >&5
  1764. configure:24530: $? = 0
  1765. configure:24545: result: yes
  1766. configure:24513: checking to see if compiler understands -Wnested-externs
  1767. configure:24530: gcc -m32 -std=gnu99 -c -march=x86-64 -mtune=generic -O2 -pipe -fstack-protector --param=ssp-buffer-size=4 -D_FORTIFY_SOURCE=2 -Wnested-externs  conftest.c >&5
  1768. configure:24530: $? = 0
  1769. configure:24545: result: yes
  1770. configure:24557: set WARNING_CFLAGS to  -Wall -Wdeclaration-after-statement -Wvla -Wpointer-arith -Wmissing-declarations -Wmissing-prototypes -Wredundant-decls -Wundef -Wwrite-strings -Wformat-nonliteral -Wformat-security -Winit-self -Wmissing-include-dirs -Waddress -Waggregate-return -Wno-multichar -Wnested-externs
  1771. configure:24559: set ERROR_CFLAGS to
  1772. configure:24566: checking to see if c++ compiler understands
  1773. configure:24590: g++ -m32 -c -march=x86-64 -mtune=generic -O2 -pipe -fstack-protector --param=ssp-buffer-size=4 -D_FORTIFY_SOURCE=2   conftest.cpp >&5
  1774. configure:24590: $? = 0
  1775. configure:24613: result: yes
  1776. configure:24626: checking to see if c++ compiler understands -Wall
  1777. configure:24650: g++ -m32 -c -march=x86-64 -mtune=generic -O2 -pipe -fstack-protector --param=ssp-buffer-size=4 -D_FORTIFY_SOURCE=2  -Wall conftest.cpp >&5
  1778. configure:24650: $? = 0
  1779. configure:24673: result: yes
  1780. configure:24987: checking to see if c++ compiler understands -Wmissing-declarations
  1781. configure:25011: g++ -m32 -c -march=x86-64 -mtune=generic -O2 -pipe -fstack-protector --param=ssp-buffer-size=4 -D_FORTIFY_SOURCE=2  -Wmissing-declarations conftest.cpp >&5
  1782. configure:25011: $? = 0
  1783. configure:25034: result: yes
  1784. configure:24987: checking to see if c++ compiler understands -Wredundant-decls
  1785. configure:25011: g++ -m32 -c -march=x86-64 -mtune=generic -O2 -pipe -fstack-protector --param=ssp-buffer-size=4 -D_FORTIFY_SOURCE=2  -Wredundant-decls conftest.cpp >&5
  1786. configure:25011: $? = 0
  1787. configure:25034: result: yes
  1788. configure:24987: checking to see if c++ compiler understands -Wundef
  1789. configure:25011: g++ -m32 -c -march=x86-64 -mtune=generic -O2 -pipe -fstack-protector --param=ssp-buffer-size=4 -D_FORTIFY_SOURCE=2  -Wundef conftest.cpp >&5
  1790. configure:25011: $? = 0
  1791. configure:25034: result: yes
  1792. configure:24987: checking to see if c++ compiler understands -Wwrite-strings
  1793. configure:25011: g++ -m32 -c -march=x86-64 -mtune=generic -O2 -pipe -fstack-protector --param=ssp-buffer-size=4 -D_FORTIFY_SOURCE=2  -Wwrite-strings conftest.cpp >&5
  1794. configure:25011: $? = 0
  1795. configure:25034: result: yes
  1796. configure:24987: checking to see if c++ compiler understands -Wformat-nonliteral
  1797. configure:25011: g++ -m32 -c -march=x86-64 -mtune=generic -O2 -pipe -fstack-protector --param=ssp-buffer-size=4 -D_FORTIFY_SOURCE=2  -Wformat-nonliteral conftest.cpp >&5
  1798. cc1plus: warning: -Wformat-nonliteral ignored without -Wformat [-Wformat-nonliteral]
  1799. configure:25011: $? = 0
  1800. configure:25034: result: yes
  1801. configure:24987: checking to see if c++ compiler understands -Wformat-security
  1802. configure:25011: g++ -m32 -c -march=x86-64 -mtune=generic -O2 -pipe -fstack-protector --param=ssp-buffer-size=4 -D_FORTIFY_SOURCE=2  -Wformat-security conftest.cpp >&5
  1803. cc1plus: warning: -Wformat-security ignored without -Wformat [-Wformat-security]
  1804. configure:25011: $? = 0
  1805. configure:25034: result: yes
  1806. configure:24987: checking to see if c++ compiler understands -Winit-self
  1807. configure:25011: g++ -m32 -c -march=x86-64 -mtune=generic -O2 -pipe -fstack-protector --param=ssp-buffer-size=4 -D_FORTIFY_SOURCE=2  -Winit-self conftest.cpp >&5
  1808. configure:25011: $? = 0
  1809. configure:25034: result: yes
  1810. configure:24987: checking to see if c++ compiler understands -Wmissing-include-dirs
  1811. configure:25011: g++ -m32 -c -march=x86-64 -mtune=generic -O2 -pipe -fstack-protector --param=ssp-buffer-size=4 -D_FORTIFY_SOURCE=2  -Wmissing-include-dirs conftest.cpp >&5
  1812. configure:25011: $? = 0
  1813. configure:25034: result: yes
  1814. configure:24987: checking to see if c++ compiler understands -Waddress
  1815. configure:25011: g++ -m32 -c -march=x86-64 -mtune=generic -O2 -pipe -fstack-protector --param=ssp-buffer-size=4 -D_FORTIFY_SOURCE=2  -Waddress conftest.cpp >&5
  1816. configure:25011: $? = 0
  1817. configure:25034: result: yes
  1818. configure:24987: checking to see if c++ compiler understands -Waggregate-return
  1819. configure:25011: g++ -m32 -c -march=x86-64 -mtune=generic -O2 -pipe -fstack-protector --param=ssp-buffer-size=4 -D_FORTIFY_SOURCE=2  -Waggregate-return conftest.cpp >&5
  1820. configure:25011: $? = 0
  1821. configure:25034: result: yes
  1822. configure:24987: checking to see if c++ compiler understands -Wno-multichar
  1823. configure:25011: g++ -m32 -c -march=x86-64 -mtune=generic -O2 -pipe -fstack-protector --param=ssp-buffer-size=4 -D_FORTIFY_SOURCE=2  -Wno-multichar conftest.cpp >&5
  1824. configure:25011: $? = 0
  1825. configure:25034: result: yes
  1826. configure:25046: set WARNING_CXXFLAGS to  -Wall -Wmissing-declarations -Wredundant-decls -Wundef -Wwrite-strings -Wformat-nonliteral -Wformat-security -Winit-self -Wmissing-include-dirs -Waddress -Waggregate-return -Wno-multichar
  1827. configure:25048: set ERROR_CXXFLAGS to
  1828. configure:25097: Using autoaudiosink as default audio sink
  1829. configure:25122: Using alsasrc as default audio source
  1830. configure:25147: Using autovideosink as default video sink
  1831. configure:25172: Using v4l2src as default video source
  1832. configure:25197: Using goom as default visualizer
  1833. configure:25219: checking which audio resample format to use for integer
  1834. configure:25228: result: auto
  1835. configure:26056: checking whether to use iso-codes if they are available
  1836. configure:26059: result: yes
  1837. configure:26062: checking whether iso-codes are available on this system
  1838. configure:26065: result: yes
  1839. configure:26067: checking whether iso-codes has iso-639 domain
  1840. configure:26070: result: yes
  1841. configure:26072: checking for iso-codes prefix
  1842. configure:26076: result: yes
  1843. configure:26078: checking ISO_CODES_PREFIX
  1844. configure:26080: result: /usr
  1845. configure:26083: checking ISO_639_DOMAIN
  1846. configure:26085: result: iso_639
  1847. configure:26137: Checking libraries for plugins in sys/
  1848. configure:26142: *** checking feature: X libraries and plugins ***
  1849. configure:26146: *** for plug-ins: ximagesink ***
  1850. configure:26187: checking X11/Xlib.h usability
  1851. configure:26187: gcc -m32 -std=gnu99 -c -march=x86-64 -mtune=generic -O2 -pipe -fstack-protector --param=ssp-buffer-size=4 -D_FORTIFY_SOURCE=2    conftest.c >&5
  1852. configure:26187: $? = 0
  1853. configure:26187: result: yes
  1854. configure:26187: checking X11/Xlib.h presence
  1855. configure:26187: gcc -m32 -E   conftest.c
  1856. configure:26187: $? = 0
  1857. configure:26187: result: yes
  1858. configure:26187: checking for X11/Xlib.h
  1859. configure:26187: result: yes
  1860. configure:26220: *** These plugins will be built: ximagesink
  1861. configure:26251: *** checking feature: X11 XVideo extensions ***
  1862. configure:26255: *** for plug-ins: xvimagesink ***
  1863. configure:26293: checking for XvQueryExtension in -lXv_pic
  1864. configure:26318: gcc -m32 -std=gnu99 -o conftest -march=x86-64 -mtune=generic -O2 -pipe -fstack-protector --param=ssp-buffer-size=4 -D_FORTIFY_SOURCE=2  -Wl,-O1,--sort-common,--as-needed,-z,relro,--hash-style=gnu conftest.c -lXv_pic    -lX11 -lXext  >&5
  1865. /usr/bin/ld: cannot find -lXv_pic
  1866. collect2: ld returned 1 exit status
  1867. configure:26318: $? = 1
  1868. configure: failed program was:
  1869. | /* confdefs.h */
  1870. | #define PACKAGE_NAME "GStreamer Base Plug-ins"
  1871. | #define PACKAGE_TARNAME "gst-plugins-base"
  1872. | #define PACKAGE_VERSION "0.10.35"
  1873. | #define PACKAGE_STRING "GStreamer Base Plug-ins 0.10.35"
  1874. | #define PACKAGE_BUGREPORT "http://bugzilla.gnome.org/enter_bug.cgi?product=GStreamer"
  1875. | #define PACKAGE_URL ""
  1876. | #define PACKAGE "gst-plugins-base"
  1877. | #define VERSION "0.10.35"
  1878. | #define STDC_HEADERS 1
  1879. | #define HAVE_SYS_TYPES_H 1
  1880. | #define HAVE_SYS_STAT_H 1
  1881. | #define HAVE_STDLIB_H 1
  1882. | #define HAVE_STRING_H 1
  1883. | #define HAVE_MEMORY_H 1
  1884. | #define HAVE_STRINGS_H 1
  1885. | #define HAVE_INTTYPES_H 1
  1886. | #define HAVE_STDINT_H 1
  1887. | #define HAVE_UNISTD_H 1
  1888. | #define HAVE_DLFCN_H 1
  1889. | #define LT_OBJDIR ".libs/"
  1890. | #define ENABLE_NLS 1
  1891. | #define HAVE_GETTEXT 1
  1892. | #define HAVE_DCGETTEXT 1
  1893. | #define GETTEXT_PACKAGE "gst-plugins-base-0.10"
  1894. | #define LOCALEDIR "/usr/share/locale"
  1895. | #define GST_PACKAGE_NAME "GStreamer Base Plugins (Archlinux)"
  1896. | #define GST_PACKAGE_ORIGIN "http://www.archlinux.org/"
  1897. | #define GST_INSTALL_PLUGINS_HELPER "/usr/libexec/gst-install-plugins-helper"
  1898. | #define HAVE_EXTERNAL /**/
  1899. | #define HAVE_EXPERIMENTAL /**/
  1900. | #define HAVE_CPU_X86_64 1
  1901. | #define HOST_CPU "x86_64"
  1902. | #define _FILE_OFFSET_BITS 64
  1903. | #define STDC_HEADERS 1
  1904. | #define HAVE_MALLOC_H 1
  1905. | #define HAVE_SYS_SOCKET_H 1
  1906. | #define HAVE_SYS_TYPES_H 1
  1907. | #define HAVE_SYS_WAIT_H 1
  1908. | #define HAVE_SYS_STAT_H 1
  1909. | #define HAVE_LOCALTIME_R 1
  1910. | #define HAVE_GMTIME_R 1
  1911. | #define HAVE_LOG2 1
  1912. | #define HAVE_FIONREAD_IN_SYS_IOCTL 1
  1913. | #define HAVE_FSEEKO 1
  1914. | #define HAVE_LRINT 1
  1915. | #define HAVE_LRINTF 1
  1916. | #define HAVE_PRETTY_FUNCTION 1
  1917. | #define HAVE_FUNCTION 1
  1918. | #define HAVE_FUNC 1
  1919. | #define GST_FUNCTION __PRETTY_FUNCTION__
  1920. | #define HAVE_ORC 1
  1921. | #define GST_LICENSE "LGPL"
  1922. | #define PLUGINDIR "/usr/lib32/gstreamer-0.10"
  1923. | #define GST_PACKAGE_RELEASE_DATETIME "2011-06-15"
  1924. | #define GST_LEVEL_DEFAULT GST_LEVEL_NONE
  1925. | #define DEFAULT_AUDIOSINK "autoaudiosink"
  1926. | #define DEFAULT_AUDIOSRC "alsasrc"
  1927. | #define DEFAULT_VIDEOSINK "autovideosink"
  1928. | #define DEFAULT_VIDEOSRC "v4l2src"
  1929. | #define DEFAULT_VISUALIZER "goom"
  1930. | #define GST_DATADIR "/usr/share"
  1931. | #define GST_MAJORMINOR "0.10"
  1932. | #define AUDIORESAMPLE_FORMAT_AUTO 1
  1933. | #define HAVE_ISO_CODES 1
  1934. | #define ISO_CODES_PREFIX "/usr"
  1935. | #define ISO_CODES_VERSION "3.32"
  1936. | #define HAVE_X /**/
  1937. | /* end confdefs.h.  */
  1938. |
  1939. | /* Override any GCC internal prototype to avoid an error.
  1940. |    Use char because int might match the return type of a GCC
  1941. |    builtin and then its argument prototype would still apply.  */
  1942. | #ifdef __cplusplus
  1943. | extern "C"
  1944. | #endif
  1945. | char XvQueryExtension ();
  1946. | int
  1947. | main ()
  1948. | {
  1949. | return XvQueryExtension ();
  1950. |   ;
  1951. |   return 0;
  1952. | }
  1953. configure:26327: result: no
  1954. configure:26341: checking for XvQueryExtension in -lXv
  1955. configure:26366: gcc -m32 -std=gnu99 -o conftest -march=x86-64 -mtune=generic -O2 -pipe -fstack-protector --param=ssp-buffer-size=4 -D_FORTIFY_SOURCE=2  -Wl,-O1,--sort-common,--as-needed,-z,relro,--hash-style=gnu conftest.c -lXv    -lX11 -lXext  >&5
  1956. configure:26366: $? = 0
  1957. configure:26375: result: yes
  1958. configure:26403: *** These plugins will be built: xvimagesink
  1959. configure:26434: *** checking feature: X Shared Memory extension ***
  1960. configure:26475: checking for XShmAttach in -lXext
  1961. configure:26500: gcc -m32 -std=gnu99 -o conftest -march=x86-64 -mtune=generic -O2 -pipe -fstack-protector --param=ssp-buffer-size=4 -D_FORTIFY_SOURCE=2  -Wl,-O1,--sort-common,--as-needed,-z,relro,--hash-style=gnu conftest.c -lXext    -lX11  >&5
  1962. configure:26500: $? = 0
  1963. configure:26509: result: yes
  1964. configure:26611: *** checking feature: Video 4 Linux ***
  1965. configure:26615: *** for plug-ins: video4linux ***
  1966. configure:26651: checking whether VID_TYPE_MPEG_ENCODER is declared
  1967. configure:26651: gcc -m32 -std=gnu99 -c -march=x86-64 -mtune=generic -O2 -pipe -fstack-protector --param=ssp-buffer-size=4 -D_FORTIFY_SOURCE=2  conftest.c >&5
  1968. conftest.c:76:28: fatal error: linux/videodev.h: No such file or directory
  1969. compilation terminated.
  1970. configure:26651: $? = 1
  1971. configure: failed program was:
  1972. | /* confdefs.h */
  1973. | #define PACKAGE_NAME "GStreamer Base Plug-ins"
  1974. | #define PACKAGE_TARNAME "gst-plugins-base"
  1975. | #define PACKAGE_VERSION "0.10.35"
  1976. | #define PACKAGE_STRING "GStreamer Base Plug-ins 0.10.35"
  1977. | #define PACKAGE_BUGREPORT "http://bugzilla.gnome.org/enter_bug.cgi?product=GStreamer"
  1978. | #define PACKAGE_URL ""
  1979. | #define PACKAGE "gst-plugins-base"
  1980. | #define VERSION "0.10.35"
  1981. | #define STDC_HEADERS 1
  1982. | #define HAVE_SYS_TYPES_H 1
  1983. | #define HAVE_SYS_STAT_H 1
  1984. | #define HAVE_STDLIB_H 1
  1985. | #define HAVE_STRING_H 1
  1986. | #define HAVE_MEMORY_H 1
  1987. | #define HAVE_STRINGS_H 1
  1988. | #define HAVE_INTTYPES_H 1
  1989. | #define HAVE_STDINT_H 1
  1990. | #define HAVE_UNISTD_H 1
  1991. | #define HAVE_DLFCN_H 1
  1992. | #define LT_OBJDIR ".libs/"
  1993. | #define ENABLE_NLS 1
  1994. | #define HAVE_GETTEXT 1
  1995. | #define HAVE_DCGETTEXT 1
  1996. | #define GETTEXT_PACKAGE "gst-plugins-base-0.10"
  1997. | #define LOCALEDIR "/usr/share/locale"
  1998. | #define GST_PACKAGE_NAME "GStreamer Base Plugins (Archlinux)"
  1999. | #define GST_PACKAGE_ORIGIN "http://www.archlinux.org/"
  2000. | #define GST_INSTALL_PLUGINS_HELPER "/usr/libexec/gst-install-plugins-helper"
  2001. | #define HAVE_EXTERNAL /**/
  2002. | #define HAVE_EXPERIMENTAL /**/
  2003. | #define HAVE_CPU_X86_64 1
  2004. | #define HOST_CPU "x86_64"
  2005. | #define _FILE_OFFSET_BITS 64
  2006. | #define STDC_HEADERS 1
  2007. | #define HAVE_MALLOC_H 1
  2008. | #define HAVE_SYS_SOCKET_H 1
  2009. | #define HAVE_SYS_TYPES_H 1
  2010. | #define HAVE_SYS_WAIT_H 1
  2011. | #define HAVE_SYS_STAT_H 1
  2012. | #define HAVE_LOCALTIME_R 1
  2013. | #define HAVE_GMTIME_R 1
  2014. | #define HAVE_LOG2 1
  2015. | #define HAVE_FIONREAD_IN_SYS_IOCTL 1
  2016. | #define HAVE_FSEEKO 1
  2017. | #define HAVE_LRINT 1
  2018. | #define HAVE_LRINTF 1
  2019. | #define HAVE_PRETTY_FUNCTION 1
  2020. | #define HAVE_FUNCTION 1
  2021. | #define HAVE_FUNC 1
  2022. | #define GST_FUNCTION __PRETTY_FUNCTION__
  2023. | #define HAVE_ORC 1
  2024. | #define GST_LICENSE "LGPL"
  2025. | #define PLUGINDIR "/usr/lib32/gstreamer-0.10"
  2026. | #define GST_PACKAGE_RELEASE_DATETIME "2011-06-15"
  2027. | #define GST_LEVEL_DEFAULT GST_LEVEL_NONE
  2028. | #define DEFAULT_AUDIOSINK "autoaudiosink"
  2029. | #define DEFAULT_AUDIOSRC "alsasrc"
  2030. | #define DEFAULT_VIDEOSINK "autovideosink"
  2031. | #define DEFAULT_VIDEOSRC "v4l2src"
  2032. | #define DEFAULT_VISUALIZER "goom"
  2033. | #define GST_DATADIR "/usr/share"
  2034. | #define GST_MAJORMINOR "0.10"
  2035. | #define AUDIORESAMPLE_FORMAT_AUTO 1
  2036. | #define HAVE_ISO_CODES 1
  2037. | #define ISO_CODES_PREFIX "/usr"
  2038. | #define ISO_CODES_VERSION "3.32"
  2039. | #define HAVE_X /**/
  2040. | #define HAVE_XVIDEO /**/
  2041. | #define HAVE_XSHM /**/
  2042. | /* end confdefs.h.  */
  2043. |
  2044. | #include <sys/types.h>
  2045. | #define _LINUX_TIME_H
  2046. | #define __user
  2047. | #include <linux/videodev.h>
  2048. |
  2049. |
  2050. | int
  2051. | main ()
  2052. | {
  2053. | #ifndef VID_TYPE_MPEG_ENCODER
  2054. | #ifdef __cplusplus
  2055. |   (void) VID_TYPE_MPEG_ENCODER;
  2056. | #else
  2057. |   (void) VID_TYPE_MPEG_ENCODER;
  2058. | #endif
  2059. | #endif
  2060. |
  2061. |   ;
  2062. |   return 0;
  2063. | }
  2064. configure:26651: result: no
  2065. configure:26696: *** These plugins will not be built: video4linux
  2066. configure:26817: Checking libraries for plugins in ext/
  2067. configure:26822: *** checking feature: ALSA ***
  2068. configure:26826: *** for plug-ins: alsa ***
  2069. configure:26864: checking for ALSA
  2070. configure:26872: $PKG_CONFIG --exists --print-errors "alsa >= 0.9.1"
  2071. configure:26875: $? = 0
  2072. configure:26890: $PKG_CONFIG --exists --print-errors "alsa >= 0.9.1"
  2073. configure:26893: $? = 0
  2074. configure:27337: result: yes
  2075. configure:27356: *** These plugins will be built: alsa
  2076. configure:27387: *** checking feature: CDParanoia ***
  2077. configure:27391: *** for plug-ins: cdparanoia ***
  2078. configure:27429: checking for CDPARANOIA
  2079. configure:27437: $PKG_CONFIG --exists --print-errors "cdparanoia-3 >= 10.2"
  2080. Package cdparanoia-3 was not found in the pkg-config search path.
  2081. Perhaps you should add the directory containing `cdparanoia-3.pc'
  2082. to the PKG_CONFIG_PATH environment variable
  2083. No package 'cdparanoia-3' found
  2084. configure:27440: $? = 1
  2085. configure:27455: $PKG_CONFIG --exists --print-errors "cdparanoia-3 >= 10.2"
  2086. Package cdparanoia-3 was not found in the pkg-config search path.
  2087. Perhaps you should add the directory containing `cdparanoia-3.pc'
  2088. to the PKG_CONFIG_PATH environment variable
  2089. No package 'cdparanoia-3' found
  2090. configure:27458: $? = 1
  2091. No package 'cdparanoia-3' found
  2092. configure:27486: result: no
  2093. configure:27490: checking for cdda_open in -lcdda_interface
  2094. configure:27515: gcc -m32 -std=gnu99 -o conftest -march=x86-64 -mtune=generic -O2 -pipe -fstack-protector --param=ssp-buffer-size=4 -D_FORTIFY_SOURCE=2  -Wl,-O1,--sort-common,--as-needed,-z,relro,--hash-style=gnu conftest.c -lcdda_interface -lm  >&5
  2095. /usr/bin/ld: skipping incompatible /usr/lib/gcc/x86_64-unknown-linux-gnu/4.6.2/../../../libcdda_interface.so when searching for -lcdda_interface
  2096. /usr/bin/ld: skipping incompatible /usr/lib/gcc/x86_64-unknown-linux-gnu/4.6.2/../../../libcdda_interface.a when searching for -lcdda_interface
  2097. /usr/bin/ld: skipping incompatible /usr/lib/libcdda_interface.so when searching for -lcdda_interface
  2098. /usr/bin/ld: skipping incompatible /usr/lib/libcdda_interface.a when searching for -lcdda_interface
  2099. /usr/bin/ld: cannot find -lcdda_interface
  2100. collect2: ld returned 1 exit status
  2101. configure:27515: $? = 1
  2102. configure: failed program was:
  2103. | /* confdefs.h */
  2104. | #define PACKAGE_NAME "GStreamer Base Plug-ins"
  2105. | #define PACKAGE_TARNAME "gst-plugins-base"
  2106. | #define PACKAGE_VERSION "0.10.35"
  2107. | #define PACKAGE_STRING "GStreamer Base Plug-ins 0.10.35"
  2108. | #define PACKAGE_BUGREPORT "http://bugzilla.gnome.org/enter_bug.cgi?product=GStreamer"
  2109. | #define PACKAGE_URL ""
  2110. | #define PACKAGE "gst-plugins-base"
  2111. | #define VERSION "0.10.35"
  2112. | #define STDC_HEADERS 1
  2113. | #define HAVE_SYS_TYPES_H 1
  2114. | #define HAVE_SYS_STAT_H 1
  2115. | #define HAVE_STDLIB_H 1
  2116. | #define HAVE_STRING_H 1
  2117. | #define HAVE_MEMORY_H 1
  2118. | #define HAVE_STRINGS_H 1
  2119. | #define HAVE_INTTYPES_H 1
  2120. | #define HAVE_STDINT_H 1
  2121. | #define HAVE_UNISTD_H 1
  2122. | #define HAVE_DLFCN_H 1
  2123. | #define LT_OBJDIR ".libs/"
  2124. | #define ENABLE_NLS 1
  2125. | #define HAVE_GETTEXT 1
  2126. | #define HAVE_DCGETTEXT 1
  2127. | #define GETTEXT_PACKAGE "gst-plugins-base-0.10"
  2128. | #define LOCALEDIR "/usr/share/locale"
  2129. | #define GST_PACKAGE_NAME "GStreamer Base Plugins (Archlinux)"
  2130. | #define GST_PACKAGE_ORIGIN "http://www.archlinux.org/"
  2131. | #define GST_INSTALL_PLUGINS_HELPER "/usr/libexec/gst-install-plugins-helper"
  2132. | #define HAVE_EXTERNAL /**/
  2133. | #define HAVE_EXPERIMENTAL /**/
  2134. | #define HAVE_CPU_X86_64 1
  2135. | #define HOST_CPU "x86_64"
  2136. | #define _FILE_OFFSET_BITS 64
  2137. | #define STDC_HEADERS 1
  2138. | #define HAVE_MALLOC_H 1
  2139. | #define HAVE_SYS_SOCKET_H 1
  2140. | #define HAVE_SYS_TYPES_H 1
  2141. | #define HAVE_SYS_WAIT_H 1
  2142. | #define HAVE_SYS_STAT_H 1
  2143. | #define HAVE_LOCALTIME_R 1
  2144. | #define HAVE_GMTIME_R 1
  2145. | #define HAVE_LOG2 1
  2146. | #define HAVE_FIONREAD_IN_SYS_IOCTL 1
  2147. | #define HAVE_FSEEKO 1
  2148. | #define HAVE_LRINT 1
  2149. | #define HAVE_LRINTF 1
  2150. | #define HAVE_PRETTY_FUNCTION 1
  2151. | #define HAVE_FUNCTION 1
  2152. | #define HAVE_FUNC 1
  2153. | #define GST_FUNCTION __PRETTY_FUNCTION__
  2154. | #define HAVE_ORC 1
  2155. | #define GST_LICENSE "LGPL"
  2156. | #define PLUGINDIR "/usr/lib32/gstreamer-0.10"
  2157. | #define GST_PACKAGE_RELEASE_DATETIME "2011-06-15"
  2158. | #define GST_LEVEL_DEFAULT GST_LEVEL_NONE
  2159. | #define DEFAULT_AUDIOSINK "autoaudiosink"
  2160. | #define DEFAULT_AUDIOSRC "alsasrc"
  2161. | #define DEFAULT_VIDEOSINK "autovideosink"
  2162. | #define DEFAULT_VIDEOSRC "v4l2src"
  2163. | #define DEFAULT_VISUALIZER "goom"
  2164. | #define GST_DATADIR "/usr/share"
  2165. | #define GST_MAJORMINOR "0.10"
  2166. | #define AUDIORESAMPLE_FORMAT_AUTO 1
  2167. | #define HAVE_ISO_CODES 1
  2168. | #define ISO_CODES_PREFIX "/usr"
  2169. | #define ISO_CODES_VERSION "3.32"
  2170. | #define HAVE_X /**/
  2171. | #define HAVE_XVIDEO /**/
  2172. | #define HAVE_XSHM /**/
  2173. | #define HAVE_ALSA /**/
  2174. | /* end confdefs.h.  */
  2175. |
  2176. | /* Override any GCC internal prototype to avoid an error.
  2177. |    Use char because int might match the return type of a GCC
  2178. |    builtin and then its argument prototype would still apply.  */
  2179. | #ifdef __cplusplus
  2180. | extern "C"
  2181. | #endif
  2182. | char cdda_open ();
  2183. | int
  2184. | main ()
  2185. | {
  2186. | return cdda_open ();
  2187. |   ;
  2188. |   return 0;
  2189. | }
  2190. configure:27524: result: no
  2191. configure:27557: checking for cdda_open in -lcdda_interface
  2192. configure:27591: result: no
  2193. configure:27902: *** These plugins will not be built: cdparanoia
  2194. configure:27920: *** checking feature: GNOME VFS ***
  2195. configure:27924: *** for plug-ins: gnomevfs ***
  2196. configure:28071: *** These plugins will not be built: gnomevfs
  2197. configure:28089: *** checking feature: integer vorbis plug-in ***
  2198. configure:28093: *** for plug-ins: ivorbisdec ***
  2199. configure:28135: checking for IVORBIS
  2200. configure:28143: $PKG_CONFIG --exists --print-errors "$which"
  2201. Package vorbisidec was not found in the pkg-config search path.
  2202. Perhaps you should add the directory containing `vorbisidec.pc'
  2203. to the PKG_CONFIG_PATH environment variable
  2204. No package 'vorbisidec' found
  2205. configure:28146: $? = 1
  2206. configure:28161: $PKG_CONFIG --exists --print-errors "$which"
  2207. Package vorbisidec was not found in the pkg-config search path.
  2208. Perhaps you should add the directory containing `vorbisidec.pc'
  2209. to the PKG_CONFIG_PATH environment variable
  2210. No package 'vorbisidec' found
  2211. configure:28164: $? = 1
  2212. No package 'vorbisidec' found
  2213. configure:28192: result: no
  2214. configure:28199: No package 'vorbisidec' found
  2215. configure:28228: checking for vorbis_block_init in -lvorbisidec
  2216. configure:28253: gcc -m32 -std=gnu99 -o conftest -march=x86-64 -mtune=generic -O2 -pipe -fstack-protector --param=ssp-buffer-size=4 -D_FORTIFY_SOURCE=2  -Wl,-O1,--sort-common,--as-needed,-z,relro,--hash-style=gnu conftest.c -lvorbisidec   >&5
  2217. /usr/bin/ld: cannot find -lvorbisidec
  2218. collect2: ld returned 1 exit status
  2219. configure:28253: $? = 1
  2220. configure: failed program was:
  2221. | /* confdefs.h */
  2222. | #define PACKAGE_NAME "GStreamer Base Plug-ins"
  2223. | #define PACKAGE_TARNAME "gst-plugins-base"
  2224. | #define PACKAGE_VERSION "0.10.35"
  2225. | #define PACKAGE_STRING "GStreamer Base Plug-ins 0.10.35"
  2226. | #define PACKAGE_BUGREPORT "http://bugzilla.gnome.org/enter_bug.cgi?product=GStreamer"
  2227. | #define PACKAGE_URL ""
  2228. | #define PACKAGE "gst-plugins-base"
  2229. | #define VERSION "0.10.35"
  2230. | #define STDC_HEADERS 1
  2231. | #define HAVE_SYS_TYPES_H 1
  2232. | #define HAVE_SYS_STAT_H 1
  2233. | #define HAVE_STDLIB_H 1
  2234. | #define HAVE_STRING_H 1
  2235. | #define HAVE_MEMORY_H 1
  2236. | #define HAVE_STRINGS_H 1
  2237. | #define HAVE_INTTYPES_H 1
  2238. | #define HAVE_STDINT_H 1
  2239. | #define HAVE_UNISTD_H 1
  2240. | #define HAVE_DLFCN_H 1
  2241. | #define LT_OBJDIR ".libs/"
  2242. | #define ENABLE_NLS 1
  2243. | #define HAVE_GETTEXT 1
  2244. | #define HAVE_DCGETTEXT 1
  2245. | #define GETTEXT_PACKAGE "gst-plugins-base-0.10"
  2246. | #define LOCALEDIR "/usr/share/locale"
  2247. | #define GST_PACKAGE_NAME "GStreamer Base Plugins (Archlinux)"
  2248. | #define GST_PACKAGE_ORIGIN "http://www.archlinux.org/"
  2249. | #define GST_INSTALL_PLUGINS_HELPER "/usr/libexec/gst-install-plugins-helper"
  2250. | #define HAVE_EXTERNAL /**/
  2251. | #define HAVE_EXPERIMENTAL /**/
  2252. | #define HAVE_CPU_X86_64 1
  2253. | #define HOST_CPU "x86_64"
  2254. | #define _FILE_OFFSET_BITS 64
  2255. | #define STDC_HEADERS 1
  2256. | #define HAVE_MALLOC_H 1
  2257. | #define HAVE_SYS_SOCKET_H 1
  2258. | #define HAVE_SYS_TYPES_H 1
  2259. | #define HAVE_SYS_WAIT_H 1
  2260. | #define HAVE_SYS_STAT_H 1
  2261. | #define HAVE_LOCALTIME_R 1
  2262. | #define HAVE_GMTIME_R 1
  2263. | #define HAVE_LOG2 1
  2264. | #define HAVE_FIONREAD_IN_SYS_IOCTL 1
  2265. | #define HAVE_FSEEKO 1
  2266. | #define HAVE_LRINT 1
  2267. | #define HAVE_LRINTF 1
  2268. | #define HAVE_PRETTY_FUNCTION 1
  2269. | #define HAVE_FUNCTION 1
  2270. | #define HAVE_FUNC 1
  2271. | #define GST_FUNCTION __PRETTY_FUNCTION__
  2272. | #define HAVE_ORC 1
  2273. | #define GST_LICENSE "LGPL"
  2274. | #define PLUGINDIR "/usr/lib32/gstreamer-0.10"
  2275. | #define GST_PACKAGE_RELEASE_DATETIME "2011-06-15"
  2276. | #define GST_LEVEL_DEFAULT GST_LEVEL_NONE
  2277. | #define DEFAULT_AUDIOSINK "autoaudiosink"
  2278. | #define DEFAULT_AUDIOSRC "alsasrc"
  2279. | #define DEFAULT_VIDEOSINK "autovideosink"
  2280. | #define DEFAULT_VIDEOSRC "v4l2src"
  2281. | #define DEFAULT_VISUALIZER "goom"
  2282. | #define GST_DATADIR "/usr/share"
  2283. | #define GST_MAJORMINOR "0.10"
  2284. | #define AUDIORESAMPLE_FORMAT_AUTO 1
  2285. | #define HAVE_ISO_CODES 1
  2286. | #define ISO_CODES_PREFIX "/usr"
  2287. | #define ISO_CODES_VERSION "3.32"
  2288. | #define HAVE_X /**/
  2289. | #define HAVE_XVIDEO /**/
  2290. | #define HAVE_XSHM /**/
  2291. | #define HAVE_ALSA /**/
  2292. | /* end confdefs.h.  */
  2293. |
  2294. | /* Override any GCC internal prototype to avoid an error.
  2295. |    Use char because int might match the return type of a GCC
  2296. |    builtin and then its argument prototype would still apply.  */
  2297. | #ifdef __cplusplus
  2298. | extern "C"
  2299. | #endif
  2300. | char vorbis_block_init ();
  2301. | int
  2302. | main ()
  2303. | {
  2304. | return vorbis_block_init ();
  2305. |   ;
  2306. |   return 0;
  2307. | }
  2308. configure:28262: result: no
  2309. configure:28348: *** These plugins will not be built: ivorbisdec
  2310. configure:28366: *** checking feature: GIO library ***
  2311. configure:28370: *** for plug-ins: gio ***
  2312. configure:28408: checking for GIO
  2313. configure:28416: $PKG_CONFIG --exists --print-errors "gio-2.0 >= 2.16"
  2314. configure:28419: $? = 0
  2315. configure:28434: $PKG_CONFIG --exists --print-errors "gio-2.0 >= 2.16"
  2316. configure:28437: $? = 0
  2317. configure:28477: result: yes
  2318. configure:28509: *** These plugins will be built: gio
  2319. configure:28540: *** checking feature: libvisual visualization library ***
  2320. configure:28544: *** for plug-ins: libvisual ***
  2321. configure:28586: checking for LIBVISUAL
  2322. configure:28594: $PKG_CONFIG --exists --print-errors "$which"
  2323. configure:28597: $? = 0
  2324. configure:28612: $PKG_CONFIG --exists --print-errors "$which"
  2325. configure:28615: $? = 0
  2326. configure:28667: result: yes
  2327. configure:28780: libvisual pluginsdir: /usr/lib32/libvisual-0.4
  2328. configure:28800: *** These plugins will be built: libvisual
  2329. configure:28831: *** checking feature: Xiph Ogg library ***
  2330. configure:28835: *** for plug-ins: ogg ***
  2331. configure:28877: checking for OGG
  2332. configure:28885: $PKG_CONFIG --exists --print-errors "$which"
  2333. configure:28888: $? = 0
  2334. configure:28903: $PKG_CONFIG --exists --print-errors "$which"
  2335. configure:28906: $? = 0
  2336. configure:28958: result: yes
  2337. configure:29138: *** These plugins will be built: ogg
  2338. configure:29169: *** checking feature: Pango font rendering ***
  2339. configure:29173: *** for plug-ins: pango ***
  2340. configure:29215: checking for PANGO
  2341. configure:29223: $PKG_CONFIG --exists --print-errors "$which"
  2342. configure:29226: $? = 0
  2343. configure:29241: $PKG_CONFIG --exists --print-errors "$which"
  2344. configure:29244: $? = 0
  2345. configure:29296: result: yes
  2346. configure:29315: *** These plugins will be built: pango
  2347. configure:29346: *** checking feature: Xiph Theora video codec ***
  2348. configure:29350: *** for plug-ins: theora ***
  2349. configure:29392: checking for THEORA
  2350. configure:29400: $PKG_CONFIG --exists --print-errors "$which"
  2351. configure:29403: $? = 0
  2352. configure:29418: $PKG_CONFIG --exists --print-errors "$which"
  2353. configure:29421: $? = 0
  2354. configure:29473: result: yes
  2355. configure:29492: *** These plugins will be built: theora
  2356. configure:29523: *** checking feature: Xiph Vorbis audio codec ***
  2357. configure:29527: *** for plug-ins: vorbis ***
  2358. configure:29569: checking for VORBIS
  2359. configure:29577: $PKG_CONFIG --exists --print-errors "$which"
  2360. configure:29580: $? = 0
  2361. configure:29595: $PKG_CONFIG --exists --print-errors "$which"
  2362. configure:29598: $? = 0
  2363. configure:29650: result: yes
  2364. configure:29854: *** These plugins will be built: vorbis
  2365. configure:29903: gcc -m32 -std=gnu99 -c -march=x86-64 -mtune=generic -O2 -pipe -fstack-protector --param=ssp-buffer-size=4 -D_FORTIFY_SOURCE=2  conftest.c >&5
  2366. configure:29903: $? = 0
  2367. configure:30005: checking for FT2
  2368. configure:30013: $PKG_CONFIG --exists --print-errors "freetype2 >= 2.0.9"
  2369. configure:30016: $? = 0
  2370. configure:30031: $PKG_CONFIG --exists --print-errors "freetype2 >= 2.0.9"
  2371. configure:30034: $? = 0
  2372. configure:30470: result: yes
  2373. configure:31051: creating ./config.status
  2374.  
  2375. ## ---------------------- ##
  2376. ## Running config.status. ##
  2377. ## ---------------------- ##
  2378.  
  2379. This file was extended by GStreamer Base Plug-ins config.status 0.10.35, which was
  2380. generated by GNU Autoconf 2.68.  Invocation command line was
  2381.  
  2382.   CONFIG_FILES    =
  2383.   CONFIG_HEADERS  =
  2384.   CONFIG_LINKS    =
  2385.   CONFIG_COMMANDS =
  2386.   $ ./config.status
  2387.  
  2388. on jupiter
  2389.  
  2390. config.status:1667: creating Makefile
  2391. config.status:1667: creating gst-plugins-base.spec
  2392. config.status:1667: creating gst/Makefile
  2393. config.status:1667: creating gst/adder/Makefile
  2394. config.status:1667: creating gst/app/Makefile
  2395. config.status:1667: creating gst/audioconvert/Makefile
  2396. config.status:1667: creating gst/audiorate/Makefile
  2397. config.status:1667: creating gst/audiotestsrc/Makefile
  2398. config.status:1667: creating gst/encoding/Makefile
  2399. config.status:1667: creating gst/ffmpegcolorspace/Makefile
  2400. config.status:1667: creating gst/gdp/Makefile
  2401. config.status:1667: creating gst/playback/Makefile
  2402. config.status:1667: creating gst/audioresample/Makefile
  2403. config.status:1667: creating gst/subparse/Makefile
  2404. config.status:1667: creating gst/tcp/Makefile
  2405. config.status:1667: creating gst/typefind/Makefile
  2406. config.status:1667: creating gst/videotestsrc/Makefile
  2407. config.status:1667: creating gst/videorate/Makefile
  2408. config.status:1667: creating gst/videoscale/Makefile
  2409. config.status:1667: creating gst/volume/Makefile
  2410. config.status:1667: creating sys/Makefile
  2411. config.status:1667: creating sys/ximage/Makefile
  2412. config.status:1667: creating sys/xvimage/Makefile
  2413. config.status:1667: creating sys/v4l/Makefile
  2414. config.status:1667: creating ext/Makefile
  2415. config.status:1667: creating ext/alsa/Makefile
  2416. config.status:1667: creating ext/cdparanoia/Makefile
  2417. config.status:1667: creating ext/gnomevfs/Makefile
  2418. config.status:1667: creating ext/gio/Makefile
  2419. config.status:1667: creating ext/libvisual/Makefile
  2420. config.status:1667: creating ext/ogg/Makefile
  2421. config.status:1667: creating ext/pango/Makefile
  2422. config.status:1667: creating ext/theora/Makefile
  2423. config.status:1667: creating ext/vorbis/Makefile
  2424. config.status:1667: creating gst-libs/Makefile
  2425. config.status:1667: creating gst-libs/gst/Makefile
  2426. config.status:1667: creating gst-libs/gst/audio/Makefile
  2427. config.status:1667: creating gst-libs/gst/app/Makefile
  2428. config.status:1667: creating gst-libs/gst/cdda/Makefile
  2429. config.status:1667: creating gst-libs/gst/fft/Makefile
  2430. config.status:1667: creating gst-libs/gst/floatcast/Makefile
  2431. config.status:1667: creating gst-libs/gst/interfaces/Makefile
  2432. config.status:1667: creating gst-libs/gst/netbuffer/Makefile
  2433. config.status:1667: creating gst-libs/gst/riff/Makefile
  2434. config.status:1667: creating gst-libs/gst/rtp/Makefile
  2435. config.status:1667: creating gst-libs/gst/rtsp/Makefile
  2436. config.status:1667: creating gst-libs/gst/sdp/Makefile
  2437. config.status:1667: creating gst-libs/gst/tag/Makefile
  2438. config.status:1667: creating gst-libs/gst/pbutils/Makefile
  2439. config.status:1667: creating gst-libs/gst/pbutils/gstpluginsbaseversion.h
  2440. config.status:1667: creating gst-libs/gst/video/Makefile
  2441. config.status:1667: creating tools/Makefile
  2442. config.status:1667: creating pkgconfig/Makefile
  2443. config.status:1667: creating pkgconfig/gstreamer-audio.pc
  2444. config.status:1667: creating pkgconfig/gstreamer-audio-uninstalled.pc
  2445. config.status:1667: creating pkgconfig/gstreamer-app.pc
  2446. config.status:1667: creating pkgconfig/gstreamer-app-uninstalled.pc
  2447. config.status:1667: creating pkgconfig/gstreamer-cdda.pc
  2448. config.status:1667: creating pkgconfig/gstreamer-cdda-uninstalled.pc
  2449. config.status:1667: creating pkgconfig/gstreamer-fft.pc
  2450. config.status:1667: creating pkgconfig/gstreamer-fft-uninstalled.pc
  2451. config.status:1667: creating pkgconfig/gstreamer-floatcast.pc
  2452. config.status:1667: creating pkgconfig/gstreamer-floatcast-uninstalled.pc
  2453. config.status:1667: creating pkgconfig/gstreamer-interfaces.pc
  2454. config.status:1667: creating pkgconfig/gstreamer-interfaces-uninstalled.pc
  2455. config.status:1667: creating pkgconfig/gstreamer-netbuffer.pc
  2456. config.status:1667: creating pkgconfig/gstreamer-netbuffer-uninstalled.pc
  2457. config.status:1667: creating pkgconfig/gstreamer-pbutils.pc
  2458. config.status:1667: creating pkgconfig/gstreamer-pbutils-uninstalled.pc
  2459. config.status:1667: creating pkgconfig/gstreamer-riff.pc
  2460. config.status:1667: creating pkgconfig/gstreamer-riff-uninstalled.pc
  2461. config.status:1667: creating pkgconfig/gstreamer-rtp.pc
  2462. config.status:1667: creating pkgconfig/gstreamer-rtp-uninstalled.pc
  2463. config.status:1667: creating pkgconfig/gstreamer-rtsp.pc
  2464. config.status:1667: creating pkgconfig/gstreamer-rtsp-uninstalled.pc
  2465. config.status:1667: creating pkgconfig/gstreamer-sdp.pc
  2466. config.status:1667: creating pkgconfig/gstreamer-sdp-uninstalled.pc
  2467. config.status:1667: creating pkgconfig/gstreamer-tag.pc
  2468. config.status:1667: creating pkgconfig/gstreamer-tag-uninstalled.pc
  2469. config.status:1667: creating pkgconfig/gstreamer-video.pc
  2470. config.status:1667: creating pkgconfig/gstreamer-video-uninstalled.pc
  2471. config.status:1667: creating pkgconfig/gstreamer-plugins-base.pc
  2472. config.status:1667: creating pkgconfig/gstreamer-plugins-base-uninstalled.pc
  2473. config.status:1667: creating tests/Makefile
  2474. config.status:1667: creating tests/check/Makefile
  2475. config.status:1667: creating tests/examples/Makefile
  2476. config.status:1667: creating tests/examples/app/Makefile
  2477. config.status:1667: creating tests/examples/dynamic/Makefile
  2478. config.status:1667: creating tests/examples/encoding/Makefile
  2479. config.status:1667: creating tests/examples/gio/Makefile
  2480. config.status:1667: creating tests/examples/overlay/Makefile
  2481. config.status:1667: creating tests/examples/seek/Makefile
  2482. config.status:1667: creating tests/examples/snapshot/Makefile
  2483. config.status:1667: creating tests/examples/playrec/Makefile
  2484. config.status:1667: creating tests/examples/volume/Makefile
  2485. config.status:1667: creating tests/examples/v4l/Makefile
  2486. config.status:1667: creating tests/files/Makefile
  2487. config.status:1667: creating tests/icles/Makefile
  2488. config.status:1667: creating tests/icles/playback/Makefile
  2489. config.status:1667: creating docs/Makefile
  2490. config.status:1667: creating docs/design/Makefile
  2491. config.status:1667: creating docs/libs/Makefile
  2492. config.status:1667: creating docs/plugins/Makefile
  2493. config.status:1667: creating docs/version.entities
  2494. config.status:1667: creating po/Makefile.in
  2495. config.status:1667: creating common/Makefile
  2496. config.status:1667: creating common/m4/Makefile
  2497. config.status:1667: creating m4/Makefile
  2498. config.status:1667: creating config.h
  2499. config.status:1848: config.h is unchanged
  2500. config.status:1896: executing depfiles commands
  2501. config.status:1896: executing libtool commands
  2502. config.status:1896: executing po-directories commands
  2503. config.status:1896: executing _stdint.h commands
  2504. config.status:2917: creating _stdint.h : _GST_PLUGINS_BASE__STDINT_H
  2505. config.status:3349: _stdint.h is unchanged
  2506.  
  2507. ## ---------------- ##
  2508. ## Cache variables. ##
  2509. ## ---------------- ##
  2510.  
  2511. _cv_gst_fionread_in_sys_ioctl=yes
  2512. ac_cv_audioresample_format=auto
  2513. ac_cv_build=x86_64-unknown-linux-gnu
  2514. ac_cv_c99_lrint=yes
  2515. ac_cv_c99_lrintf=yes
  2516. ac_cv_c_bigendian=no
  2517. ac_cv_c_compiler_gnu=yes
  2518. ac_cv_cxx_compiler_gnu=yes
  2519. ac_cv_env_ALSA_CFLAGS_set=
  2520. ac_cv_env_ALSA_CFLAGS_value=
  2521. ac_cv_env_ALSA_LIBS_set=
  2522. ac_cv_env_ALSA_LIBS_value=
  2523. ac_cv_env_CCC_set=
  2524. ac_cv_env_CCC_value=
  2525. ac_cv_env_CC_set=set
  2526. ac_cv_env_CC_value='gcc -m32'
  2527. ac_cv_env_CDPARANOIA_CFLAGS_set=
  2528. ac_cv_env_CDPARANOIA_CFLAGS_value=
  2529. ac_cv_env_CDPARANOIA_LIBS_set=
  2530. ac_cv_env_CDPARANOIA_LIBS_value=
  2531. ac_cv_env_CFLAGS_set=set
  2532. ac_cv_env_CFLAGS_value='-march=x86-64 -mtune=generic -O2 -pipe -fstack-protector --param=ssp-buffer-size=4 -D_FORTIFY_SOURCE=2'
  2533. ac_cv_env_CPPFLAGS_set=
  2534. ac_cv_env_CPPFLAGS_value=
  2535. ac_cv_env_CPP_set=
  2536. ac_cv_env_CPP_value=
  2537. ac_cv_env_CXXCPP_set=
  2538. ac_cv_env_CXXCPP_value=
  2539. ac_cv_env_CXXFLAGS_set=set
  2540. ac_cv_env_CXXFLAGS_value='-march=x86-64 -mtune=generic -O2 -pipe -fstack-protector --param=ssp-buffer-size=4 -D_FORTIFY_SOURCE=2'
  2541. ac_cv_env_CXX_set=set
  2542. ac_cv_env_CXX_value='g++ -m32'
  2543. ac_cv_env_FT2_CFLAGS_set=
  2544. ac_cv_env_FT2_CFLAGS_value=
  2545. ac_cv_env_FT2_LIBS_set=
  2546. ac_cv_env_FT2_LIBS_value=
  2547. ac_cv_env_GIO_CFLAGS_set=
  2548. ac_cv_env_GIO_CFLAGS_value=
  2549. ac_cv_env_GIO_LIBS_set=
  2550. ac_cv_env_GIO_LIBS_value=
  2551. ac_cv_env_GLIB_CFLAGS_set=
  2552. ac_cv_env_GLIB_CFLAGS_value=
  2553. ac_cv_env_GLIB_LIBS_set=
  2554. ac_cv_env_GLIB_LIBS_value=
  2555. ac_cv_env_GNOME_VFS_CFLAGS_set=
  2556. ac_cv_env_GNOME_VFS_CFLAGS_value=
  2557. ac_cv_env_GNOME_VFS_LIBS_set=
  2558. ac_cv_env_GNOME_VFS_LIBS_value=
  2559. ac_cv_env_GST_BASE_CFLAGS_set=
  2560. ac_cv_env_GST_BASE_CFLAGS_value=
  2561. ac_cv_env_GST_BASE_LIBS_set=
  2562. ac_cv_env_GST_BASE_LIBS_value=
  2563. ac_cv_env_GST_CFLAGS_set=
  2564. ac_cv_env_GST_CFLAGS_value=
  2565. ac_cv_env_GST_CHECK_CFLAGS_set=
  2566. ac_cv_env_GST_CHECK_CFLAGS_value=
  2567. ac_cv_env_GST_CHECK_LIBS_set=
  2568. ac_cv_env_GST_CHECK_LIBS_value=
  2569. ac_cv_env_GST_CONTROLLER_CFLAGS_set=
  2570. ac_cv_env_GST_CONTROLLER_CFLAGS_value=
  2571. ac_cv_env_GST_CONTROLLER_LIBS_set=
  2572. ac_cv_env_GST_CONTROLLER_LIBS_value=
  2573. ac_cv_env_GST_GDP_CFLAGS_set=
  2574. ac_cv_env_GST_GDP_CFLAGS_value=
  2575. ac_cv_env_GST_GDP_LIBS_set=
  2576. ac_cv_env_GST_GDP_LIBS_value=
  2577. ac_cv_env_GST_LIBS_set=
  2578. ac_cv_env_GST_LIBS_value=
  2579. ac_cv_env_GTK_CFLAGS_set=
  2580. ac_cv_env_GTK_CFLAGS_value=
  2581. ac_cv_env_GTK_LIBS_set=
  2582. ac_cv_env_GTK_LIBS_value=
  2583. ac_cv_env_GTK_X11_CFLAGS_set=
  2584. ac_cv_env_GTK_X11_CFLAGS_value=
  2585. ac_cv_env_GTK_X11_LIBS_set=
  2586. ac_cv_env_GTK_X11_LIBS_value=
  2587. ac_cv_env_GUDEV_CFLAGS_set=
  2588. ac_cv_env_GUDEV_CFLAGS_value=
  2589. ac_cv_env_GUDEV_LIBS_set=
  2590. ac_cv_env_GUDEV_LIBS_value=
  2591. ac_cv_env_IVORBIS_CFLAGS_set=
  2592. ac_cv_env_IVORBIS_CFLAGS_value=
  2593. ac_cv_env_IVORBIS_LIBS_set=
  2594. ac_cv_env_IVORBIS_LIBS_value=
  2595. ac_cv_env_LDFLAGS_set=set
  2596. ac_cv_env_LDFLAGS_value=-Wl,-O1,--sort-common,--as-needed,-z,relro,--hash-style=gnu
  2597. ac_cv_env_LIBS_set=
  2598. ac_cv_env_LIBS_value=
  2599. ac_cv_env_LIBVISUAL_CFLAGS_set=
  2600. ac_cv_env_LIBVISUAL_CFLAGS_value=
  2601. ac_cv_env_LIBVISUAL_LIBS_set=
  2602. ac_cv_env_LIBVISUAL_LIBS_value=
  2603. ac_cv_env_OGG_CFLAGS_set=
  2604. ac_cv_env_OGG_CFLAGS_value=
  2605. ac_cv_env_OGG_LIBS_set=
  2606. ac_cv_env_OGG_LIBS_value=
  2607. ac_cv_env_ORC_CFLAGS_set=
  2608. ac_cv_env_ORC_CFLAGS_value=
  2609. ac_cv_env_ORC_LIBS_set=
  2610. ac_cv_env_ORC_LIBS_value=
  2611. ac_cv_env_PANGO_CFLAGS_set=
  2612. ac_cv_env_PANGO_CFLAGS_value=
  2613. ac_cv_env_PANGO_LIBS_set=
  2614. ac_cv_env_PANGO_LIBS_value=
  2615. ac_cv_env_PKG_CONFIG_set=
  2616. ac_cv_env_PKG_CONFIG_value=
  2617. ac_cv_env_QT_CFLAGS_set=
  2618. ac_cv_env_QT_CFLAGS_value=
  2619. ac_cv_env_QT_LIBS_set=
  2620. ac_cv_env_QT_LIBS_value=
  2621. ac_cv_env_THEORA_CFLAGS_set=
  2622. ac_cv_env_THEORA_CFLAGS_value=
  2623. ac_cv_env_THEORA_LIBS_set=
  2624. ac_cv_env_THEORA_LIBS_value=
  2625. ac_cv_env_VALGRIND_CFLAGS_set=
  2626. ac_cv_env_VALGRIND_CFLAGS_value=
  2627. ac_cv_env_VALGRIND_LIBS_set=
  2628. ac_cv_env_VALGRIND_LIBS_value=
  2629. ac_cv_env_VORBIS_CFLAGS_set=
  2630. ac_cv_env_VORBIS_CFLAGS_value=
  2631. ac_cv_env_VORBIS_LIBS_set=
  2632. ac_cv_env_VORBIS_LIBS_value=
  2633. ac_cv_env_build_alias_set=
  2634. ac_cv_env_build_alias_value=
  2635. ac_cv_env_host_alias_set=
  2636. ac_cv_env_host_alias_value=
  2637. ac_cv_env_target_alias_set=
  2638. ac_cv_env_target_alias_value=
  2639. ac_cv_func_dlopen=no
  2640. ac_cv_func_gethostbyname=yes
  2641. ac_cv_func_gmtime_r=yes
  2642. ac_cv_func_hstrerror=yes
  2643. ac_cv_func_localtime_r=yes
  2644. ac_cv_func_log2=yes
  2645. ac_cv_func_shl_load=no
  2646. ac_cv_func_socket=yes
  2647. ac_cv_have_decl_VID_TYPE_MPEG_ENCODER=no
  2648. ac_cv_header_X11_Xlib_h=yes
  2649. ac_cv_header_dlfcn_h=yes
  2650. ac_cv_header_inttypes_h=yes
  2651. ac_cv_header_malloc_h=yes
  2652. ac_cv_header_memory_h=yes
  2653. ac_cv_header_process_h=no
  2654. ac_cv_header_stdc=yes
  2655. ac_cv_header_stdint=stdint.h
  2656. ac_cv_header_stdint_h=yes
  2657. ac_cv_header_stdint_t=stdint.h
  2658. ac_cv_header_stdlib_h=yes
  2659. ac_cv_header_string_h=yes
  2660. ac_cv_header_strings_h=yes
  2661. ac_cv_header_sys_socket_h=yes
  2662. ac_cv_header_sys_stat_h=yes
  2663. ac_cv_header_sys_types_h=yes
  2664. ac_cv_header_sys_wait_h=yes
  2665. ac_cv_header_unistd_h=yes
  2666. ac_cv_header_winsock2_h=no
  2667. ac_cv_host=x86_64-unknown-linux-gnu
  2668. ac_cv_lib_Xext_XShmAttach=yes
  2669. ac_cv_lib_Xv_XvQueryExtension=yes
  2670. ac_cv_lib_Xv_pic_XvQueryExtension=no
  2671. ac_cv_lib_cdda_interface_cdda_open=no
  2672. ac_cv_lib_dl_dlopen=yes
  2673. ac_cv_lib_dld_shl_load=no
  2674. ac_cv_lib_m_cos=yes
  2675. ac_cv_lib_vorbisidec_vorbis_block_init=no
  2676. ac_cv_objext=o
  2677. ac_cv_path_EGREP='/bin/grep -E'
  2678. ac_cv_path_FGREP='/bin/grep -F'
  2679. ac_cv_path_GMSGFMT=/usr/bin/msgfmt
  2680. ac_cv_path_GREP=/bin/grep
  2681. ac_cv_path_GTKDOC_CHECK=/usr/bin/gtkdoc-check
  2682. ac_cv_path_MSGFMT=/usr/bin/msgfmt
  2683. ac_cv_path_MSGMERGE=/usr/bin/msgmerge
  2684. ac_cv_path_PYTHON=/usr/bin/python
  2685. ac_cv_path_SED=/bin/sed
  2686. ac_cv_path_VALGRIND_PATH=no
  2687. ac_cv_path_XGETTEXT=/usr/bin/xgettext
  2688. ac_cv_path_ac_pt_PKG_CONFIG=/usr/bin/pkg-config
  2689. ac_cv_path_install='/bin/install -c'
  2690. ac_cv_path_mkdir=/bin/mkdir
  2691. ac_cv_prog_AWK=gawk
  2692. ac_cv_prog_CPP='gcc -m32 -E'
  2693. ac_cv_prog_CXXCPP='g++ -m32 -E'
  2694. ac_cv_prog_ac_ct_AR=ar
  2695. ac_cv_prog_ac_ct_CC='gcc -m32'
  2696. ac_cv_prog_ac_ct_DLLTOOL=dlltool
  2697. ac_cv_prog_ac_ct_OBJDUMP=objdump
  2698. ac_cv_prog_ac_ct_RANLIB=ranlib
  2699. ac_cv_prog_ac_ct_STRIP=strip
  2700. ac_cv_prog_cc_c89=
  2701. ac_cv_prog_cc_c99=-std=gnu99
  2702. ac_cv_prog_cc_g=yes
  2703. ac_cv_prog_cc_gcc_c_o=yes
  2704. ac_cv_prog_cc_stdc=-std=gnu99
  2705. ac_cv_prog_cxx_g=yes
  2706. ac_cv_prog_make_make_set=yes
  2707. ac_cv_stdint_message='using gnu compiler gcc (GCC) 4.6.2 20120120 (prerelease)'
  2708. ac_cv_stdint_result='(assuming C99 compatible system)'
  2709. ac_cv_sys_file_offset_bits=64
  2710. ac_cv_sys_largefile_CC=no
  2711. ac_cv_sys_largefile_source=no
  2712. acl_cv_hardcode_direct=no
  2713. acl_cv_hardcode_libdir_flag_spec='${wl}-rpath ${wl}$libdir'
  2714. acl_cv_hardcode_libdir_separator=
  2715. acl_cv_hardcode_minus_L=no
  2716. acl_cv_libext=a
  2717. acl_cv_libname_spec='lib$name'
  2718. acl_cv_library_names_spec='$libname$shrext'
  2719. acl_cv_path_LD='/usr/bin/ld -m elf_i386'
  2720. acl_cv_prog_gnu_ld=yes
  2721. acl_cv_rpath=done
  2722. acl_cv_shlibext=so
  2723. acl_cv_wl=-Wl,
  2724. am_cv_CC_dependencies_compiler_type=gcc3
  2725. am_cv_CXX_dependencies_compiler_type=gcc3
  2726. am_cv_make_support_nested_variables=yes
  2727. gst_cv_have_func=yes
  2728. gst_cv_have_function=yes
  2729. gst_cv_have_pretty_function=yes
  2730. gt_cv_func_CFLocaleCopyCurrent=no
  2731. gt_cv_func_CFPreferencesCopyAppValue=no
  2732. gt_cv_func_gnugettext1_libc=yes
  2733. lt_cv_ar_at_file=@
  2734. lt_cv_archive_cmds_need_lc=no
  2735. lt_cv_deplibs_check_method=pass_all
  2736. lt_cv_dlopen=dlopen
  2737. lt_cv_dlopen_libs=-ldl
  2738. lt_cv_dlopen_self=yes
  2739. lt_cv_dlopen_self_static=no
  2740. lt_cv_file_magic_cmd='$MAGIC_CMD'
  2741. lt_cv_file_magic_test_file=
  2742. lt_cv_ld_reload_flag=-r
  2743. lt_cv_nm_interface='BSD nm'
  2744. lt_cv_objdir=.libs
  2745. lt_cv_path_LD=/usr/bin/ld
  2746. lt_cv_path_LDCXX='/usr/bin/ld -m elf_i386'
  2747. lt_cv_path_NM='/usr/bin/nm -B'
  2748. lt_cv_path_mainfest_tool=no
  2749. lt_cv_prog_compiler_c_o=yes
  2750. lt_cv_prog_compiler_c_o_CXX=yes
  2751. lt_cv_prog_compiler_pic='-fPIC -DPIC'
  2752. lt_cv_prog_compiler_pic_CXX='-fPIC -DPIC'
  2753. lt_cv_prog_compiler_pic_works=yes
  2754. lt_cv_prog_compiler_pic_works_CXX=yes
  2755. lt_cv_prog_compiler_rtti_exceptions=no
  2756. lt_cv_prog_compiler_static_works=yes
  2757. lt_cv_prog_compiler_static_works_CXX=yes
  2758. lt_cv_prog_gnu_ld=yes
  2759. lt_cv_prog_gnu_ldcxx=yes
  2760. lt_cv_sharedlib_from_linklib_cmd='printf %s\n'
  2761. lt_cv_shlibpath_overrides_runpath=no
  2762. lt_cv_sys_global_symbol_pipe='sed -n -e '\''s/^.*[       ]\([ABCDGIRSTW][ABCDGIRSTW]*\)[         ][      ]*\([_A-Za-z][_A-Za-z0-9]*\)$/\1 \2 \2/p'\'' | sed '\''/ __gnu_lto/d'\'''
  2763. lt_cv_sys_global_symbol_to_c_name_address='sed -n -e '\''s/^: \([^ ]*\)[ ]*$/  {\"\1\", (void *) 0},/p'\'' -e '\''s/^[ABCDGIRSTW]* \([^ ]*\) \([^ ]*\)$/  {"\2", (void *) \&\2},/p'\'''
  2764. lt_cv_sys_global_symbol_to_c_name_address_lib_prefix='sed -n -e '\''s/^: \([^ ]*\)[ ]*$/  {\"\1\", (void *) 0},/p'\'' -e '\''s/^[ABCDGIRSTW]* \([^ ]*\) \(lib[^ ]*\)$/  {"\2", (void *) \&\2},/p'\'' -e '\''s/^[ABCDGIRSTW]* \([^ ]*\) \([^ ]*\)$/  {"lib\2", (void *) \&\2},/p'\'''
  2765. lt_cv_sys_global_symbol_to_cdecl='sed -n -e '\''s/^T .* \(.*\)$/extern int \1();/p'\'' -e '\''s/^[ABCDGIRSTW]* .* \(.*\)$/extern char \1;/p'\'''
  2766. lt_cv_sys_max_cmd_len=1572864
  2767. lt_cv_to_host_file_cmd=func_convert_file_noop
  2768. lt_cv_to_tool_file_cmd=func_convert_file_noop
  2769. pkg_cv_ALSA_CFLAGS='-I/usr/include/alsa  '
  2770. pkg_cv_ALSA_LIBS='-L/usr/lib32 -lasound  '
  2771. pkg_cv_FT2_CFLAGS='-I/usr/include/freetype2  '
  2772. pkg_cv_FT2_LIBS='-L/usr/lib32 -lfreetype  '
  2773. pkg_cv_GIO_CFLAGS='-pthread -I/usr/include/glib-2.0 -I/usr/lib32/glib-2.0/include  '
  2774. pkg_cv_GIO_LIBS='-pthread -L/usr/lib32 -lgio-2.0 -lgobject-2.0 -lgmodule-2.0 -lgthread-2.0 -lrt -lglib-2.0  '
  2775. pkg_cv_GLIB_CFLAGS='-pthread -I/usr/include/glib-2.0 -I/usr/lib32/glib-2.0/include  '
  2776. pkg_cv_GLIB_LIBS='-pthread -L/usr/lib32 -lgobject-2.0 -lgthread-2.0 -lgmodule-2.0 -lrt -lglib-2.0  '
  2777. pkg_cv_GST_BASE_CFLAGS='-pthread -I/usr/include/glib-2.0 -I/usr/lib32/glib-2.0/include -I/usr/include/libxml2 -I/usr/include/gstreamer-0.10  '
  2778. pkg_cv_GST_BASE_LIBS='-pthread -L/usr/lib32 -lgstbase-0.10 -lgstreamer-0.10 -lgobject-2.0 -lgmodule-2.0 -lxml2 -lgthread-2.0 -lrt -lglib-2.0  '
  2779. pkg_cv_GST_CFLAGS='-pthread -I/usr/include/glib-2.0 -I/usr/lib32/glib-2.0/include -I/usr/include/libxml2 -I/usr/include/gstreamer-0.10  '
  2780. pkg_cv_GST_CHECK_CFLAGS='-pthread -I/usr/include/glib-2.0 -I/usr/lib32/glib-2.0/include -I/usr/include/libxml2 -I/usr/include/gstreamer-0.10  '
  2781. pkg_cv_GST_CHECK_LIBS='-pthread -L/usr/lib32 -lgstcheck-0.10 -lm -lgstreamer-0.10 -lgobject-2.0 -lgmodule-2.0 -lxml2 -lgthread-2.0 -lrt -lglib-2.0  '
  2782. pkg_cv_GST_CONTROLLER_CFLAGS='-pthread -I/usr/include/glib-2.0 -I/usr/lib32/glib-2.0/include -I/usr/include/libxml2 -I/usr/include/gstreamer-0.10  '
  2783. pkg_cv_GST_CONTROLLER_LIBS='-pthread -L/usr/lib32 -lgstcontroller-0.10 -lgstreamer-0.10 -lgobject-2.0 -lgmodule-2.0 -lxml2 -lgthread-2.0 -lrt -lglib-2.0  '
  2784. pkg_cv_GST_GDP_CFLAGS='-pthread -I/usr/include/glib-2.0 -I/usr/lib32/glib-2.0/include -I/usr/include/libxml2 -I/usr/include/gstreamer-0.10  '
  2785. pkg_cv_GST_GDP_LIBS='-pthread -L/usr/lib32 -lgstdataprotocol-0.10 -lgstreamer-0.10 -lgobject-2.0 -lgmodule-2.0 -lxml2 -lgthread-2.0 -lrt -lglib-2.0  '
  2786. pkg_cv_GST_LIBS='-pthread -L/usr/lib32 -lgstreamer-0.10 -lgobject-2.0 -lgmodule-2.0 -lxml2 -lgthread-2.0 -lrt -lglib-2.0  '
  2787. pkg_cv_GTK_CFLAGS='-pthread -I/usr/include/gtk-2.0 -I/usr/lib32/gtk-2.0/include -I/usr/include/atk-1.0 -I/usr/include/cairo -I/usr/include/gdk-pixbuf-2.0 -I/usr/include/pango-1.0 -I/usr/include/glib-2.0 -I/usr/lib32/glib-2.0/include -I/usr/include/pixman-1 -I/usr/include/freetype2 -I/usr/include/libpng15  '
  2788. pkg_cv_GTK_LIBS='-pthread -L/usr/lib32 -lgtk-x11-2.0 -lgdk-x11-2.0 -latk-1.0 -lgio-2.0 -lpangoft2-1.0 -lpangocairo-1.0 -lgdk_pixbuf-2.0 -lcairo -lpango-1.0 -lfreetype -lfontconfig -lgobject-2.0 -lgmodule-2.0 -lgthread-2.0 -lrt -lglib-2.0  '
  2789. pkg_cv_GTK_X11_CFLAGS='-pthread -I/usr/include/gtk-2.0 -I/usr/lib32/gtk-2.0/include -I/usr/include/atk-1.0 -I/usr/include/cairo -I/usr/include/gdk-pixbuf-2.0 -I/usr/include/pango-1.0 -I/usr/include/glib-2.0 -I/usr/lib32/glib-2.0/include -I/usr/include/pixman-1 -I/usr/include/freetype2 -I/usr/include/libpng15  '
  2790. pkg_cv_GTK_X11_LIBS='-pthread -L/usr/lib32 -lgtk-x11-2.0 -lgdk-x11-2.0 -latk-1.0 -lgio-2.0 -lpangoft2-1.0 -lpangocairo-1.0 -lgdk_pixbuf-2.0 -lcairo -lpango-1.0 -lfreetype -lfontconfig -lgobject-2.0 -lgmodule-2.0 -lgthread-2.0 -lrt -lglib-2.0  '
  2791. pkg_cv_LIBVISUAL_CFLAGS='-I/usr/include/libvisual-0.4  '
  2792. pkg_cv_LIBVISUAL_LIBS='-L/usr/lib32 -lpthread -lm -ldl -lvisual-0.4  '
  2793. pkg_cv_OGG_CFLAGS=' '
  2794. pkg_cv_OGG_LIBS='-L/usr/lib32 -logg  '
  2795. pkg_cv_ORC_CFLAGS='-I/usr/include/orc-0.4  '
  2796. pkg_cv_ORC_LIBS='-L/usr/lib32 -lorc-0.4  '
  2797. pkg_cv_PANGO_CFLAGS='-pthread -I/usr/include/pango-1.0 -I/usr/include/glib-2.0 -I/usr/lib32/glib-2.0/include -I/usr/include/cairo -I/usr/include/pixman-1 -I/usr/include/freetype2 -I/usr/include/libpng15  '
  2798. pkg_cv_PANGO_LIBS='-pthread -L/usr/lib32 -lpangocairo-1.0 -lpango-1.0 -lcairo -lgobject-2.0 -lgmodule-2.0 -lgthread-2.0 -lrt -lglib-2.0  '
  2799. pkg_cv_QT_CFLAGS='-DQT_SHARED -I/usr/include/QtGui -I/usr/include/QtCore  '
  2800. pkg_cv_QT_LIBS='-L/usr/lib32 -lQtGui -lQtCore  '
  2801. pkg_cv_THEORA_CFLAGS=' '
  2802. pkg_cv_THEORA_LIBS='-L/usr/lib32 -ltheoraenc -ltheoradec -logg  '
  2803. pkg_cv_VORBIS_CFLAGS=' '
  2804. pkg_cv_VORBIS_LIBS='-L/usr/lib32 -lvorbisenc -lvorbis -lm -logg  '
  2805.  
  2806. ## ----------------- ##
  2807. ## Output variables. ##
  2808. ## ----------------- ##
  2809.  
  2810. ACLOCAL='${SHELL} /tmp/packerbuild-1000/lib32-gstreamer0.10-base/lib32-gstreamer0.10-base/src/gst-plugins-base-0.10.35/missing --run aclocal-1.11'
  2811. ACLOCAL_AMFLAGS='-I m4 -I common/m4'
  2812. ALSA_CFLAGS='-I/usr/include/alsa  '
  2813. ALSA_LIBS='-L/usr/lib32 -lasound  '
  2814. AMDEPBACKSLASH='\'
  2815. AMDEP_FALSE='#'
  2816. AMDEP_TRUE=''
  2817. AMTAR='$${TAR-tar}'
  2818. AM_BACKSLASH='\'
  2819. AM_DEFAULT_V='$(AM_DEFAULT_VERBOSITY)'
  2820. AM_DEFAULT_VERBOSITY='0'
  2821. AM_V='$(V)'
  2822. AR='ar'
  2823. AS='as'
  2824. AUDIORESAMPLE_FORMAT_AUTO=''
  2825. AUDIORESAMPLE_FORMAT_FLOAT=''
  2826. AUDIORESAMPLE_FORMAT_INT=''
  2827. AUTOCONF='${SHELL} /tmp/packerbuild-1000/lib32-gstreamer0.10-base/lib32-gstreamer0.10-base/src/gst-plugins-base-0.10.35/missing --run autoconf'
  2828. AUTOHEADER='${SHELL} /tmp/packerbuild-1000/lib32-gstreamer0.10-base/lib32-gstreamer0.10-base/src/gst-plugins-base-0.10.35/missing --run autoheader'
  2829. AUTOMAKE='${SHELL} /tmp/packerbuild-1000/lib32-gstreamer0.10-base/lib32-gstreamer0.10-base/src/gst-plugins-base-0.10.35/missing --run automake-1.11'
  2830. AWK='gawk'
  2831. BUILD_EXAMPLES_FALSE='#'
  2832. BUILD_EXAMPLES_TRUE=''
  2833. BUILD_EXPERIMENTAL_FALSE='#'
  2834. BUILD_EXPERIMENTAL_TRUE=''
  2835. BUILD_EXTERNAL_FALSE='#'
  2836. BUILD_EXTERNAL_TRUE=''
  2837. CC='gcc -m32 -std=gnu99'
  2838. CCASFLAGS=''
  2839. CCDEPMODE='depmode=gcc3'
  2840. CDPARANOIA_CFLAGS=''
  2841. CDPARANOIA_LIBS=''
  2842. CFLAGS='-march=x86-64 -mtune=generic -O2 -pipe -fstack-protector --param=ssp-buffer-size=4 -D_FORTIFY_SOURCE=2'
  2843. CPP='gcc -m32 -E'
  2844. CPPFLAGS=''
  2845. CXX='g++ -m32'
  2846. CXXCPP='g++ -m32 -E'
  2847. CXXDEPMODE='depmode=gcc3'
  2848. CXXFLAGS='-march=x86-64 -mtune=generic -O2 -pipe -fstack-protector --param=ssp-buffer-size=4 -D_FORTIFY_SOURCE=2'
  2849. CYGPATH_W='echo'
  2850. DEFAULT_AUDIOSINK='autoaudiosink'
  2851. DEFAULT_AUDIOSRC='alsasrc'
  2852. DEFAULT_VIDEOSINK='autovideosink'
  2853. DEFAULT_VIDEOSRC='v4l2src'
  2854. DEFAULT_VISUALIZER='goom'
  2855. DEFS='-DHAVE_CONFIG_H'
  2856. DEPDIR='.deps'
  2857. DEPRECATED_CFLAGS=''
  2858. DLLTOOL='dlltool'
  2859. DSYMUTIL=''
  2860. DUMPBIN=''
  2861. ECHO_C=''
  2862. ECHO_N='-n'
  2863. ECHO_T=''
  2864. EGREP='/bin/grep -E'
  2865. ENABLE_GTK_DOC_FALSE=''
  2866. ENABLE_GTK_DOC_TRUE='#'
  2867. ENABLE_PLUGIN_DOCS_FALSE=''
  2868. ENABLE_PLUGIN_DOCS_TRUE='#'
  2869. ERROR_CFLAGS=''
  2870. ERROR_CXXFLAGS=''
  2871. EXEEXT=''
  2872. FFLAGS=''
  2873. FGREP='/bin/grep -F'
  2874. FT2_CFLAGS='-I/usr/include/freetype2  '
  2875. FT2_CONFIG=''
  2876. FT2_LIBS='-L/usr/lib32 -lfreetype  '
  2877. GCOV=''
  2878. GCOV_CFLAGS=''
  2879. GCOV_LIBS=''
  2880. GETTEXT_MACRO_VERSION='0.17'
  2881. GETTEXT_PACKAGE='gst-plugins-base-0.10'
  2882. GIO_CFLAGS='-pthread -I/usr/include/glib-2.0 -I/usr/lib32/glib-2.0/include  '
  2883. GIO_LDFLAGS=''
  2884. GIO_LIBS='-pthread -L/usr/lib32 -lgio-2.0 -lgobject-2.0 -lgmodule-2.0 -lgthread-2.0 -lrt -lglib-2.0  '
  2885. GLIB_CFLAGS='-pthread -I/usr/include/glib-2.0 -I/usr/lib32/glib-2.0/include'
  2886. GLIB_LIBS='-pthread -L/usr/lib32 -lgobject-2.0 -lgthread-2.0 -lgmodule-2.0 -lrt -lglib-2.0  '
  2887. GLIB_PREFIX='/usr'
  2888. GLIB_REQ='2.22'
  2889. GMSGFMT='/usr/bin/msgfmt'
  2890. GMSGFMT_015='/usr/bin/msgfmt'
  2891. GNOME_VFS_CFLAGS=''
  2892. GNOME_VFS_LIBS=''
  2893. GREP='/bin/grep'
  2894. GST_AGE='24'
  2895. GST_ALL_LDFLAGS='-no-undefined -Wl,-Bsymbolic-functions'
  2896. GST_BASE_CFLAGS='-pthread -I/usr/include/glib-2.0 -I/usr/lib32/glib-2.0/include -I/usr/include/libxml2 -I/usr/include/gstreamer-0.10  '
  2897. GST_BASE_LIBS='-pthread -L/usr/lib32 -lgstbase-0.10 -lgstreamer-0.10 -lgobject-2.0 -lgmodule-2.0 -lxml2 -lgthread-2.0 -lrt -lglib-2.0  '
  2898. GST_CFLAGS='-pthread -I/usr/include/glib-2.0 -I/usr/lib32/glib-2.0/include -pthread -I/usr/include/glib-2.0 -I/usr/lib32/glib-2.0/include -I/usr/include/libxml2 -I/usr/include/gstreamer-0.10    -DG_THREADS_MANDATORY -DG_DISABLE_CAST_CHECKS -DG_DISABLE_ASSERT $(GST_OPTION_CFLAGS)'
  2899. GST_CHECK_CFLAGS='-pthread -I/usr/include/glib-2.0 -I/usr/lib32/glib-2.0/include -I/usr/include/libxml2 -I/usr/include/gstreamer-0.10  '
  2900. GST_CHECK_LIBS='-pthread -L/usr/lib32 -lgstcheck-0.10 -lm -lgstreamer-0.10 -lgobject-2.0 -lgmodule-2.0 -lxml2 -lgthread-2.0 -lrt -lglib-2.0  '
  2901. GST_CONTROLLER_CFLAGS='-pthread -I/usr/include/glib-2.0 -I/usr/lib32/glib-2.0/include -I/usr/include/libxml2 -I/usr/include/gstreamer-0.10  '
  2902. GST_CONTROLLER_LIBS='-pthread -L/usr/lib32 -lgstcontroller-0.10 -lgstreamer-0.10 -lgobject-2.0 -lgmodule-2.0 -lxml2 -lgthread-2.0 -lrt -lglib-2.0  '
  2903. GST_CURRENT='24'
  2904. GST_CXXFLAGS='-pthread -I/usr/include/glib-2.0 -I/usr/lib32/glib-2.0/include -pthread -I/usr/include/glib-2.0 -I/usr/lib32/glib-2.0/include -I/usr/include/libxml2 -I/usr/include/gstreamer-0.10    -DG_THREADS_MANDATORY -DG_DISABLE_CAST_CHECKS -DG_DISABLE_ASSERT $(GST_OPTION_CXXFLAGS)'
  2905. GST_DISABLE_ALLOC_TRACE='0'
  2906. GST_DISABLE_GST_DEBUG='0'
  2907. GST_DISABLE_LOADSAVE='0'
  2908. GST_DISABLE_PARSE='0'
  2909. GST_DISABLE_PLUGIN='0'
  2910. GST_DISABLE_REGISTRY='0'
  2911. GST_DISABLE_TRACE='0'
  2912. GST_DISABLE_XML='0'
  2913. GST_GCOV_ENABLED_FALSE=''
  2914. GST_GCOV_ENABLED_TRUE='#'
  2915. GST_GDP_CFLAGS='-pthread -I/usr/include/glib-2.0 -I/usr/lib32/glib-2.0/include -I/usr/include/libxml2 -I/usr/include/gstreamer-0.10  '
  2916. GST_GDP_LIBS='-pthread -L/usr/lib32 -lgstdataprotocol-0.10 -lgstreamer-0.10 -lgobject-2.0 -lgmodule-2.0 -lxml2 -lgthread-2.0 -lrt -lglib-2.0  '
  2917. GST_INSTALL_PLUGINS_HELPER='/usr/libexec/gst-install-plugins-helper'
  2918. GST_LEVEL_DEFAULT='GST_LEVEL_NONE'
  2919. GST_LIBS='-pthread -L/usr/lib32 -lgstreamer-0.10 -lgobject-2.0 -lgmodule-2.0 -lxml2 -lgthread-2.0 -lrt -lglib-2.0   $(GCOV_LIBS)'
  2920. GST_LIBVERSION='24:0:24'
  2921. GST_LIB_LDFLAGS='-export-symbols-regex ^_?\(gst_\|Gst\|GST_\).*'
  2922. GST_LICENSE='LGPL'
  2923. GST_LT_LDFLAGS=' -version-info 24:0:24'
  2924. GST_MAJORMINOR='0.10'
  2925. GST_OPTION_CFLAGS='$(WARNING_CFLAGS) $(ERROR_CFLAGS) $(DEBUG_CFLAGS) $(PROFILE_CFLAGS) $(GCOV_CFLAGS) $(OPT_CFLAGS) $(DEPRECATED_CFLAGS)'
  2926. GST_OPTION_CXXFLAGS='$(WARNING_CXXFLAGS) $(ERROR_CXXFLAGS) $(DEBUG_CFLAGS) $(PROFILE_CFLAGS) $(GCOV_CFLAGS) $(OPT_CFLAGS) $(DEPRECATED_CFLAGS)'
  2927. GST_PACKAGE_NAME='GStreamer Base Plugins (Archlinux)'
  2928. GST_PACKAGE_ORIGIN='http://www.archlinux.org/'
  2929. GST_PKG_CONFIG_PATH='$(top_builddir)/pkgconfig:/usr/lib32/pkgconfig'
  2930. GST_PLUGINS_ALL=' adder app audioconvert audiorate audiotestsrc encoding ffmpegcolorspace gdp playback audioresample subparse tcp typefind videotestsrc videorate videoscale volume'
  2931. GST_PLUGINS_BASE_CFLAGS='-I$(top_srcdir)/gst-libs -I$(top_builddir)/gst-libs'
  2932. GST_PLUGINS_DIR='/usr/lib/gstreamer-0.10'
  2933. GST_PLUGINS_SELECTED=' adder app audioconvert audiorate audiotestsrc encoding ffmpegcolorspace gdp playback audioresample subparse tcp typefind videotestsrc videorate videoscale volume'
  2934. GST_PLUGIN_LDFLAGS='-module -avoid-version -export-symbols-regex '\''^_*gst_plugin_desc.*'\'' -no-undefined -Wl,-Bsymbolic-functions'
  2935. GST_PREFIX='/usr'
  2936. GST_REVISION='0'
  2937. GST_TOOLS_DIR='/usr/bin'
  2938. GTKDOC_CHECK='/usr/bin/gtkdoc-check'
  2939. GTK_CFLAGS='-pthread -I/usr/include/gtk-2.0 -I/usr/lib32/gtk-2.0/include -I/usr/include/atk-1.0 -I/usr/include/cairo -I/usr/include/gdk-pixbuf-2.0 -I/usr/include/pango-1.0 -I/usr/include/glib-2.0 -I/usr/lib32/glib-2.0/include -I/usr/include/pixman-1 -I/usr/include/freetype2 -I/usr/include/libpng15  '
  2940. GTK_DOC_USE_LIBTOOL_FALSE='#'
  2941. GTK_DOC_USE_LIBTOOL_TRUE=''
  2942. GTK_LIBS='-pthread -L/usr/lib32 -lgtk-x11-2.0 -lgdk-x11-2.0 -latk-1.0 -lgio-2.0 -lpangoft2-1.0 -lpangocairo-1.0 -lgdk_pixbuf-2.0 -lcairo -lpango-1.0 -lfreetype -lfontconfig -lgobject-2.0 -lgmodule-2.0 -lgthread-2.0 -lrt -lglib-2.0  '
  2943. GTK_X11_CFLAGS='-pthread -I/usr/include/gtk-2.0 -I/usr/lib32/gtk-2.0/include -I/usr/include/atk-1.0 -I/usr/include/cairo -I/usr/include/gdk-pixbuf-2.0 -I/usr/include/pango-1.0 -I/usr/include/glib-2.0 -I/usr/lib32/glib-2.0/include -I/usr/include/pixman-1 -I/usr/include/freetype2 -I/usr/include/libpng15  '
  2944. GTK_X11_LIBS='-pthread -L/usr/lib32 -lgtk-x11-2.0 -lgdk-x11-2.0 -latk-1.0 -lgio-2.0 -lpangoft2-1.0 -lpangocairo-1.0 -lgdk_pixbuf-2.0 -lcairo -lpango-1.0 -lfreetype -lfontconfig -lgobject-2.0 -lgmodule-2.0 -lgthread-2.0 -lrt -lglib-2.0  '
  2945. GUDEV_CFLAGS=''
  2946. GUDEV_LIBS=''
  2947. HAVE_CDPARANOIA='no'
  2948. HAVE_CPU_ALPHA_FALSE=''
  2949. HAVE_CPU_ALPHA_TRUE='#'
  2950. HAVE_CPU_ARM_FALSE=''
  2951. HAVE_CPU_ARM_TRUE='#'
  2952. HAVE_CPU_CRISV32_FALSE=''
  2953. HAVE_CPU_CRISV32_TRUE='#'
  2954. HAVE_CPU_CRIS_FALSE=''
  2955. HAVE_CPU_CRIS_TRUE='#'
  2956. HAVE_CPU_HPPA_FALSE=''
  2957. HAVE_CPU_HPPA_TRUE='#'
  2958. HAVE_CPU_I386_FALSE=''
  2959. HAVE_CPU_I386_TRUE='#'
  2960. HAVE_CPU_IA64_FALSE=''
  2961. HAVE_CPU_IA64_TRUE='#'
  2962. HAVE_CPU_M68K_FALSE=''
  2963. HAVE_CPU_M68K_TRUE='#'
  2964. HAVE_CPU_MIPS_FALSE=''
  2965. HAVE_CPU_MIPS_TRUE='#'
  2966. HAVE_CPU_PPC64_FALSE=''
  2967. HAVE_CPU_PPC64_TRUE='#'
  2968. HAVE_CPU_PPC_FALSE=''
  2969. HAVE_CPU_PPC_TRUE='#'
  2970. HAVE_CPU_S390_FALSE=''
  2971. HAVE_CPU_S390_TRUE='#'
  2972. HAVE_CPU_SPARC_FALSE=''
  2973. HAVE_CPU_SPARC_TRUE='#'
  2974. HAVE_CPU_X86_64_FALSE='#'
  2975. HAVE_CPU_X86_64_TRUE=''
  2976. HAVE_CXX_FALSE='#'
  2977. HAVE_CXX_TRUE=''
  2978. HAVE_FT2_FALSE='#'
  2979. HAVE_FT2_TRUE=''
  2980. HAVE_GST_CHECK_FALSE='#'
  2981. HAVE_GST_CHECK_TRUE=''
  2982. HAVE_GTK_FALSE='#'
  2983. HAVE_GTK_TRUE=''
  2984. HAVE_GTK_X11_FALSE='#'
  2985. HAVE_GTK_X11_TRUE=''
  2986. HAVE_INTROSPECTION_FALSE=''
  2987. HAVE_INTROSPECTION_TRUE='#'
  2988. HAVE_LIBXML_HTML_FALSE='#'
  2989. HAVE_LIBXML_HTML_TRUE=''
  2990. HAVE_LINUX_JOYSTICK_HEADERS_FALSE='#'
  2991. HAVE_LINUX_JOYSTICK_HEADERS_TRUE=''
  2992. HAVE_ORCC_FALSE='#'
  2993. HAVE_ORCC_TRUE=''
  2994. HAVE_ORC_FALSE='#'
  2995. HAVE_ORC_TRUE=''
  2996. HAVE_QT_FALSE='#'
  2997. HAVE_QT_GV_FALSE='#'
  2998. HAVE_QT_GV_TRUE=''
  2999. HAVE_QT_TRUE=''
  3000. HAVE_SYS_SOCKET_H_FALSE='#'
  3001. HAVE_SYS_SOCKET_H_TRUE=''
  3002. HAVE_VALGRIND_FALSE=''
  3003. HAVE_VALGRIND_TRUE='#'
  3004. HAVE_X='yes'
  3005. HAVE_XSHM='yes'
  3006. HSTRERROR_LIBS=''
  3007. HTML_DIR='${datadir}/gtk-doc/html'
  3008. INSTALL_DATA='${INSTALL} -m 644'
  3009. INSTALL_PROGRAM='${INSTALL}'
  3010. INSTALL_SCRIPT='${INSTALL}'
  3011. INSTALL_STRIP_PROGRAM='$(install_sh) -c -s'
  3012. INTLLIBS=''
  3013. INTL_MACOSX_LIBS=''
  3014. INTROSPECTION_COMPILER=''
  3015. INTROSPECTION_GENERATE=''
  3016. INTROSPECTION_GIRDIR=''
  3017. INTROSPECTION_SCANNER=''
  3018. INTROSPECTION_TYPELIBDIR=''
  3019. IVORBIS_CFLAGS=''
  3020. IVORBIS_LIBS=''
  3021. LD='/usr/bin/ld -m elf_i386'
  3022. LDFLAGS='-Wl,-O1,--sort-common,--as-needed,-z,relro,--hash-style=gnu'
  3023. LIBICONV='-liconv'
  3024. LIBINTL=''
  3025. LIBM='-lm'
  3026. LIBOBJS=''
  3027. LIBS=''
  3028. LIBTOOL='$(SHELL) $(top_builddir)/libtool'
  3029. LIBVISUAL_CFLAGS='-I/usr/include/libvisual-0.4  '
  3030. LIBVISUAL_LIBS='-L/usr/lib32 -lpthread -lm -ldl -lvisual-0.4  '
  3031. LIPO=''
  3032. LN_S='ln -s'
  3033. LOCALEDIR='/usr/share/locale'
  3034. LTLIBICONV='-liconv'
  3035. LTLIBINTL=''
  3036. LTLIBOBJS=''
  3037. MAINT='#'
  3038. MAINTAINER_MODE_FALSE=''
  3039. MAINTAINER_MODE_TRUE='#'
  3040. MAKEINFO='${SHELL} /tmp/packerbuild-1000/lib32-gstreamer0.10-base/lib32-gstreamer0.10-base/src/gst-plugins-base-0.10.35/missing --run makeinfo'
  3041. MANIFEST_TOOL=':'
  3042. MKDIR_P='/bin/mkdir -p'
  3043. MSGFMT='/usr/bin/msgfmt'
  3044. MSGFMT_015='/usr/bin/msgfmt'
  3045. MSGMERGE='/usr/bin/msgmerge'
  3046. NM='/usr/bin/nm -B'
  3047. NMEDIT=''
  3048. OBJDUMP='objdump'
  3049. OBJEXT='o'
  3050. OGG_CFLAGS=' '
  3051. OGG_LIBS='-L/usr/lib32 -logg  '
  3052. ORCC='/usr/bin/orcc'
  3053. ORCC_FLAGS='--compat 0.4.11'
  3054. ORC_CFLAGS='-I/usr/include/orc-0.4  '
  3055. ORC_LIBS='-L/usr/lib32 -lorc-0.4  '
  3056. OTOOL64=''
  3057. OTOOL=''
  3058. PACKAGE='gst-plugins-base'
  3059. PACKAGE_BUGREPORT='http://bugzilla.gnome.org/enter_bug.cgi?product=GStreamer'
  3060. PACKAGE_NAME='GStreamer Base Plug-ins'
  3061. PACKAGE_STRING='GStreamer Base Plug-ins 0.10.35'
  3062. PACKAGE_TARNAME='gst-plugins-base'
  3063. PACKAGE_URL=''
  3064. PACKAGE_VERSION='0.10.35'
  3065. PACKAGE_VERSION_MAJOR='0'
  3066. PACKAGE_VERSION_MICRO='35'
  3067. PACKAGE_VERSION_MINOR='10'
  3068. PACKAGE_VERSION_NANO='0'
  3069. PACKAGE_VERSION_RELEASE='1'
  3070. PANGO_CFLAGS='-pthread -I/usr/include/pango-1.0 -I/usr/include/glib-2.0 -I/usr/lib32/glib-2.0/include -I/usr/include/cairo -I/usr/include/pixman-1 -I/usr/include/freetype2 -I/usr/include/libpng15  '
  3071. PANGO_LIBS='-pthread -L/usr/lib32 -lpangocairo-1.0 -lpango-1.0 -lcairo -lgobject-2.0 -lgmodule-2.0 -lgthread-2.0 -lrt -lglib-2.0  '
  3072. PATH_SEPARATOR=':'
  3073. PKG_CONFIG='/usr/bin/pkg-config'
  3074. PLUGINDIR='/usr/lib32/gstreamer-0.10'
  3075. POSUB='po'
  3076. PROFILE_CFLAGS='-g'
  3077. PYTHON='/usr/bin/python'
  3078. PYTHON_EXEC_PREFIX='${exec_prefix}'
  3079. PYTHON_PLATFORM='linux2'
  3080. PYTHON_PREFIX='${prefix}'
  3081. PYTHON_VERSION='2.7'
  3082. QT4_MOC='/usr/bin/moc'
  3083. QT_CFLAGS='-DQT_SHARED -I/usr/include/QtGui -I/usr/include/QtCore  '
  3084. QT_LIBS='-L/usr/lib32 -lQtGui -lQtCore  '
  3085. RANLIB='ranlib'
  3086. SED='/bin/sed'
  3087. SET_MAKE=''
  3088. SHELL='/bin/sh'
  3089. STRIP='strip'
  3090. THEORA_CFLAGS=' '
  3091. THEORA_LIBS='-L/usr/lib32 -ltheoraenc -ltheoradec -logg  '
  3092. USE_ALSA_FALSE='#'
  3093. USE_ALSA_TRUE=''
  3094. USE_CDPARANOIA_FALSE=''
  3095. USE_CDPARANOIA_TRUE='#'
  3096. USE_EXPERIMENTAL_FALSE='#'
  3097. USE_EXPERIMENTAL_TRUE=''
  3098. USE_EXTERNAL_FALSE='#'
  3099. USE_EXTERNAL_TRUE=''
  3100. USE_GIO_FALSE='#'
  3101. USE_GIO_TRUE=''
  3102. USE_GNOME_VFS_FALSE=''
  3103. USE_GNOME_VFS_TRUE='#'
  3104. USE_GST_V4L_FALSE=''
  3105. USE_GST_V4L_TRUE='#'
  3106. USE_ISO_CODES_FALSE='#'
  3107. USE_ISO_CODES_TRUE=''
  3108. USE_IVORBIS_FALSE=''
  3109. USE_IVORBIS_TRUE='#'
  3110. USE_LIBVISUAL_FALSE='#'
  3111. USE_LIBVISUAL_TRUE=''
  3112. USE_NLS='yes'
  3113. USE_OGG_FALSE='#'
  3114. USE_OGG_TRUE=''
  3115. USE_PANGO_FALSE='#'
  3116. USE_PANGO_TRUE=''
  3117. USE_PLUGIN_ADDER_FALSE='#'
  3118. USE_PLUGIN_ADDER_TRUE=''
  3119. USE_PLUGIN_APP_FALSE='#'
  3120. USE_PLUGIN_APP_TRUE=''
  3121. USE_PLUGIN_AUDIOCONVERT_FALSE='#'
  3122. USE_PLUGIN_AUDIOCONVERT_TRUE=''
  3123. USE_PLUGIN_AUDIORATE_FALSE='#'
  3124. USE_PLUGIN_AUDIORATE_TRUE=''
  3125. USE_PLUGIN_AUDIORESAMPLE_FALSE='#'
  3126. USE_PLUGIN_AUDIORESAMPLE_TRUE=''
  3127. USE_PLUGIN_AUDIOTESTSRC_FALSE='#'
  3128. USE_PLUGIN_AUDIOTESTSRC_TRUE=''
  3129. USE_PLUGIN_ENCODING_FALSE='#'
  3130. USE_PLUGIN_ENCODING_TRUE=''
  3131. USE_PLUGIN_FFMPEGCOLORSPACE_FALSE='#'
  3132. USE_PLUGIN_FFMPEGCOLORSPACE_TRUE=''
  3133. USE_PLUGIN_GDP_FALSE='#'
  3134. USE_PLUGIN_GDP_TRUE=''
  3135. USE_PLUGIN_PLAYBACK_FALSE='#'
  3136. USE_PLUGIN_PLAYBACK_TRUE=''
  3137. USE_PLUGIN_SUBPARSE_FALSE='#'
  3138. USE_PLUGIN_SUBPARSE_TRUE=''
  3139. USE_PLUGIN_TCP_FALSE='#'
  3140. USE_PLUGIN_TCP_TRUE=''
  3141. USE_PLUGIN_TYPEFIND_FALSE='#'
  3142. USE_PLUGIN_TYPEFIND_TRUE=''
  3143. USE_PLUGIN_VIDEORATE_FALSE='#'
  3144. USE_PLUGIN_VIDEORATE_TRUE=''
  3145. USE_PLUGIN_VIDEOSCALE_FALSE='#'
  3146. USE_PLUGIN_VIDEOSCALE_TRUE=''
  3147. USE_PLUGIN_VIDEOTESTSRC_FALSE='#'
  3148. USE_PLUGIN_VIDEOTESTSRC_TRUE=''
  3149. USE_PLUGIN_VOLUME_FALSE='#'
  3150. USE_PLUGIN_VOLUME_TRUE=''
  3151. USE_THEORA_FALSE='#'
  3152. USE_THEORA_TRUE=''
  3153. USE_VORBIS_FALSE='#'
  3154. USE_VORBIS_TRUE=''
  3155. USE_XML_FALSE='#'
  3156. USE_XML_TRUE=''
  3157. USE_XSHM_FALSE='#'
  3158. USE_XSHM_TRUE=''
  3159. USE_XVIDEO_FALSE='#'
  3160. USE_XVIDEO_TRUE=''
  3161. USE_X_FALSE='#'
  3162. USE_X_TRUE=''
  3163. VALGRIND_CFLAGS=''
  3164. VALGRIND_LIBS=''
  3165. VALGRIND_PATH='no'
  3166. VERSION='0.10.35'
  3167. VORBISENC_LIBS=''
  3168. VORBISFILE_LIBS=''
  3169. VORBIS_CFLAGS=' '
  3170. VORBIS_LIBS='-L/usr/lib32 -lvorbisenc -lvorbis -lm -logg  '
  3171. WARNING_CFLAGS=' -Wall -Wdeclaration-after-statement -Wvla -Wpointer-arith -Wmissing-declarations -Wmissing-prototypes -Wredundant-decls -Wundef -Wwrite-strings -Wformat-nonliteral -Wformat-security -Winit-self -Wmissing-include-dirs -Waddress -Waggregate-return -Wno-multichar -Wnested-externs'
  3172. WARNING_CXXFLAGS=' -Wall -Wmissing-declarations -Wredundant-decls -Wundef -Wwrite-strings -Wformat-nonliteral -Wformat-security -Winit-self -Wmissing-include-dirs -Waddress -Waggregate-return -Wno-multichar'
  3173. WIN32_LIBS=''
  3174. XGETTEXT='/usr/bin/xgettext'
  3175. XGETTEXT_015='/usr/bin/xgettext'
  3176. XGETTEXT_EXTRA_OPTIONS=''
  3177. XSHM_LIBS='-lXext'
  3178. XVIDEO_LIBS='-lXv -lXext'
  3179. X_CFLAGS=''
  3180. X_LIBS='   -lX11'
  3181. ac_ct_AR='ar'
  3182. ac_ct_CC='gcc -m32'
  3183. ac_ct_CXX=''
  3184. ac_ct_DUMPBIN=''
  3185. am__EXEEXT_FALSE=''
  3186. am__EXEEXT_TRUE='#'
  3187. am__fastdepCC_FALSE='#'
  3188. am__fastdepCC_TRUE=''
  3189. am__fastdepCXX_FALSE='#'
  3190. am__fastdepCXX_TRUE=''
  3191. am__include='include'
  3192. am__isrc=''
  3193. am__leading_dot='.'
  3194. am__nodep='_no'
  3195. am__quote=''
  3196. am__tar='$${TAR-tar} chof - "$$tardir"'
  3197. am__untar='$${TAR-tar} xf -'
  3198. bindir='${exec_prefix}/bin'
  3199. build='x86_64-unknown-linux-gnu'
  3200. build_alias=''
  3201. build_cpu='x86_64'
  3202. build_os='linux-gnu'
  3203. build_vendor='unknown'
  3204. datadir='${datarootdir}'
  3205. datarootdir='${prefix}/share'
  3206. docdir='${datarootdir}/doc/${PACKAGE_TARNAME}'
  3207. dvidir='${docdir}'
  3208. exec_prefix='${prefix}'
  3209. host='x86_64-unknown-linux-gnu'
  3210. host_alias=''
  3211. host_cpu='x86_64'
  3212. host_os='linux-gnu'
  3213. host_vendor='unknown'
  3214. htmldir='${docdir}'
  3215. includedir='${prefix}/include'
  3216. infodir='${datarootdir}/info'
  3217. install_sh='${SHELL} /tmp/packerbuild-1000/lib32-gstreamer0.10-base/lib32-gstreamer0.10-base/src/gst-plugins-base-0.10.35/install-sh'
  3218. libdir='/usr/lib32'
  3219. libexecdir='${exec_prefix}/libexec'
  3220. localedir='${datarootdir}/locale'
  3221. localstatedir='/var'
  3222. mandir='${datarootdir}/man'
  3223. mkdir_p='/bin/mkdir -p'
  3224. oldincludedir='/usr/include'
  3225. pdfdir='${docdir}'
  3226. pkgpyexecdir='${pyexecdir}/gst-plugins-base'
  3227. pkgpythondir='${pythondir}/gst-plugins-base'
  3228. plugindir='$(libdir)/gstreamer-0.10'
  3229. prefix='/usr'
  3230. program_transform_name='s,x,x,'
  3231. psdir='${docdir}'
  3232. pyexecdir='${exec_prefix}/lib/python2.7/site-packages'
  3233. pythondir='${prefix}/lib/python2.7/site-packages'
  3234. sbindir='${exec_prefix}/sbin'
  3235. sharedstatedir='${prefix}/com'
  3236. sysconfdir='/etc'
  3237. target_alias=''
  3238.  
  3239. ## ----------- ##
  3240. ## confdefs.h. ##
  3241. ## ----------- ##
  3242.  
  3243. /* confdefs.h */
  3244. #define PACKAGE_NAME "GStreamer Base Plug-ins"
  3245. #define PACKAGE_TARNAME "gst-plugins-base"
  3246. #define PACKAGE_VERSION "0.10.35"
  3247. #define PACKAGE_STRING "GStreamer Base Plug-ins 0.10.35"
  3248. #define PACKAGE_BUGREPORT "http://bugzilla.gnome.org/enter_bug.cgi?product=GStreamer"
  3249. #define PACKAGE_URL ""
  3250. #define PACKAGE "gst-plugins-base"
  3251. #define VERSION "0.10.35"
  3252. #define STDC_HEADERS 1
  3253. #define HAVE_SYS_TYPES_H 1
  3254. #define HAVE_SYS_STAT_H 1
  3255. #define HAVE_STDLIB_H 1
  3256. #define HAVE_STRING_H 1
  3257. #define HAVE_MEMORY_H 1
  3258. #define HAVE_STRINGS_H 1
  3259. #define HAVE_INTTYPES_H 1
  3260. #define HAVE_STDINT_H 1
  3261. #define HAVE_UNISTD_H 1
  3262. #define HAVE_DLFCN_H 1
  3263. #define LT_OBJDIR ".libs/"
  3264. #define ENABLE_NLS 1
  3265. #define HAVE_GETTEXT 1
  3266. #define HAVE_DCGETTEXT 1
  3267. #define GETTEXT_PACKAGE "gst-plugins-base-0.10"
  3268. #define LOCALEDIR "/usr/share/locale"
  3269. #define GST_PACKAGE_NAME "GStreamer Base Plugins (Archlinux)"
  3270. #define GST_PACKAGE_ORIGIN "http://www.archlinux.org/"
  3271. #define GST_INSTALL_PLUGINS_HELPER "/usr/libexec/gst-install-plugins-helper"
  3272. #define HAVE_EXTERNAL /**/
  3273. #define HAVE_EXPERIMENTAL /**/
  3274. #define HAVE_CPU_X86_64 1
  3275. #define HOST_CPU "x86_64"
  3276. #define _FILE_OFFSET_BITS 64
  3277. #define STDC_HEADERS 1
  3278. #define HAVE_MALLOC_H 1
  3279. #define HAVE_SYS_SOCKET_H 1
  3280. #define HAVE_SYS_TYPES_H 1
  3281. #define HAVE_SYS_WAIT_H 1
  3282. #define HAVE_SYS_STAT_H 1
  3283. #define HAVE_LOCALTIME_R 1
  3284. #define HAVE_GMTIME_R 1
  3285. #define HAVE_LOG2 1
  3286. #define HAVE_FIONREAD_IN_SYS_IOCTL 1
  3287. #define HAVE_FSEEKO 1
  3288. #define HAVE_LRINT 1
  3289. #define HAVE_LRINTF 1
  3290. #define HAVE_PRETTY_FUNCTION 1
  3291. #define HAVE_FUNCTION 1
  3292. #define HAVE_FUNC 1
  3293. #define GST_FUNCTION __PRETTY_FUNCTION__
  3294. #define HAVE_ORC 1
  3295. #define GST_LICENSE "LGPL"
  3296. #define PLUGINDIR "/usr/lib32/gstreamer-0.10"
  3297. #define GST_PACKAGE_RELEASE_DATETIME "2011-06-15"
  3298. #define GST_LEVEL_DEFAULT GST_LEVEL_NONE
  3299. #define DEFAULT_AUDIOSINK "autoaudiosink"
  3300. #define DEFAULT_AUDIOSRC "alsasrc"
  3301. #define DEFAULT_VIDEOSINK "autovideosink"
  3302. #define DEFAULT_VIDEOSRC "v4l2src"
  3303. #define DEFAULT_VISUALIZER "goom"
  3304. #define GST_DATADIR "/usr/share"
  3305. #define GST_MAJORMINOR "0.10"
  3306. #define AUDIORESAMPLE_FORMAT_AUTO 1
  3307. #define HAVE_ISO_CODES 1
  3308. #define ISO_CODES_PREFIX "/usr"
  3309. #define ISO_CODES_VERSION "3.32"
  3310. #define HAVE_X /**/
  3311. #define HAVE_XVIDEO /**/
  3312. #define HAVE_XSHM /**/
  3313. #define HAVE_ALSA /**/
  3314. #define GIO_MODULE_DIR "/usr/lib32/gio/modules"
  3315. #define GIO_LIBDIR "/usr/lib32"
  3316. #define HAVE_GIO /**/
  3317. #define LIBVISUAL_PLUGINSBASEDIR "/usr/lib32/libvisual-0.4"
  3318. #define HAVE_LIBVISUAL /**/
  3319. #define HAVE_OGG /**/
  3320. #define HAVE_PANGO /**/
  3321. #define HAVE_THEORA /**/
  3322. #define HAVE_VORBIS /**/
  3323. #define HAVE_VORBIS_SYNTHESIS_RESTART 1
  3324.  
  3325. configure: exit 0
clone this paste RAW Paste Data