Pastebin launched a little side project called VERYVIRAL.com, check it out ;-) Want more features on Pastebin? Sign Up, it's FREE!
Guest

heroku deploy: therubyracer fails

By: mariusbutuc on Jun 6th, 2011  |  syntax: None  |  size: 57.79 KB  |  views: 190  |  expires: Never
download  |  raw  |  embed  |  report abuse  |  print
Text below is selected. Please press Ctrl+C to copy to your clipboard. (⌘+C on Mac)
  1.  
  2. -----> Heroku receiving push
  3. -----> Rails app detected
  4. -----> Detected Rails is not set to serve static_assets
  5.        Installing rails3_serve_static_assets... done
  6. -----> Configure Rails 3 to disable x-sendfile
  7.        Installing rails3_disable_x_sendfile... done
  8. -----> Configure Rails to log to stdout
  9.        Installing rails_log_stdout... done
  10. -----> Gemfile detected, running Bundler version 1.0.7
  11.        Unresolved dependencies detected; Installing...
  12.        Using --without development:test
  13.        Fetching source index for http://rubygems.org/
  14.        Installing rake (0.9.1)
  15.        Installing multi_json (1.0.3)
  16.        Installing activesupport (3.1.0.rc1)
  17.        Installing bcrypt-ruby (2.1.4) with native extensions
  18.        Installing builder (3.0.0)
  19.        Installing i18n (0.6.0)
  20.        Installing activemodel (3.1.0.rc1)
  21.        Installing erubis (2.7.0)
  22.        Installing rack (1.3.0)
  23.        Installing rack-cache (1.0.2)
  24.        Installing rack-mount (0.8.1)
  25.        Installing rack-test (0.6.0)
  26.        Installing hike (1.0.0)
  27.        Installing tilt (1.3.2)
  28.        Installing sprockets (2.0.0.beta.9)
  29.        Installing tzinfo (0.3.27)
  30.        Installing actionpack (3.1.0.rc1)
  31.        Installing mime-types (1.16)
  32.        Installing polyglot (0.3.1)
  33.        Installing treetop (1.4.9)
  34.        Installing mail (2.3.0)
  35.        Installing actionmailer (3.1.0.rc1)
  36.        Installing arel (2.1.1)
  37.        Installing activerecord (3.1.0.rc1)
  38.        Installing activeresource (3.1.0.rc1)
  39.        Installing coffee-script-source (1.1.1)
  40.        Installing execjs (1.1.0)
  41.        Installing coffee-script (2.2.0)
  42.        Installing haml (3.1.1)
  43.        Installing rack-ssl (1.3.2)
  44.        Installing thor (0.14.6)
  45.        Installing railties (3.1.0.rc1)
  46.        Installing jquery-rails (1.0.9)
  47.        Installing kgio (2.4.1) with native extensions
  48.        Using bundler (1.0.7)
  49.        Installing rails (3.1.0.rc1)
  50.        Installing sass (3.1.2)
  51.        Installing sqlite3 (1.3.3) with native extensions
  52.        Installing therubyracer (0.8.2) with native extensions /usr/ruby1.8.7/lib/ruby/site_ruby/1.8/rubygems/installer.rb:483:in `build_extensions': ERROR: Failed to build gem native extension. (Gem::Installer::ExtensionBuildError)
  53.        
  54.        /usr/ruby1.8.7/bin/ruby extconf.rb
  55.        Compiling V8
  56.        mkdir -p build
  57.        cp -r scons build
  58.        mkdir -p build/scons/install
  59.        python build/scons/setup.py install --prefix=install
  60.        running install
  61.        running build
  62.        running build_py
  63.        creating build
  64.        creating build/lib
  65.        creating build/lib/SCons
  66.        copying engine/SCons/Warnings.py -> build/lib/SCons
  67.        copying engine/SCons/SConf.py -> build/lib/SCons
  68.        copying engine/SCons/dblite.py -> build/lib/SCons
  69.        copying engine/SCons/__init__.py -> build/lib/SCons
  70.        copying engine/SCons/Action.py -> build/lib/SCons
  71.        copying engine/SCons/SConsign.py -> build/lib/SCons
  72.        copying engine/SCons/exitfuncs.py -> build/lib/SCons
  73.        copying engine/SCons/Executor.py -> build/lib/SCons
  74.        copying engine/SCons/cpp.py -> build/lib/SCons
  75.        copying engine/SCons/CacheDir.py -> build/lib/SCons
  76.        copying engine/SCons/Environment.py -> build/lib/SCons
  77.        copying engine/SCons/Job.py -> build/lib/SCons
  78.        copying engine/SCons/Errors.py -> build/lib/SCons
  79.        copying engine/SCons/Sig.py -> build/lib/SCons
  80.        copying engine/SCons/Builder.py -> build/lib/SCons
  81.        copying engine/SCons/Taskmaster.py -> build/lib/SCons
  82.        copying engine/SCons/PathList.py -> build/lib/SCons
  83.        copying engine/SCons/Util.py -> build/lib/SCons
  84.        copying engine/SCons/Defaults.py -> build/lib/SCons
  85.        copying engine/SCons/Debug.py -> build/lib/SCons
  86.        copying engine/SCons/Conftest.py -> build/lib/SCons
  87.        copying engine/SCons/Subst.py -> build/lib/SCons
  88.        copying engine/SCons/Memoize.py -> build/lib/SCons
  89.        creating build/lib/SCons/compat
  90.        copying engine/SCons/compat/_scons_optparse.py -> build/lib/SCons/compat
  91.        copying engine/SCons/compat/_scons_subprocess.py -> build/lib/SCons/compat
  92.        copying engine/SCons/compat/__init__.py -> build/lib/SCons/compat
  93.        copying engine/SCons/compat/_scons_itertools.py -> build/lib/SCons/compat
  94.        copying engine/SCons/compat/_scons_shlex.py -> build/lib/SCons/compat
  95.        copying engine/SCons/compat/builtins.py -> build/lib/SCons/compat
  96.        copying engine/SCons/compat/_scons_UserString.py -> build/lib/SCons/compat
  97.        copying engine/SCons/compat/_scons_textwrap.py -> build/lib/SCons/compat
  98.        copying engine/SCons/compat/_scons_hashlib.py -> build/lib/SCons/compat
  99.        copying engine/SCons/compat/_scons_sets15.py -> build/lib/SCons/compat
  100.        copying engine/SCons/compat/_scons_sets.py -> build/lib/SCons/compat
  101.        creating build/lib/SCons/Node
  102.        copying engine/SCons/Node/Alias.py -> build/lib/SCons/Node
  103.        copying engine/SCons/Node/__init__.py -> build/lib/SCons/Node
  104.        copying engine/SCons/Node/Python.py -> build/lib/SCons/Node
  105.        copying engine/SCons/Node/FS.py -> build/lib/SCons/Node
  106.        creating build/lib/SCons/Options
  107.        copying engine/SCons/Options/__init__.py -> build/lib/SCons/Options
  108.        copying engine/SCons/Options/ListOption.py -> build/lib/SCons/Options
  109.        copying engine/SCons/Options/BoolOption.py -> build/lib/SCons/Options
  110.        copying engine/SCons/Options/PackageOption.py -> build/lib/SCons/Options
  111.        copying engine/SCons/Options/EnumOption.py -> build/lib/SCons/Options
  112.        copying engine/SCons/Options/PathOption.py -> build/lib/SCons/Options
  113.        creating build/lib/SCons/Platform
  114.        copying engine/SCons/Platform/hpux.py -> build/lib/SCons/Platform
  115.        copying engine/SCons/Platform/posix.py -> build/lib/SCons/Platform
  116.        copying engine/SCons/Platform/__init__.py -> build/lib/SCons/Platform
  117.        copying engine/SCons/Platform/os2.py -> build/lib/SCons/Platform
  118.        copying engine/SCons/Platform/irix.py -> build/lib/SCons/Platform
  119.        copying engine/SCons/Platform/cygwin.py -> build/lib/SCons/Platform
  120.        copying engine/SCons/Platform/sunos.py -> build/lib/SCons/Platform
  121.        copying engine/SCons/Platform/aix.py -> build/lib/SCons/Platform
  122.        copying engine/SCons/Platform/darwin.py -> build/lib/SCons/Platform
  123.        copying engine/SCons/Platform/win32.py -> build/lib/SCons/Platform
  124.        creating build/lib/SCons/Scanner
  125.        copying engine/SCons/Scanner/__init__.py -> build/lib/SCons/Scanner
  126.        copying engine/SCons/Scanner/RC.py -> build/lib/SCons/Scanner
  127.        copying engine/SCons/Scanner/C.py -> build/lib/SCons/Scanner
  128.        copying engine/SCons/Scanner/Fortran.py -> build/lib/SCons/Scanner
  129.        copying engine/SCons/Scanner/LaTeX.py -> build/lib/SCons/Scanner
  130.        copying engine/SCons/Scanner/IDL.py -> build/lib/SCons/Scanner
  131.        copying engine/SCons/Scanner/Prog.py -> build/lib/SCons/Scanner
  132.        copying engine/SCons/Scanner/D.py -> build/lib/SCons/Scanner
  133.        copying engine/SCons/Scanner/Dir.py -> build/lib/SCons/Scanner
  134.        creating build/lib/SCons/Script
  135.        copying engine/SCons/Script/Interactive.py -> build/lib/SCons/Script
  136.        copying engine/SCons/Script/__init__.py -> build/lib/SCons/Script
  137.        copying engine/SCons/Script/SConsOptions.py -> build/lib/SCons/Script
  138.        copying engine/SCons/Script/SConscript.py -> build/lib/SCons/Script
  139.        copying engine/SCons/Script/Main.py -> build/lib/SCons/Script
  140.        creating build/lib/SCons/Tool
  141.        copying engine/SCons/Tool/gfortran.py -> build/lib/SCons/Tool
  142.        copying engine/SCons/Tool/bcc32.py -> build/lib/SCons/Tool
  143.        copying engine/SCons/Tool/icc.py -> build/lib/SCons/Tool
  144.        copying engine/SCons/Tool/pdftex.py -> build/lib/SCons/Tool
  145.        copying engine/SCons/Tool/sunlink.py -> build/lib/SCons/Tool
  146.        copying engine/SCons/Tool/ar.py -> build/lib/SCons/Tool
  147.        copying engine/SCons/Tool/filesystem.py -> build/lib/SCons/Tool
  148.        copying engine/SCons/Tool/mwld.py -> build/lib/SCons/Tool
  149.        copying engine/SCons/Tool/wix.py -> build/lib/SCons/Tool
  150.        copying engine/SCons/Tool/sgiar.py -> build/lib/SCons/Tool
  151.        copying engine/SCons/Tool/as.py -> build/lib/SCons/Tool
  152.        copying engine/SCons/Tool/fortran.py -> build/lib/SCons/Tool
  153.        copying engine/SCons/Tool/dvipdf.py -> build/lib/SCons/Tool
  154.        copying engine/SCons/Tool/__init__.py -> build/lib/SCons/Tool
  155.        copying engine/SCons/Tool/yacc.py -> build/lib/SCons/Tool
  156.        copying engine/SCons/Tool/msvs.py -> build/lib/SCons/Tool
  157.        copying engine/SCons/Tool/g++.py -> build/lib/SCons/Tool
  158.        copying engine/SCons/Tool/gnulink.py -> build/lib/SCons/Tool
  159.        copying engine/SCons/Tool/CVS.py -> build/lib/SCons/Tool
  160.        copying engine/SCons/Tool/ifl.py -> build/lib/SCons/Tool
  161.        copying engine/SCons/Tool/sunf95.py -> build/lib/SCons/Tool
  162.        copying engine/SCons/Tool/RCS.py -> build/lib/SCons/Tool
  163.        copying engine/SCons/Tool/tar.py -> build/lib/SCons/Tool
  164.        copying engine/SCons/Tool/tlib.py -> build/lib/SCons/Tool
  165.        copying engine/SCons/Tool/icl.py -> build/lib/SCons/Tool
  166.        copying engine/SCons/Tool/mssdk.py -> build/lib/SCons/Tool
  167.        copying engine/SCons/Tool/install.py -> build/lib/SCons/Tool
  168.        copying engine/SCons/Tool/link.py -> build/lib/SCons/Tool
  169.        copying engine/SCons/Tool/f90.py -> build/lib/SCons/Tool
  170.        copying engine/SCons/Tool/lex.py -> build/lib/SCons/Tool
  171.        copying engine/SCons/Tool/JavaCommon.py -> build/lib/SCons/Tool
  172.        copying engine/SCons/Tool/sunc++.py -> build/lib/SCons/Tool
  173.        copying engine/SCons/Tool/aixlink.py -> build/lib/SCons/Tool
  174.        copying engine/SCons/Tool/c++.py -> build/lib/SCons/Tool
  175.        copying engine/SCons/Tool/javac.py -> build/lib/SCons/Tool
  176.        copying engine/SCons/Tool/sgicc.py -> build/lib/SCons/Tool
  177.        copying engine/SCons/Tool/midl.py -> build/lib/SCons/Tool
  178.        copying engine/SCons/Tool/FortranCommon.py -> build/lib/SCons/Tool
  179.        copying engine/SCons/Tool/rpm.py -> build/lib/SCons/Tool
  180.        copying engine/SCons/Tool/nasm.py -> build/lib/SCons/Tool
  181.        copying engine/SCons/Tool/jar.py -> build/lib/SCons/Tool
  182.        copying engine/SCons/Tool/aixf77.py -> build/lib/SCons/Tool
  183.        copying engine/SCons/Tool/masm.py -> build/lib/SCons/Tool
  184.        copying engine/SCons/Tool/latex.py -> build/lib/SCons/Tool
  185.        copying engine/SCons/Tool/ilink.py -> build/lib/SCons/Tool
  186.        copying engine/SCons/Tool/mwcc.py -> build/lib/SCons/Tool
  187.        copying engine/SCons/Tool/sgic++.py -> build/lib/SCons/Tool
  188.        copying engine/SCons/Tool/default.py -> build/lib/SCons/Tool
  189.        copying engine/SCons/Tool/dvips.py -> build/lib/SCons/Tool
  190.        copying engine/SCons/Tool/zip.py -> build/lib/SCons/Tool
  191.        copying engine/SCons/Tool/mingw.py -> build/lib/SCons/Tool
  192.        copying engine/SCons/Tool/textfile.py -> build/lib/SCons/Tool
  193.        copying engine/SCons/Tool/qt.py -> build/lib/SCons/Tool
  194.        copying engine/SCons/Tool/sunf90.py -> build/lib/SCons/Tool
  195.        copying engine/SCons/Tool/aixcc.py -> build/lib/SCons/Tool
  196.        copying engine/SCons/Tool/g77.py -> build/lib/SCons/Tool
  197.        copying engine/SCons/Tool/PharLapCommon.py -> build/lib/SCons/Tool
  198.        copying engine/SCons/Tool/hpcc.py -> build/lib/SCons/Tool
  199.        copying engine/SCons/Tool/Perforce.py -> build/lib/SCons/Tool
  200.        copying engine/SCons/Tool/mslib.py -> build/lib/SCons/Tool
  201.        copying engine/SCons/Tool/ipkg.py -> build/lib/SCons/Tool
  202.        copying engine/SCons/Tool/SCCS.py -> build/lib/SCons/Tool
  203.        copying engine/SCons/Tool/pdf.py -> build/lib/SCons/Tool
  204.        copying engine/SCons/Tool/gas.py -> build/lib/SCons/Tool
  205.        copying engine/SCons/Tool/Subversion.py -> build/lib/SCons/Tool
  206.        copying engine/SCons/Tool/gs.py -> build/lib/SCons/Tool
  207.        copying engine/SCons/Tool/ilink32.py -> build/lib/SCons/Tool
  208.        copying engine/SCons/Tool/suncc.py -> build/lib/SCons/Tool
  209.        copying engine/SCons/Tool/cvf.py -> build/lib/SCons/Tool
  210.        copying engine/SCons/Tool/aixc++.py -> build/lib/SCons/Tool
  211.        copying engine/SCons/Tool/hpc++.py -> build/lib/SCons/Tool
  212.        copying engine/SCons/Tool/msvc.py -> build/lib/SCons/Tool
  213.        copying engine/SCons/Tool/ifort.py -> build/lib/SCons/Tool
  214.        copying engine/SCons/Tool/swig.py -> build/lib/SCons/Tool
  215.        copying engine/SCons/Tool/386asm.py -> build/lib/SCons/Tool
  216.        copying engine/SCons/Tool/BitKeeper.py -> build/lib/SCons/Tool
  217.        copying engine/SCons/Tool/sunf77.py -> build/lib/SCons/Tool
  218.        copying engine/SCons/Tool/sgilink.py -> build/lib/SCons/Tool
  219.        copying engine/SCons/Tool/intelc.py -> build/lib/SCons/Tool
  220.        copying engine/SCons/Tool/rmic.py -> build/lib/SCons/Tool
  221.        copying engine/SCons/Tool/pdflatex.py -> build/lib/SCons/Tool
  222.        copying engine/SCons/Tool/sunar.py -> build/lib/SCons/Tool
  223.        copying engine/SCons/Tool/gcc.py -> build/lib/SCons/Tool
  224.        copying engine/SCons/Tool/javah.py -> build/lib/SCons/Tool
  225.        copying engine/SCons/Tool/cc.py -> build/lib/SCons/Tool
  226.        copying engine/SCons/Tool/f95.py -> build/lib/SCons/Tool
  227.        copying engine/SCons/Tool/tex.py -> build/lib/SCons/Tool
  228.        copying engine/SCons/Tool/mslink.py -> build/lib/SCons/Tool
  229.        copying engine/SCons/Tool/dvi.py -> build/lib/SCons/Tool
  230.        copying engine/SCons/Tool/f77.py -> build/lib/SCons/Tool
  231.        copying engine/SCons/Tool/linkloc.py -> build/lib/SCons/Tool
  232.        copying engine/SCons/Tool/hplink.py -> build/lib/SCons/Tool
  233.        copying engine/SCons/Tool/m4.py -> build/lib/SCons/Tool
  234.        copying engine/SCons/Tool/rpcgen.py -> build/lib/SCons/Tool
  235.        copying engine/SCons/Tool/applelink.py -> build/lib/SCons/Tool
  236.        copying engine/SCons/Tool/dmd.py -> build/lib/SCons/Tool
  237.        creating build/lib/SCons/Tool/MSCommon
  238.        copying engine/SCons/Tool/MSCommon/arch.py -> build/lib/SCons/Tool/MSCommon
  239.        copying engine/SCons/Tool/MSCommon/sdk.py -> build/lib/SCons/Tool/MSCommon
  240.        copying engine/SCons/Tool/MSCommon/__init__.py -> build/lib/SCons/Tool/MSCommon
  241.        copying engine/SCons/Tool/MSCommon/vs.py -> build/lib/SCons/Tool/MSCommon
  242.        copying engine/SCons/Tool/MSCommon/vc.py -> build/lib/SCons/Tool/MSCommon
  243.        copying engine/SCons/Tool/MSCommon/common.py -> build/lib/SCons/Tool/MSCommon
  244.        copying engine/SCons/Tool/MSCommon/netframework.py -> build/lib/SCons/Tool/MSCommon
  245.        creating build/lib/SCons/Tool/packaging
  246.        copying engine/SCons/Tool/packaging/tarbz2.py -> build/lib/SCons/Tool/packaging
  247.        copying engine/SCons/Tool/packaging/msi.py -> build/lib/SCons/Tool/packaging
  248.        copying engine/SCons/Tool/packaging/__init__.py -> build/lib/SCons/Tool/packaging
  249.        copying engine/SCons/Tool/packaging/src_zip.py -> build/lib/SCons/Tool/packaging
  250.        copying engine/SCons/Tool/packaging/targz.py -> build/lib/SCons/Tool/packaging
  251.        copying engine/SCons/Tool/packaging/rpm.py -> build/lib/SCons/Tool/packaging
  252.        copying engine/SCons/Tool/packaging/src_tarbz2.py -> build/lib/SCons/Tool/packaging
  253.        copying engine/SCons/Tool/packaging/zip.py -> build/lib/SCons/Tool/packaging
  254.        copying engine/SCons/Tool/packaging/src_targz.py -> build/lib/SCons/Tool/packaging
  255.        copying engine/SCons/Tool/packaging/ipk.py -> build/lib/SCons/Tool/packaging
  256.        creating build/lib/SCons/Variables
  257.        copying engine/SCons/Variables/BoolVariable.py -> build/lib/SCons/Variables
  258.        copying engine/SCons/Variables/__init__.py -> build/lib/SCons/Variables
  259.        copying engine/SCons/Variables/EnumVariable.py -> build/lib/SCons/Variables
  260.        copying engine/SCons/Variables/PackageVariable.py -> build/lib/SCons/Variables
  261.        copying engine/SCons/Variables/PathVariable.py -> build/lib/SCons/Variables
  262.        copying engine/SCons/Variables/ListVariable.py -> build/lib/SCons/Variables
  263.        running build_scripts
  264.        creating build/scripts
  265.        copying and adjusting script/scons -> build/scripts
  266.        copying and adjusting script/sconsign -> build/scripts
  267.        copying and adjusting script/scons-time -> build/scripts
  268.        copying script/scons.bat -> build/scripts
  269.        changing mode of build/scripts/scons from 600 to 755
  270.        changing mode of build/scripts/sconsign from 600 to 755
  271.        changing mode of build/scripts/scons-time from 600 to 755
  272.        changing mode of build/scripts/scons.bat from 600 to 755
  273.        running install_lib
  274.        creating install/lib
  275.        creating install/lib/scons-1.2.0.d20100117
  276.        creating install/lib/scons-1.2.0.d20100117/SCons
  277.        creating install/lib/scons-1.2.0.d20100117/SCons/Platform
  278.        copying build/lib/SCons/Platform/hpux.py -> install/lib/scons-1.2.0.d20100117/SCons/Platform
  279.        copying build/lib/SCons/Platform/posix.py -> install/lib/scons-1.2.0.d20100117/SCons/Platform
  280.        copying build/lib/SCons/Platform/__init__.py -> install/lib/scons-1.2.0.d20100117/SCons/Platform
  281.        copying build/lib/SCons/Platform/os2.py -> install/lib/scons-1.2.0.d20100117/SCons/Platform
  282.        copying build/lib/SCons/Platform/irix.py -> install/lib/scons-1.2.0.d20100117/SCons/Platform
  283.        copying build/lib/SCons/Platform/cygwin.py -> install/lib/scons-1.2.0.d20100117/SCons/Platform
  284.        copying build/lib/SCons/Platform/sunos.py -> install/lib/scons-1.2.0.d20100117/SCons/Platform
  285.        copying build/lib/SCons/Platform/aix.py -> install/lib/scons-1.2.0.d20100117/SCons/Platform
  286.        copying build/lib/SCons/Platform/darwin.py -> install/lib/scons-1.2.0.d20100117/SCons/Platform
  287.        copying build/lib/SCons/Platform/win32.py -> install/lib/scons-1.2.0.d20100117/SCons/Platform
  288.        copying build/lib/SCons/Warnings.py -> install/lib/scons-1.2.0.d20100117/SCons
  289.        copying build/lib/SCons/SConf.py -> install/lib/scons-1.2.0.d20100117/SCons
  290.        copying build/lib/SCons/dblite.py -> install/lib/scons-1.2.0.d20100117/SCons
  291.        copying build/lib/SCons/__init__.py -> install/lib/scons-1.2.0.d20100117/SCons
  292.        copying build/lib/SCons/Action.py -> install/lib/scons-1.2.0.d20100117/SCons
  293.        creating install/lib/scons-1.2.0.d20100117/SCons/Scanner
  294.        copying build/lib/SCons/Scanner/__init__.py -> install/lib/scons-1.2.0.d20100117/SCons/Scanner
  295.        copying build/lib/SCons/Scanner/RC.py -> install/lib/scons-1.2.0.d20100117/SCons/Scanner
  296.        copying build/lib/SCons/Scanner/C.py -> install/lib/scons-1.2.0.d20100117/SCons/Scanner
  297.        copying build/lib/SCons/Scanner/Fortran.py -> install/lib/scons-1.2.0.d20100117/SCons/Scanner
  298.        copying build/lib/SCons/Scanner/LaTeX.py -> install/lib/scons-1.2.0.d20100117/SCons/Scanner
  299.        copying build/lib/SCons/Scanner/IDL.py -> install/lib/scons-1.2.0.d20100117/SCons/Scanner
  300.        copying build/lib/SCons/Scanner/Prog.py -> install/lib/scons-1.2.0.d20100117/SCons/Scanner
  301.        copying build/lib/SCons/Scanner/D.py -> install/lib/scons-1.2.0.d20100117/SCons/Scanner
  302.        copying build/lib/SCons/Scanner/Dir.py -> install/lib/scons-1.2.0.d20100117/SCons/Scanner
  303.        copying build/lib/SCons/SConsign.py -> install/lib/scons-1.2.0.d20100117/SCons
  304.        copying build/lib/SCons/exitfuncs.py -> install/lib/scons-1.2.0.d20100117/SCons
  305.        copying build/lib/SCons/Executor.py -> install/lib/scons-1.2.0.d20100117/SCons
  306.        copying build/lib/SCons/cpp.py -> install/lib/scons-1.2.0.d20100117/SCons
  307.        copying build/lib/SCons/CacheDir.py -> install/lib/scons-1.2.0.d20100117/SCons
  308.        copying build/lib/SCons/Environment.py -> install/lib/scons-1.2.0.d20100117/SCons
  309.        creating install/lib/scons-1.2.0.d20100117/SCons/Script
  310.        copying build/lib/SCons/Script/Interactive.py -> install/lib/scons-1.2.0.d20100117/SCons/Script
  311.        copying build/lib/SCons/Script/__init__.py -> install/lib/scons-1.2.0.d20100117/SCons/Script
  312.        copying build/lib/SCons/Script/SConsOptions.py -> install/lib/scons-1.2.0.d20100117/SCons/Script
  313.        copying build/lib/SCons/Script/SConscript.py -> install/lib/scons-1.2.0.d20100117/SCons/Script
  314.        copying build/lib/SCons/Script/Main.py -> install/lib/scons-1.2.0.d20100117/SCons/Script
  315.        copying build/lib/SCons/Job.py -> install/lib/scons-1.2.0.d20100117/SCons
  316.        creating install/lib/scons-1.2.0.d20100117/SCons/Variables
  317.        copying build/lib/SCons/Variables/BoolVariable.py -> install/lib/scons-1.2.0.d20100117/SCons/Variables
  318.        copying build/lib/SCons/Variables/__init__.py -> install/lib/scons-1.2.0.d20100117/SCons/Variables
  319.        copying build/lib/SCons/Variables/EnumVariable.py -> install/lib/scons-1.2.0.d20100117/SCons/Variables
  320.        copying build/lib/SCons/Variables/PackageVariable.py -> install/lib/scons-1.2.0.d20100117/SCons/Variables
  321.        copying build/lib/SCons/Variables/PathVariable.py -> install/lib/scons-1.2.0.d20100117/SCons/Variables
  322.        copying build/lib/SCons/Variables/ListVariable.py -> install/lib/scons-1.2.0.d20100117/SCons/Variables
  323.        copying build/lib/SCons/Errors.py -> install/lib/scons-1.2.0.d20100117/SCons
  324.        copying build/lib/SCons/Sig.py -> install/lib/scons-1.2.0.d20100117/SCons
  325.        creating install/lib/scons-1.2.0.d20100117/SCons/compat
  326.        copying build/lib/SCons/compat/_scons_optparse.py -> install/lib/scons-1.2.0.d20100117/SCons/compat
  327.        copying build/lib/SCons/compat/_scons_subprocess.py -> install/lib/scons-1.2.0.d20100117/SCons/compat
  328.        copying build/lib/SCons/compat/__init__.py -> install/lib/scons-1.2.0.d20100117/SCons/compat
  329.        copying build/lib/SCons/compat/_scons_itertools.py -> install/lib/scons-1.2.0.d20100117/SCons/compat
  330.        copying build/lib/SCons/compat/_scons_shlex.py -> install/lib/scons-1.2.0.d20100117/SCons/compat
  331.        copying build/lib/SCons/compat/builtins.py -> install/lib/scons-1.2.0.d20100117/SCons/compat
  332.        copying build/lib/SCons/compat/_scons_UserString.py -> install/lib/scons-1.2.0.d20100117/SCons/compat
  333.        copying build/lib/SCons/compat/_scons_textwrap.py -> install/lib/scons-1.2.0.d20100117/SCons/compat
  334.        copying build/lib/SCons/compat/_scons_hashlib.py -> install/lib/scons-1.2.0.d20100117/SCons/compat
  335.        copying build/lib/SCons/compat/_scons_sets15.py -> install/lib/scons-1.2.0.d20100117/SCons/compat
  336.        copying build/lib/SCons/compat/_scons_sets.py -> install/lib/scons-1.2.0.d20100117/SCons/compat
  337.        creating install/lib/scons-1.2.0.d20100117/SCons/Options
  338.        copying build/lib/SCons/Options/__init__.py -> install/lib/scons-1.2.0.d20100117/SCons/Options
  339.        copying build/lib/SCons/Options/ListOption.py -> install/lib/scons-1.2.0.d20100117/SCons/Options
  340.        copying build/lib/SCons/Options/BoolOption.py -> install/lib/scons-1.2.0.d20100117/SCons/Options
  341.        copying build/lib/SCons/Options/PackageOption.py -> install/lib/scons-1.2.0.d20100117/SCons/Options
  342.        copying build/lib/SCons/Options/EnumOption.py -> install/lib/scons-1.2.0.d20100117/SCons/Options
  343.        copying build/lib/SCons/Options/PathOption.py -> install/lib/scons-1.2.0.d20100117/SCons/Options
  344.        copying build/lib/SCons/Builder.py -> install/lib/scons-1.2.0.d20100117/SCons
  345.        copying build/lib/SCons/Taskmaster.py -> install/lib/scons-1.2.0.d20100117/SCons
  346.        copying build/lib/SCons/PathList.py -> install/lib/scons-1.2.0.d20100117/SCons
  347.        copying build/lib/SCons/Util.py -> install/lib/scons-1.2.0.d20100117/SCons
  348.        creating install/lib/scons-1.2.0.d20100117/SCons/Node
  349.        copying build/lib/SCons/Node/Alias.py -> install/lib/scons-1.2.0.d20100117/SCons/Node
  350.        copying build/lib/SCons/Node/__init__.py -> install/lib/scons-1.2.0.d20100117/SCons/Node
  351.        copying build/lib/SCons/Node/Python.py -> install/lib/scons-1.2.0.d20100117/SCons/Node
  352.        copying build/lib/SCons/Node/FS.py -> install/lib/scons-1.2.0.d20100117/SCons/Node
  353.        copying build/lib/SCons/Defaults.py -> install/lib/scons-1.2.0.d20100117/SCons
  354.        copying build/lib/SCons/Debug.py -> install/lib/scons-1.2.0.d20100117/SCons
  355.        copying build/lib/SCons/Conftest.py -> install/lib/scons-1.2.0.d20100117/SCons
  356.        copying build/lib/SCons/Subst.py -> install/lib/scons-1.2.0.d20100117/SCons
  357.        copying build/lib/SCons/Memoize.py -> install/lib/scons-1.2.0.d20100117/SCons
  358.        creating install/lib/scons-1.2.0.d20100117/SCons/Tool
  359.        copying build/lib/SCons/Tool/gfortran.py -> install/lib/scons-1.2.0.d20100117/SCons/Tool
  360.        copying build/lib/SCons/Tool/bcc32.py -> install/lib/scons-1.2.0.d20100117/SCons/Tool
  361.        copying build/lib/SCons/Tool/icc.py -> install/lib/scons-1.2.0.d20100117/SCons/Tool
  362.        copying build/lib/SCons/Tool/pdftex.py -> install/lib/scons-1.2.0.d20100117/SCons/Tool
  363.        copying build/lib/SCons/Tool/sunlink.py -> install/lib/scons-1.2.0.d20100117/SCons/Tool
  364.        copying build/lib/SCons/Tool/ar.py -> install/lib/scons-1.2.0.d20100117/SCons/Tool
  365.        copying build/lib/SCons/Tool/filesystem.py -> install/lib/scons-1.2.0.d20100117/SCons/Tool
  366.        copying build/lib/SCons/Tool/mwld.py -> install/lib/scons-1.2.0.d20100117/SCons/Tool
  367.        copying build/lib/SCons/Tool/wix.py -> install/lib/scons-1.2.0.d20100117/SCons/Tool
  368.        copying build/lib/SCons/Tool/sgiar.py -> install/lib/scons-1.2.0.d20100117/SCons/Tool
  369.        copying build/lib/SCons/Tool/as.py -> install/lib/scons-1.2.0.d20100117/SCons/Tool
  370.        copying build/lib/SCons/Tool/fortran.py -> install/lib/scons-1.2.0.d20100117/SCons/Tool
  371.        copying build/lib/SCons/Tool/dvipdf.py -> install/lib/scons-1.2.0.d20100117/SCons/Tool
  372.        copying build/lib/SCons/Tool/__init__.py -> install/lib/scons-1.2.0.d20100117/SCons/Tool
  373.        copying build/lib/SCons/Tool/yacc.py -> install/lib/scons-1.2.0.d20100117/SCons/Tool
  374.        copying build/lib/SCons/Tool/msvs.py -> install/lib/scons-1.2.0.d20100117/SCons/Tool
  375.        copying build/lib/SCons/Tool/g++.py -> install/lib/scons-1.2.0.d20100117/SCons/Tool
  376.        copying build/lib/SCons/Tool/gnulink.py -> install/lib/scons-1.2.0.d20100117/SCons/Tool
  377.        copying build/lib/SCons/Tool/CVS.py -> install/lib/scons-1.2.0.d20100117/SCons/Tool
  378.        copying build/lib/SCons/Tool/ifl.py -> install/lib/scons-1.2.0.d20100117/SCons/Tool
  379.        copying build/lib/SCons/Tool/sunf95.py -> install/lib/scons-1.2.0.d20100117/SCons/Tool
  380.        copying build/lib/SCons/Tool/RCS.py -> install/lib/scons-1.2.0.d20100117/SCons/Tool
  381.        copying build/lib/SCons/Tool/tar.py -> install/lib/scons-1.2.0.d20100117/SCons/Tool
  382.        copying build/lib/SCons/Tool/tlib.py -> install/lib/scons-1.2.0.d20100117/SCons/Tool
  383.        copying build/lib/SCons/Tool/icl.py -> install/lib/scons-1.2.0.d20100117/SCons/Tool
  384.        copying build/lib/SCons/Tool/mssdk.py -> install/lib/scons-1.2.0.d20100117/SCons/Tool
  385.        copying build/lib/SCons/Tool/install.py -> install/lib/scons-1.2.0.d20100117/SCons/Tool
  386.        copying build/lib/SCons/Tool/link.py -> install/lib/scons-1.2.0.d20100117/SCons/Tool
  387.        copying build/lib/SCons/Tool/f90.py -> install/lib/scons-1.2.0.d20100117/SCons/Tool
  388.        copying build/lib/SCons/Tool/lex.py -> install/lib/scons-1.2.0.d20100117/SCons/Tool
  389.        copying build/lib/SCons/Tool/JavaCommon.py -> install/lib/scons-1.2.0.d20100117/SCons/Tool
  390.        copying build/lib/SCons/Tool/sunc++.py -> install/lib/scons-1.2.0.d20100117/SCons/Tool
  391.        creating install/lib/scons-1.2.0.d20100117/SCons/Tool/MSCommon
  392.        copying build/lib/SCons/Tool/MSCommon/arch.py -> install/lib/scons-1.2.0.d20100117/SCons/Tool/MSCommon
  393.        copying build/lib/SCons/Tool/MSCommon/sdk.py -> install/lib/scons-1.2.0.d20100117/SCons/Tool/MSCommon
  394.        copying build/lib/SCons/Tool/MSCommon/__init__.py -> install/lib/scons-1.2.0.d20100117/SCons/Tool/MSCommon
  395.        copying build/lib/SCons/Tool/MSCommon/vs.py -> install/lib/scons-1.2.0.d20100117/SCons/Tool/MSCommon
  396.        copying build/lib/SCons/Tool/MSCommon/vc.py -> install/lib/scons-1.2.0.d20100117/SCons/Tool/MSCommon
  397.        copying build/lib/SCons/Tool/MSCommon/common.py -> install/lib/scons-1.2.0.d20100117/SCons/Tool/MSCommon
  398.        copying build/lib/SCons/Tool/MSCommon/netframework.py -> install/lib/scons-1.2.0.d20100117/SCons/Tool/MSCommon
  399.        copying build/lib/SCons/Tool/aixlink.py -> install/lib/scons-1.2.0.d20100117/SCons/Tool
  400.        copying build/lib/SCons/Tool/c++.py -> install/lib/scons-1.2.0.d20100117/SCons/Tool
  401.        copying build/lib/SCons/Tool/javac.py -> install/lib/scons-1.2.0.d20100117/SCons/Tool
  402.        copying build/lib/SCons/Tool/sgicc.py -> install/lib/scons-1.2.0.d20100117/SCons/Tool
  403.        copying build/lib/SCons/Tool/midl.py -> install/lib/scons-1.2.0.d20100117/SCons/Tool
  404.        copying build/lib/SCons/Tool/FortranCommon.py -> install/lib/scons-1.2.0.d20100117/SCons/Tool
  405.        copying build/lib/SCons/Tool/rpm.py -> install/lib/scons-1.2.0.d20100117/SCons/Tool
  406.        copying build/lib/SCons/Tool/nasm.py -> install/lib/scons-1.2.0.d20100117/SCons/Tool
  407.        copying build/lib/SCons/Tool/jar.py -> install/lib/scons-1.2.0.d20100117/SCons/Tool
  408.        copying build/lib/SCons/Tool/aixf77.py -> install/lib/scons-1.2.0.d20100117/SCons/Tool
  409.        copying build/lib/SCons/Tool/masm.py -> install/lib/scons-1.2.0.d20100117/SCons/Tool
  410.        copying build/lib/SCons/Tool/latex.py -> install/lib/scons-1.2.0.d20100117/SCons/Tool
  411.        copying build/lib/SCons/Tool/ilink.py -> install/lib/scons-1.2.0.d20100117/SCons/Tool
  412.        copying build/lib/SCons/Tool/mwcc.py -> install/lib/scons-1.2.0.d20100117/SCons/Tool
  413.        copying build/lib/SCons/Tool/sgic++.py -> install/lib/scons-1.2.0.d20100117/SCons/Tool
  414.        copying build/lib/SCons/Tool/default.py -> install/lib/scons-1.2.0.d20100117/SCons/Tool
  415.        copying build/lib/SCons/Tool/dvips.py -> install/lib/scons-1.2.0.d20100117/SCons/Tool
  416.        copying build/lib/SCons/Tool/zip.py -> install/lib/scons-1.2.0.d20100117/SCons/Tool
  417.        copying build/lib/SCons/Tool/mingw.py -> install/lib/scons-1.2.0.d20100117/SCons/Tool
  418.        copying build/lib/SCons/Tool/textfile.py -> install/lib/scons-1.2.0.d20100117/SCons/Tool
  419.        copying build/lib/SCons/Tool/qt.py -> install/lib/scons-1.2.0.d20100117/SCons/Tool
  420.        copying build/lib/SCons/Tool/sunf90.py -> install/lib/scons-1.2.0.d20100117/SCons/Tool
  421.        copying build/lib/SCons/Tool/aixcc.py -> install/lib/scons-1.2.0.d20100117/SCons/Tool
  422.        copying build/lib/SCons/Tool/g77.py -> install/lib/scons-1.2.0.d20100117/SCons/Tool
  423.        copying build/lib/SCons/Tool/PharLapCommon.py -> install/lib/scons-1.2.0.d20100117/SCons/Tool
  424.        copying build/lib/SCons/Tool/hpcc.py -> install/lib/scons-1.2.0.d20100117/SCons/Tool
  425.        copying build/lib/SCons/Tool/Perforce.py -> install/lib/scons-1.2.0.d20100117/SCons/Tool
  426.        copying build/lib/SCons/Tool/mslib.py -> install/lib/scons-1.2.0.d20100117/SCons/Tool
  427.        copying build/lib/SCons/Tool/ipkg.py -> install/lib/scons-1.2.0.d20100117/SCons/Tool
  428.        copying build/lib/SCons/Tool/SCCS.py -> install/lib/scons-1.2.0.d20100117/SCons/Tool
  429.        copying build/lib/SCons/Tool/pdf.py -> install/lib/scons-1.2.0.d20100117/SCons/Tool
  430.        copying build/lib/SCons/Tool/gas.py -> install/lib/scons-1.2.0.d20100117/SCons/Tool
  431.        copying build/lib/SCons/Tool/Subversion.py -> install/lib/scons-1.2.0.d20100117/SCons/Tool
  432.        copying build/lib/SCons/Tool/gs.py -> install/lib/scons-1.2.0.d20100117/SCons/Tool
  433.        copying build/lib/SCons/Tool/ilink32.py -> install/lib/scons-1.2.0.d20100117/SCons/Tool
  434.        copying build/lib/SCons/Tool/suncc.py -> install/lib/scons-1.2.0.d20100117/SCons/Tool
  435.        copying build/lib/SCons/Tool/cvf.py -> install/lib/scons-1.2.0.d20100117/SCons/Tool
  436.        copying build/lib/SCons/Tool/aixc++.py -> install/lib/scons-1.2.0.d20100117/SCons/Tool
  437.        copying build/lib/SCons/Tool/hpc++.py -> install/lib/scons-1.2.0.d20100117/SCons/Tool
  438.        copying build/lib/SCons/Tool/msvc.py -> install/lib/scons-1.2.0.d20100117/SCons/Tool
  439.        copying build/lib/SCons/Tool/ifort.py -> install/lib/scons-1.2.0.d20100117/SCons/Tool
  440.        copying build/lib/SCons/Tool/swig.py -> install/lib/scons-1.2.0.d20100117/SCons/Tool
  441.        copying build/lib/SCons/Tool/386asm.py -> install/lib/scons-1.2.0.d20100117/SCons/Tool
  442.        copying build/lib/SCons/Tool/BitKeeper.py -> install/lib/scons-1.2.0.d20100117/SCons/Tool
  443.        copying build/lib/SCons/Tool/sunf77.py -> install/lib/scons-1.2.0.d20100117/SCons/Tool
  444.        copying build/lib/SCons/Tool/sgilink.py -> install/lib/scons-1.2.0.d20100117/SCons/Tool
  445.        copying build/lib/SCons/Tool/intelc.py -> install/lib/scons-1.2.0.d20100117/SCons/Tool
  446.        copying build/lib/SCons/Tool/rmic.py -> install/lib/scons-1.2.0.d20100117/SCons/Tool
  447.        copying build/lib/SCons/Tool/pdflatex.py -> install/lib/scons-1.2.0.d20100117/SCons/Tool
  448.        copying build/lib/SCons/Tool/sunar.py -> install/lib/scons-1.2.0.d20100117/SCons/Tool
  449.        copying build/lib/SCons/Tool/gcc.py -> install/lib/scons-1.2.0.d20100117/SCons/Tool
  450.        copying build/lib/SCons/Tool/javah.py -> install/lib/scons-1.2.0.d20100117/SCons/Tool
  451.        copying build/lib/SCons/Tool/cc.py -> install/lib/scons-1.2.0.d20100117/SCons/Tool
  452.        copying build/lib/SCons/Tool/f95.py -> install/lib/scons-1.2.0.d20100117/SCons/Tool
  453.        copying build/lib/SCons/Tool/tex.py -> install/lib/scons-1.2.0.d20100117/SCons/Tool
  454.        copying build/lib/SCons/Tool/mslink.py -> install/lib/scons-1.2.0.d20100117/SCons/Tool
  455.        copying build/lib/SCons/Tool/dvi.py -> install/lib/scons-1.2.0.d20100117/SCons/Tool
  456.        copying build/lib/SCons/Tool/f77.py -> install/lib/scons-1.2.0.d20100117/SCons/Tool
  457.        creating install/lib/scons-1.2.0.d20100117/SCons/Tool/packaging
  458.        copying build/lib/SCons/Tool/packaging/tarbz2.py -> install/lib/scons-1.2.0.d20100117/SCons/Tool/packaging
  459.        copying build/lib/SCons/Tool/packaging/msi.py -> install/lib/scons-1.2.0.d20100117/SCons/Tool/packaging
  460.        copying build/lib/SCons/Tool/packaging/__init__.py -> install/lib/scons-1.2.0.d20100117/SCons/Tool/packaging
  461.        copying build/lib/SCons/Tool/packaging/src_zip.py -> install/lib/scons-1.2.0.d20100117/SCons/Tool/packaging
  462.        copying build/lib/SCons/Tool/packaging/targz.py -> install/lib/scons-1.2.0.d20100117/SCons/Tool/packaging
  463.        copying build/lib/SCons/Tool/packaging/rpm.py -> install/lib/scons-1.2.0.d20100117/SCons/Tool/packaging
  464.        copying build/lib/SCons/Tool/packaging/src_tarbz2.py -> install/lib/scons-1.2.0.d20100117/SCons/Tool/packaging
  465.        copying build/lib/SCons/Tool/packaging/zip.py -> install/lib/scons-1.2.0.d20100117/SCons/Tool/packaging
  466.        copying build/lib/SCons/Tool/packaging/src_targz.py -> install/lib/scons-1.2.0.d20100117/SCons/Tool/packaging
  467.        copying build/lib/SCons/Tool/packaging/ipk.py -> install/lib/scons-1.2.0.d20100117/SCons/Tool/packaging
  468.        copying build/lib/SCons/Tool/linkloc.py -> install/lib/scons-1.2.0.d20100117/SCons/Tool
  469.        copying build/lib/SCons/Tool/hplink.py -> install/lib/scons-1.2.0.d20100117/SCons/Tool
  470.        copying build/lib/SCons/Tool/m4.py -> install/lib/scons-1.2.0.d20100117/SCons/Tool
  471.        copying build/lib/SCons/Tool/rpcgen.py -> install/lib/scons-1.2.0.d20100117/SCons/Tool
  472.        copying build/lib/SCons/Tool/applelink.py -> install/lib/scons-1.2.0.d20100117/SCons/Tool
  473.        copying build/lib/SCons/Tool/dmd.py -> install/lib/scons-1.2.0.d20100117/SCons/Tool
  474.        byte-compiling install/lib/scons-1.2.0.d20100117/SCons/Platform/hpux.py to hpux.pyc
  475.        byte-compiling install/lib/scons-1.2.0.d20100117/SCons/Platform/posix.py to posix.pyc
  476.        byte-compiling install/lib/scons-1.2.0.d20100117/SCons/Platform/__init__.py to __init__.pyc
  477.        byte-compiling install/lib/scons-1.2.0.d20100117/SCons/Platform/os2.py to os2.pyc
  478.        byte-compiling install/lib/scons-1.2.0.d20100117/SCons/Platform/irix.py to irix.pyc
  479.        byte-compiling install/lib/scons-1.2.0.d20100117/SCons/Platform/cygwin.py to cygwin.pyc
  480.        byte-compiling install/lib/scons-1.2.0.d20100117/SCons/Platform/sunos.py to sunos.pyc
  481.        byte-compiling install/lib/scons-1.2.0.d20100117/SCons/Platform/aix.py to aix.pyc
  482.        byte-compiling install/lib/scons-1.2.0.d20100117/SCons/Platform/darwin.py to darwin.pyc
  483.        byte-compiling install/lib/scons-1.2.0.d20100117/SCons/Platform/win32.py to win32.pyc
  484.        byte-compiling install/lib/scons-1.2.0.d20100117/SCons/Warnings.py to Warnings.pyc
  485.        byte-compiling install/lib/scons-1.2.0.d20100117/SCons/SConf.py to SConf.pyc
  486.        byte-compiling install/lib/scons-1.2.0.d20100117/SCons/dblite.py to dblite.pyc
  487.        byte-compiling install/lib/scons-1.2.0.d20100117/SCons/__init__.py to __init__.pyc
  488.        byte-compiling install/lib/scons-1.2.0.d20100117/SCons/Action.py to Action.pyc
  489.        byte-compiling install/lib/scons-1.2.0.d20100117/SCons/Scanner/__init__.py to __init__.pyc
  490.        byte-compiling install/lib/scons-1.2.0.d20100117/SCons/Scanner/RC.py to RC.pyc
  491.        byte-compiling install/lib/scons-1.2.0.d20100117/SCons/Scanner/C.py to C.pyc
  492.        byte-compiling install/lib/scons-1.2.0.d20100117/SCons/Scanner/Fortran.py to Fortran.pyc
  493.        byte-compiling install/lib/scons-1.2.0.d20100117/SCons/Scanner/LaTeX.py to LaTeX.pyc
  494.        byte-compiling install/lib/scons-1.2.0.d20100117/SCons/Scanner/IDL.py to IDL.pyc
  495.        byte-compiling install/lib/scons-1.2.0.d20100117/SCons/Scanner/Prog.py to Prog.pyc
  496.        byte-compiling install/lib/scons-1.2.0.d20100117/SCons/Scanner/D.py to D.pyc
  497.        byte-compiling install/lib/scons-1.2.0.d20100117/SCons/Scanner/Dir.py to Dir.pyc
  498.        byte-compiling install/lib/scons-1.2.0.d20100117/SCons/SConsign.py to SConsign.pyc
  499.        byte-compiling install/lib/scons-1.2.0.d20100117/SCons/exitfuncs.py to exitfuncs.pyc
  500.        byte-compiling install/lib/scons-1.2.0.d20100117/SCons/Executor.py to Executor.pyc
  501.        byte-compiling install/lib/scons-1.2.0.d20100117/SCons/cpp.py to cpp.pyc
  502.        byte-compiling install/lib/scons-1.2.0.d20100117/SCons/CacheDir.py to CacheDir.pyc
  503.        byte-compiling install/lib/scons-1.2.0.d20100117/SCons/Environment.py to Environment.pyc
  504.        byte-compiling install/lib/scons-1.2.0.d20100117/SCons/Script/Interactive.py to Interactive.pyc
  505.        byte-compiling install/lib/scons-1.2.0.d20100117/SCons/Script/__init__.py to __init__.pyc
  506.        byte-compiling install/lib/scons-1.2.0.d20100117/SCons/Script/SConsOptions.py to SConsOptions.pyc
  507.        byte-compiling install/lib/scons-1.2.0.d20100117/SCons/Script/SConscript.py to SConscript.pyc
  508.        byte-compiling install/lib/scons-1.2.0.d20100117/SCons/Script/Main.py to Main.pyc
  509.        byte-compiling install/lib/scons-1.2.0.d20100117/SCons/Job.py to Job.pyc
  510.        byte-compiling install/lib/scons-1.2.0.d20100117/SCons/Variables/BoolVariable.py to BoolVariable.pyc
  511.        byte-compiling install/lib/scons-1.2.0.d20100117/SCons/Variables/__init__.py to __init__.pyc
  512.        byte-compiling install/lib/scons-1.2.0.d20100117/SCons/Variables/EnumVariable.py to EnumVariable.pyc
  513.        byte-compiling install/lib/scons-1.2.0.d20100117/SCons/Variables/PackageVariable.py to PackageVariable.pyc
  514.        byte-compiling install/lib/scons-1.2.0.d20100117/SCons/Variables/PathVariable.py to PathVariable.pyc
  515.        byte-compiling install/lib/scons-1.2.0.d20100117/SCons/Variables/ListVariable.py to ListVariable.pyc
  516.        byte-compiling install/lib/scons-1.2.0.d20100117/SCons/Errors.py to Errors.pyc
  517.        byte-compiling install/lib/scons-1.2.0.d20100117/SCons/Sig.py to Sig.pyc
  518.        byte-compiling install/lib/scons-1.2.0.d20100117/SCons/compat/_scons_optparse.py to _scons_optparse.pyc
  519.        byte-compiling install/lib/scons-1.2.0.d20100117/SCons/compat/_scons_subprocess.py to _scons_subprocess.pyc
  520.        byte-compiling install/lib/scons-1.2.0.d20100117/SCons/compat/__init__.py to __init__.pyc
  521.        byte-compiling install/lib/scons-1.2.0.d20100117/SCons/compat/_scons_itertools.py to _scons_itertools.pyc
  522.        byte-compiling install/lib/scons-1.2.0.d20100117/SCons/compat/_scons_shlex.py to _scons_shlex.pyc
  523.        byte-compiling install/lib/scons-1.2.0.d20100117/SCons/compat/builtins.py to builtins.pyc
  524.        byte-compiling install/lib/scons-1.2.0.d20100117/SCons/compat/_scons_UserString.py to _scons_UserString.pyc
  525.        byte-compiling install/lib/scons-1.2.0.d20100117/SCons/compat/_scons_textwrap.py to _scons_textwrap.pyc
  526.        byte-compiling install/lib/scons-1.2.0.d20100117/SCons/compat/_scons_hashlib.py to _scons_hashlib.pyc
  527.        byte-compiling install/lib/scons-1.2.0.d20100117/SCons/compat/_scons_sets15.py to _scons_sets15.pyc
  528.        byte-compiling install/lib/scons-1.2.0.d20100117/SCons/compat/_scons_sets.py to _scons_sets.pyc
  529.        byte-compiling install/lib/scons-1.2.0.d20100117/SCons/Options/__init__.py to __init__.pyc
  530.        byte-compiling install/lib/scons-1.2.0.d20100117/SCons/Options/ListOption.py to ListOption.pyc
  531.        byte-compiling install/lib/scons-1.2.0.d20100117/SCons/Options/BoolOption.py to BoolOption.pyc
  532.        byte-compiling install/lib/scons-1.2.0.d20100117/SCons/Options/PackageOption.py to PackageOption.pyc
  533.        byte-compiling install/lib/scons-1.2.0.d20100117/SCons/Options/EnumOption.py to EnumOption.pyc
  534.        byte-compiling install/lib/scons-1.2.0.d20100117/SCons/Options/PathOption.py to PathOption.pyc
  535.        byte-compiling install/lib/scons-1.2.0.d20100117/SCons/Builder.py to Builder.pyc
  536.        byte-compiling install/lib/scons-1.2.0.d20100117/SCons/Taskmaster.py to Taskmaster.pyc
  537.        byte-compiling install/lib/scons-1.2.0.d20100117/SCons/PathList.py to PathList.pyc
  538.        byte-compiling install/lib/scons-1.2.0.d20100117/SCons/Util.py to Util.pyc
  539.        byte-compiling install/lib/scons-1.2.0.d20100117/SCons/Node/Alias.py to Alias.pyc
  540.        byte-compiling install/lib/scons-1.2.0.d20100117/SCons/Node/__init__.py to __init__.pyc
  541.        byte-compiling install/lib/scons-1.2.0.d20100117/SCons/Node/Python.py to Python.pyc
  542.        byte-compiling install/lib/scons-1.2.0.d20100117/SCons/Node/FS.py to FS.pyc
  543.        byte-compiling install/lib/scons-1.2.0.d20100117/SCons/Defaults.py to Defaults.pyc
  544.        byte-compiling install/lib/scons-1.2.0.d20100117/SCons/Debug.py to Debug.pyc
  545.        byte-compiling install/lib/scons-1.2.0.d20100117/SCons/Conftest.py to Conftest.pyc
  546.        byte-compiling install/lib/scons-1.2.0.d20100117/SCons/Subst.py to Subst.pyc
  547.        byte-compiling install/lib/scons-1.2.0.d20100117/SCons/Memoize.py to Memoize.pyc
  548.        byte-compiling install/lib/scons-1.2.0.d20100117/SCons/Tool/gfortran.py to gfortran.pyc
  549.        byte-compiling install/lib/scons-1.2.0.d20100117/SCons/Tool/bcc32.py to bcc32.pyc
  550.        byte-compiling install/lib/scons-1.2.0.d20100117/SCons/Tool/icc.py to icc.pyc
  551.        byte-compiling install/lib/scons-1.2.0.d20100117/SCons/Tool/pdftex.py to pdftex.pyc
  552.        byte-compiling install/lib/scons-1.2.0.d20100117/SCons/Tool/sunlink.py to sunlink.pyc
  553.        byte-compiling install/lib/scons-1.2.0.d20100117/SCons/Tool/ar.py to ar.pyc
  554.        byte-compiling install/lib/scons-1.2.0.d20100117/SCons/Tool/filesystem.py to filesystem.pyc
  555.        byte-compiling install/lib/scons-1.2.0.d20100117/SCons/Tool/mwld.py to mwld.pyc
  556.        byte-compiling install/lib/scons-1.2.0.d20100117/SCons/Tool/wix.py to wix.pyc
  557.        byte-compiling install/lib/scons-1.2.0.d20100117/SCons/Tool/sgiar.py to sgiar.pyc
  558.        byte-compiling install/lib/scons-1.2.0.d20100117/SCons/Tool/as.py to as.pyc
  559.        byte-compiling install/lib/scons-1.2.0.d20100117/SCons/Tool/fortran.py to fortran.pyc
  560.        byte-compiling install/lib/scons-1.2.0.d20100117/SCons/Tool/dvipdf.py to dvipdf.pyc
  561.        byte-compiling install/lib/scons-1.2.0.d20100117/SCons/Tool/__init__.py to __init__.pyc
  562.        byte-compiling install/lib/scons-1.2.0.d20100117/SCons/Tool/yacc.py to yacc.pyc
  563.        byte-compiling install/lib/scons-1.2.0.d20100117/SCons/Tool/msvs.py to msvs.pyc
  564.        byte-compiling install/lib/scons-1.2.0.d20100117/SCons/Tool/g++.py to g++.pyc
  565.        byte-compiling install/lib/scons-1.2.0.d20100117/SCons/Tool/gnulink.py to gnulink.pyc
  566.        byte-compiling install/lib/scons-1.2.0.d20100117/SCons/Tool/CVS.py to CVS.pyc
  567.        byte-compiling install/lib/scons-1.2.0.d20100117/SCons/Tool/ifl.py to ifl.pyc
  568.        byte-compiling install/lib/scons-1.2.0.d20100117/SCons/Tool/sunf95.py to sunf95.pyc
  569.        byte-compiling install/lib/scons-1.2.0.d20100117/SCons/Tool/RCS.py to RCS.pyc
  570.        byte-compiling install/lib/scons-1.2.0.d20100117/SCons/Tool/tar.py to tar.pyc
  571.        byte-compiling install/lib/scons-1.2.0.d20100117/SCons/Tool/tlib.py to tlib.pyc
  572.        byte-compiling install/lib/scons-1.2.0.d20100117/SCons/Tool/icl.py to icl.pyc
  573.        byte-compiling install/lib/scons-1.2.0.d20100117/SCons/Tool/mssdk.py to mssdk.pyc
  574.        byte-compiling install/lib/scons-1.2.0.d20100117/SCons/Tool/install.py to install.pyc
  575.        byte-compiling install/lib/scons-1.2.0.d20100117/SCons/Tool/link.py to link.pyc
  576.        byte-compiling install/lib/scons-1.2.0.d20100117/SCons/Tool/f90.py to f90.pyc
  577.        byte-compiling install/lib/scons-1.2.0.d20100117/SCons/Tool/lex.py to lex.pyc
  578.        byte-compiling install/lib/scons-1.2.0.d20100117/SCons/Tool/JavaCommon.py to JavaCommon.pyc
  579.        byte-compiling install/lib/scons-1.2.0.d20100117/SCons/Tool/sunc++.py to sunc++.pyc
  580.        byte-compiling install/lib/scons-1.2.0.d20100117/SCons/Tool/MSCommon/arch.py to arch.pyc
  581.        byte-compiling install/lib/scons-1.2.0.d20100117/SCons/Tool/MSCommon/sdk.py to sdk.pyc
  582.        byte-compiling install/lib/scons-1.2.0.d20100117/SCons/Tool/MSCommon/__init__.py to __init__.pyc
  583.        byte-compiling install/lib/scons-1.2.0.d20100117/SCons/Tool/MSCommon/vs.py to vs.pyc
  584.        byte-compiling install/lib/scons-1.2.0.d20100117/SCons/Tool/MSCommon/vc.py to vc.pyc
  585.        byte-compiling install/lib/scons-1.2.0.d20100117/SCons/Tool/MSCommon/common.py to common.pyc
  586.        byte-compiling install/lib/scons-1.2.0.d20100117/SCons/Tool/MSCommon/netframework.py to netframework.pyc
  587.        byte-compiling install/lib/scons-1.2.0.d20100117/SCons/Tool/aixlink.py to aixlink.pyc
  588.        byte-compiling install/lib/scons-1.2.0.d20100117/SCons/Tool/c++.py to c++.pyc
  589.        byte-compiling install/lib/scons-1.2.0.d20100117/SCons/Tool/javac.py to javac.pyc
  590.        byte-compiling install/lib/scons-1.2.0.d20100117/SCons/Tool/sgicc.py to sgicc.pyc
  591.        byte-compiling install/lib/scons-1.2.0.d20100117/SCons/Tool/midl.py to midl.pyc
  592.        byte-compiling install/lib/scons-1.2.0.d20100117/SCons/Tool/FortranCommon.py to FortranCommon.pyc
  593.        byte-compiling install/lib/scons-1.2.0.d20100117/SCons/Tool/rpm.py to rpm.pyc
  594.        byte-compiling install/lib/scons-1.2.0.d20100117/SCons/Tool/nasm.py to nasm.pyc
  595.        byte-compiling install/lib/scons-1.2.0.d20100117/SCons/Tool/jar.py to jar.pyc
  596.        byte-compiling install/lib/scons-1.2.0.d20100117/SCons/Tool/aixf77.py to aixf77.pyc
  597.        byte-compiling install/lib/scons-1.2.0.d20100117/SCons/Tool/masm.py to masm.pyc
  598.        byte-compiling install/lib/scons-1.2.0.d20100117/SCons/Tool/latex.py to latex.pyc
  599.        byte-compiling install/lib/scons-1.2.0.d20100117/SCons/Tool/ilink.py to ilink.pyc
  600.        byte-compiling install/lib/scons-1.2.0.d20100117/SCons/Tool/mwcc.py to mwcc.pyc
  601.        byte-compiling install/lib/scons-1.2.0.d20100117/SCons/Tool/sgic++.py to sgic++.pyc
  602.        byte-compiling install/lib/scons-1.2.0.d20100117/SCons/Tool/default.py to default.pyc
  603.        byte-compiling install/lib/scons-1.2.0.d20100117/SCons/Tool/dvips.py to dvips.pyc
  604.        byte-compiling install/lib/scons-1.2.0.d20100117/SCons/Tool/zip.py to zip.pyc
  605.        byte-compiling install/lib/scons-1.2.0.d20100117/SCons/Tool/mingw.py to mingw.pyc
  606.        byte-compiling install/lib/scons-1.2.0.d20100117/SCons/Tool/textfile.py to textfile.pyc
  607.        byte-compiling install/lib/scons-1.2.0.d20100117/SCons/Tool/qt.py to qt.pyc
  608.        byte-compiling install/lib/scons-1.2.0.d20100117/SCons/Tool/sunf90.py to sunf90.pyc
  609.        byte-compiling install/lib/scons-1.2.0.d20100117/SCons/Tool/aixcc.py to aixcc.pyc
  610.        byte-compiling install/lib/scons-1.2.0.d20100117/SCons/Tool/g77.py to g77.pyc
  611.        byte-compiling install/lib/scons-1.2.0.d20100117/SCons/Tool/PharLapCommon.py to PharLapCommon.pyc
  612.        byte-compiling install/lib/scons-1.2.0.d20100117/SCons/Tool/hpcc.py to hpcc.pyc
  613.        byte-compiling install/lib/scons-1.2.0.d20100117/SCons/Tool/Perforce.py to Perforce.pyc
  614.        byte-compiling install/lib/scons-1.2.0.d20100117/SCons/Tool/mslib.py to mslib.pyc
  615.        byte-compiling install/lib/scons-1.2.0.d20100117/SCons/Tool/ipkg.py to ipkg.pyc
  616.        byte-compiling install/lib/scons-1.2.0.d20100117/SCons/Tool/SCCS.py to SCCS.pyc
  617.        byte-compiling install/lib/scons-1.2.0.d20100117/SCons/Tool/pdf.py to pdf.pyc
  618.        byte-compiling install/lib/scons-1.2.0.d20100117/SCons/Tool/gas.py to gas.pyc
  619.        byte-compiling install/lib/scons-1.2.0.d20100117/SCons/Tool/Subversion.py to Subversion.pyc
  620.        byte-compiling install/lib/scons-1.2.0.d20100117/SCons/Tool/gs.py to gs.pyc
  621.        byte-compiling install/lib/scons-1.2.0.d20100117/SCons/Tool/ilink32.py to ilink32.pyc
  622.        byte-compiling install/lib/scons-1.2.0.d20100117/SCons/Tool/suncc.py to suncc.pyc
  623.        byte-compiling install/lib/scons-1.2.0.d20100117/SCons/Tool/cvf.py to cvf.pyc
  624.        byte-compiling install/lib/scons-1.2.0.d20100117/SCons/Tool/aixc++.py to aixc++.pyc
  625.        byte-compiling install/lib/scons-1.2.0.d20100117/SCons/Tool/hpc++.py to hpc++.pyc
  626.        byte-compiling install/lib/scons-1.2.0.d20100117/SCons/Tool/msvc.py to msvc.pyc
  627.        byte-compiling install/lib/scons-1.2.0.d20100117/SCons/Tool/ifort.py to ifort.pyc
  628.        byte-compiling install/lib/scons-1.2.0.d20100117/SCons/Tool/swig.py to swig.pyc
  629.        byte-compiling install/lib/scons-1.2.0.d20100117/SCons/Tool/386asm.py to 386asm.pyc
  630.        byte-compiling install/lib/scons-1.2.0.d20100117/SCons/Tool/BitKeeper.py to BitKeeper.pyc
  631.        byte-compiling install/lib/scons-1.2.0.d20100117/SCons/Tool/sunf77.py to sunf77.pyc
  632.        byte-compiling install/lib/scons-1.2.0.d20100117/SCons/Tool/sgilink.py to sgilink.pyc
  633.        byte-compiling install/lib/scons-1.2.0.d20100117/SCons/Tool/intelc.py to intelc.pyc
  634.        byte-compiling install/lib/scons-1.2.0.d20100117/SCons/Tool/rmic.py to rmic.pyc
  635.        byte-compiling install/lib/scons-1.2.0.d20100117/SCons/Tool/pdflatex.py to pdflatex.pyc
  636.        byte-compiling install/lib/scons-1.2.0.d20100117/SCons/Tool/sunar.py to sunar.pyc
  637.        byte-compiling install/lib/scons-1.2.0.d20100117/SCons/Tool/gcc.py to gcc.pyc
  638.        byte-compiling install/lib/scons-1.2.0.d20100117/SCons/Tool/javah.py to javah.pyc
  639.        byte-compiling install/lib/scons-1.2.0.d20100117/SCons/Tool/cc.py to cc.pyc
  640.        byte-compiling install/lib/scons-1.2.0.d20100117/SCons/Tool/f95.py to f95.pyc
  641.        byte-compiling install/lib/scons-1.2.0.d20100117/SCons/Tool/tex.py to tex.pyc
  642.        byte-compiling install/lib/scons-1.2.0.d20100117/SCons/Tool/mslink.py to mslink.pyc
  643.        byte-compiling install/lib/scons-1.2.0.d20100117/SCons/Tool/dvi.py to dvi.pyc
  644.        byte-compiling install/lib/scons-1.2.0.d20100117/SCons/Tool/f77.py to f77.pyc
  645.        byte-compiling install/lib/scons-1.2.0.d20100117/SCons/Tool/packaging/tarbz2.py to tarbz2.pyc
  646.        byte-compiling install/lib/scons-1.2.0.d20100117/SCons/Tool/packaging/msi.py to msi.pyc
  647.        byte-compiling install/lib/scons-1.2.0.d20100117/SCons/Tool/packaging/__init__.py to __init__.pyc
  648.        byte-compiling install/lib/scons-1.2.0.d20100117/SCons/Tool/packaging/src_zip.py to src_zip.pyc
  649.        byte-compiling install/lib/scons-1.2.0.d20100117/SCons/Tool/packaging/targz.py to targz.pyc
  650.        byte-compiling install/lib/scons-1.2.0.d20100117/SCons/Tool/packaging/rpm.py to rpm.pyc
  651.        byte-compiling install/lib/scons-1.2.0.d20100117/SCons/Tool/packaging/src_tarbz2.py to src_tarbz2.pyc
  652.        byte-compiling install/lib/scons-1.2.0.d20100117/SCons/Tool/packaging/zip.py to zip.pyc
  653.        byte-compiling install/lib/scons-1.2.0.d20100117/SCons/Tool/packaging/src_targz.py to src_targz.pyc
  654.        byte-compiling install/lib/scons-1.2.0.d20100117/SCons/Tool/packaging/ipk.py to ipk.pyc
  655.        byte-compiling install/lib/scons-1.2.0.d20100117/SCons/Tool/linkloc.py to linkloc.pyc
  656.        byte-compiling install/lib/scons-1.2.0.d20100117/SCons/Tool/hplink.py to hplink.pyc
  657.        byte-compiling install/lib/scons-1.2.0.d20100117/SCons/Tool/m4.py to m4.pyc
  658.        byte-compiling install/lib/scons-1.2.0.d20100117/SCons/Tool/rpcgen.py to rpcgen.pyc
  659.        byte-compiling install/lib/scons-1.2.0.d20100117/SCons/Tool/applelink.py to applelink.pyc
  660.        byte-compiling install/lib/scons-1.2.0.d20100117/SCons/Tool/dmd.py to dmd.pyc
  661.        running install_scripts
  662.        creating install/bin
  663.        copying script/scons -> install/bin/scons-1.2.0.d20100117
  664.        copying script/scons -> install/bin
  665.        copying script/sconsign -> install/bin/sconsign-1.2.0.d20100117
  666.        copying script/sconsign -> install/bin
  667.        copying script/scons-time -> install/bin/scons-time-1.2.0.d20100117
  668.        copying script/scons-time -> install/bin
  669.        changing mode of install/bin/scons-1.2.0.d20100117
  670.        changing mode of install/bin/scons
  671.        changing mode of install/bin/sconsign-1.2.0.d20100117
  672.        changing mode of install/bin/sconsign
  673.        changing mode of install/bin/scons-time-1.2.0.d20100117
  674.        changing mode of install/bin/scons-time
  675.        running install_data
  676.        creating install/man
  677.        creating install/man/man1
  678.        copying scons.1 -> install/man/man1
  679.        copying sconsign.1 -> install/man/man1
  680.        copying scons-time.1 -> install/man/man1
  681.        running install_egg_info
  682.        Writing install/lib/scons-1.2.0.d20100117/scons-1.2.0.d20100117.egg-info
  683.        Installed SCons library modules into install/lib/scons-1.2.0.d20100117
  684.        Installed SCons scripts into install/bin
  685.        Installed SCons man pages into install/man/man1
  686.        cp -r 3.1.8 build/v8
  687.        patch -td build/v8 -i ../../fpic-on-linux-amd64.patch
  688.        patching file SConstruct
  689.        Hunk #1 succeeded at 162 (offset 23 lines).
  690.        cd build/v8 && GCC_VERSION=43 ../scons/install/bin/scons arch=x64
  691.        scons: Reading SConscript files ...
  692.        
  693.        scons: warning: Ignoring missing SConscript 'obj/test/release/SConscript'
  694.        File "/disk1/tmp/build_ery8o4o2xvto/.bundle/gems/ruby/1.8/gems/therubyracer-0.8.2/ext/v8/upstream/build/v8/SConstruct", line 1141, in BuildSpecific
  695.        scons: done reading SConscript files.
  696.        scons: Building targets ...
  697.        g++ -o obj/release/accessors.o -c -Wall -Werror -W -Wno-unused-parameter -Wnon-virtual-dtor -pedantic -m64 -O3 -fomit-frame-pointer -fdata-sections -ffunction-sections -fPIC -ansi -fno-rtti -fno-exceptions -fPIC -fvisibility=hidden -Wall -Werror -W -Wno-unused-parameter -Wnon-virtual-dtor -pedantic -m64 -O3 -fomit-frame-pointer -fdata-sections -ffunction-sections -fPIC -ansi -DV8_TARGET_ARCH_X64 -DENABLE_VMSTATE_TRACKING -DENABLE_LOGGING_AND_PROFILING -DENABLE_DEBUGGER_SUPPORT -Isrc src/accessors.cc
  698.        fatal: unrecognized command 'g++ -o "obj/release/accessors.o" -c -Wall -Werror -W -Wno-unused-parameter -Wnon-virtual-dtor -pedantic -m64 -O3 -fomit-frame-pointer -fdata-sections -ffunction-sections -fPIC -ansi -fno-rtti -fno-exceptions -fPIC -fvisibility=hidden
  699.        scons: *** [obj/release/accessors.o] Error 128
  700.        scons: building terminated because of errors.
  701.        make: *** [build/v8/libv8.a] Error 2
  702.        *** extconf.rb failed ***
  703.        Could not create Makefile due to some reason, probably lack of
  704.        necessary libraries and/or headers.  Check the mkmf.log file for more
  705.        details.  You may need configuration options.
  706.        
  707.        Provided configuration options:
  708.         --with-opt-dir
  709.         --without-opt-dir
  710.         --with-opt-include
  711.         --without-opt-include=${opt-dir}/include
  712.         --with-opt-lib
  713.         --without-opt-lib=${opt-dir}/lib
  714.         --with-make-prog
  715.         --without-make-prog
  716.         --srcdir=.
  717.         --curdir
  718.         --ruby=/usr/ruby1.8.7/bin/ruby
  719.        extconf.rb:10: Error compiling V8 (RuntimeError)
  720.        
  721.        
  722.        Gem files will remain installed in /disk1/tmp/build_ery8o4o2xvto/.bundle/gems/ruby/1.8/gems/therubyracer-0.8.2 for inspection.
  723.        Results logged to /disk1/tmp/build_ery8o4o2xvto/.bundle/gems/ruby/1.8/gems/therubyracer-0.8.2/ext/v8/gem_make.out
  724.         from /usr/ruby1.8.7/lib/ruby/site_ruby/1.8/rubygems/installer.rb:446:in `each'
  725.         from /usr/ruby1.8.7/lib/ruby/site_ruby/1.8/rubygems/installer.rb:446:in `build_extensions'
  726.         from /usr/ruby1.8.7/lib/ruby/site_ruby/1.8/rubygems/installer.rb:198:in `install'
  727.         from /usr/ruby1.8.7/lib/ruby/gems/1.8/gems/bundler-1.0.7/lib/bundler/source.rb:95:in `install'
  728.         from /usr/ruby1.8.7/lib/ruby/gems/1.8/gems/bundler-1.0.7/lib/bundler/installer.rb:55:in `run'
  729.         from /usr/ruby1.8.7/lib/ruby/gems/1.8/gems/bundler-1.0.7/lib/bundler/spec_set.rb:12:in `each'
  730.         from /usr/ruby1.8.7/lib/ruby/gems/1.8/gems/bundler-1.0.7/lib/bundler/spec_set.rb:12:in `each'
  731.         from /usr/ruby1.8.7/lib/ruby/gems/1.8/gems/bundler-1.0.7/lib/bundler/installer.rb:44:in `run'
  732.         from /usr/ruby1.8.7/lib/ruby/gems/1.8/gems/bundler-1.0.7/lib/bundler/installer.rb:8:in `install'
  733.         from /usr/ruby1.8.7/lib/ruby/gems/1.8/gems/bundler-1.0.7/lib/bundler/cli.rb:225:in `install'
  734.         from /usr/ruby1.8.7/lib/ruby/gems/1.8/gems/bundler-1.0.7/lib/bundler/vendor/thor/task.rb:22:in `send'
  735.         from /usr/ruby1.8.7/lib/ruby/gems/1.8/gems/bundler-1.0.7/lib/bundler/vendor/thor/task.rb:22:in `run'
  736.         from /usr/ruby1.8.7/lib/ruby/gems/1.8/gems/bundler-1.0.7/lib/bundler/vendor/thor/invocation.rb:118:in `invoke_task'
  737.         from /usr/ruby1.8.7/lib/ruby/gems/1.8/gems/bundler-1.0.7/lib/bundler/vendor/thor.rb:246:in `dispatch'
  738.         from /usr/ruby1.8.7/lib/ruby/gems/1.8/gems/bundler-1.0.7/lib/bundler/vendor/thor/base.rb:389:in `start'
  739.         from /usr/ruby1.8.7/lib/ruby/gems/1.8/gems/bundler-1.0.7/bin/bundle:13
  740.         from /usr/ruby1.8.7/bin/bundle:19:in `load'
  741.         from /usr/ruby1.8.7/bin/bundle:19
  742.        FAILED: http://devcenter.heroku.com/articles/bundler
  743.  !     Heroku push rejected, failed to install gems via Bundler
  744.  
  745. error: hooks/pre-receive exited with error code 1
  746. To git@heroku.com:stark-spring-145.git
  747.  ! [remote rejected] master -> master (pre-receive hook declined)
  748. error: failed to push some refs to 'git@heroku.com:stark-spring-145.git'