Guest User

Untitled

a guest
Feb 24th, 2013
314
0
Never
Not a member of Pastebin yet? Sign Up, it unlocks many cool features!
Bash 48.23 KB | None | 0 0
  1. $ gradle maven2Gradle --stacktrace --info --debug
  2. 15:24:51.374 [DEBUG] [org.gradle.logging.internal.DefaultLoggingConfigurer] Finished configuring with level: DEBUG, configurers: [org.gradle.logging.internal.OutputEventRenderer@2ce1899b, org.gradle.logging.internal.logback.LogbackLoggingConfigurer@b113622, org.gradle.logging.internal.JavaUtilLoggingConfigurer@16f8f7db]
  3. 15:24:51.928 [DEBUG] [org.gradle.logging.internal.DefaultLoggingConfigurer] Finished configuring with level: DEBUG, configurers: [org.gradle.logging.internal.OutputEventRenderer@2ce1899b, org.gradle.logging.internal.logback.LogbackLoggingConfigurer@b113622, org.gradle.logging.internal.JavaUtilLoggingConfigurer@16f8f7db]
  4. 15:24:51.931 [INFO] [org.gradle.BuildLogger] Starting Build
  5. 15:24:51.932 [DEBUG] [org.gradle.BuildLogger] Gradle user home: /Users/myuser/.gradle
  6. 15:24:51.932 [DEBUG] [org.gradle.BuildLogger] Current dir: /Users/myuser/Projects/mycompany/com.mycompany.myproject.web
  7. 15:24:51.933 [DEBUG] [org.gradle.BuildLogger] Settings file: null
  8. 15:24:51.934 [DEBUG] [org.gradle.BuildLogger] Build file: null
  9. 15:24:51.953 [DEBUG] [org.gradle.initialization.BuildSourceBuilder] Starting to build the build sources.
  10. 15:24:51.954 [DEBUG] [org.gradle.initialization.BuildSourceBuilder] Gradle source dir does not exist. We leave.
  11. 15:24:51.955 [DEBUG] [org.gradle.initialization.DefaultGradlePropertiesLoader] Found env project properties: []
  12. 15:24:51.956 [DEBUG] [org.gradle.initialization.DefaultGradlePropertiesLoader] Found system project properties: []
  13. 15:24:52.065 [DEBUG] [org.gradle.api.internal.artifacts.mvnsettings.DefaultLocalMavenRepositoryLocator] No local repository in Settings file defined. Using default path: /Users/myuser/.m2/repository
  14. 15:24:52.307 [DEBUG] [org.gradle.logging.internal.DefaultLoggingConfigurer] Finished configuring with level: DEBUG, configurers: [org.gradle.logging.internal.OutputEventRenderer@2ce1899b, org.gradle.logging.internal.logback.LogbackLoggingConfigurer@b113622, org.gradle.logging.internal.JavaUtilLoggingConfigurer@16f8f7db]
  15. 15:24:52.318 [DEBUG] [org.gradle.logging.internal.DefaultLoggingConfigurer] Finished configuring with level: DEBUG, configurers: [org.gradle.logging.internal.OutputEventRenderer@2ce1899b, org.gradle.logging.internal.logback.LogbackLoggingConfigurer@b113622, org.gradle.logging.internal.JavaUtilLoggingConfigurer@16f8f7db]
  16. 15:24:52.319 [DEBUG] [org.gradle.initialization.ScriptEvaluatingSettingsProcessor] Timing: Processing settings took: 0.362 secs
  17. 15:24:52.320 [INFO] [org.gradle.BuildLogger] Settings evaluated using empty settings script.
  18. 15:24:52.389 [DEBUG] [org.gradle.initialization.ProjectPropertySettingBuildLoader] Looking for project properties from: /Users/myuser/Projects/mycompany/com.mycompany.myproject.web/gradle.properties
  19. 15:24:52.390 [DEBUG] [org.gradle.initialization.ProjectPropertySettingBuildLoader] project property file does not exists. We continue!
  20. 15:24:52.392 [INFO] [org.gradle.BuildLogger] Projects loaded. Root project using build file '/Users/myuser/Projects/mycompany/com.mycompany.myproject.web/build.gradle'.
  21. 15:24:52.392 [INFO] [org.gradle.BuildLogger] Included projects: [root project 'com.mycompany.myproject.web']
  22. 15:24:52.394 [INFO] [org.gradle.configuration.BuildScriptProcessor] Evaluating root project 'com.mycompany.myproject.web' using build file '/Users/myuser/Projects/mycompany/com.mycompany.myproject.web/build.gradle'.
  23. 15:24:52.402 [DEBUG] [org.gradle.cache.internal.DefaultFileLockManager] Waiting to acquire shared lock on buildscript class cache for build file '/Users/myuser/Projects/mycompany/com.mycompany.myproject.web/build.gradle' (/Users/myuser/.gradle/caches/1.4/scripts/build_719at15er344nsfrnbutboovf9/ProjectScript/buildscript).
  24. 15:24:52.403 [DEBUG] [org.gradle.cache.internal.DefaultFileLockManager] Lock acquired.
  25. 15:24:52.419 [DEBUG] [org.gradle.logging.internal.DefaultLoggingConfigurer] Finished configuring with level: DEBUG, configurers: [org.gradle.logging.internal.OutputEventRenderer@2ce1899b, org.gradle.logging.internal.logback.LogbackLoggingConfigurer@b113622, org.gradle.logging.internal.JavaUtilLoggingConfigurer@16f8f7db]
  26. 15:24:52.422 [DEBUG] [org.gradle.cache.internal.DefaultFileLockManager] Waiting to acquire shared lock on no_buildscript class cache for build file '/Users/myuser/Projects/mycompany/com.mycompany.myproject.web/build.gradle' (/Users/myuser/.gradle/caches/1.4/scripts/build_719at15er344nsfrnbutboovf9/ProjectScript/no_buildscript).
  27. 15:24:52.423 [DEBUG] [org.gradle.cache.internal.DefaultFileLockManager] Lock acquired.
  28. 15:24:52.559 [DEBUG] [org.gradle.logging.internal.DefaultLoggingConfigurer] Finished configuring with level: DEBUG, configurers: [org.gradle.logging.internal.OutputEventRenderer@2ce1899b, org.gradle.logging.internal.logback.LogbackLoggingConfigurer@b113622, org.gradle.logging.internal.JavaUtilLoggingConfigurer@16f8f7db]
  29. 15:24:52.560 [DEBUG] [org.gradle.configuration.BuildScriptProcessor] Timing: Running the build script took 0.165 secs
  30. 15:24:52.702 [INFO] [org.gradle.BuildLogger] All projects evaluated.
  31. 15:24:52.713 [DEBUG] [org.gradle.execution.taskgraph.DefaultTaskGraphExecuter] Timing: Creating the DAG took 0.0050 secs
  32. 15:24:52.714 [INFO] [org.gradle.execution.TaskNameResolvingBuildConfigurationAction] Selected primary task 'maven2Gradle'
  33. 15:24:52.715 [DEBUG] [org.gradle.cache.internal.DefaultFileLockManager] Waiting to acquire exclusive lock on task artifact state cache (/Users/myuser/Projects/mycompany/com.mycompany.myproject.web/.gradle/1.4/taskArtifacts).
  34. 15:24:52.716 [DEBUG] [org.gradle.cache.internal.DefaultFileLockManager] Lock acquired.
  35. 15:24:52.718 [INFO] [org.gradle.BuildLogger] Tasks to be executed: [task ':maven2Gradle']
  36. 15:24:52.719 [LIFECYCLE] [org.gradle.TaskExecutionLogger] :maven2Gradle
  37. 15:24:52.720 [DEBUG] [org.gradle.api.internal.tasks.execution.ExecuteAtMostOnceTaskExecuter] Starting to execute task ':maven2Gradle'
  38. 15:24:52.721 [DEBUG] [org.gradle.api.internal.tasks.execution.SkipUpToDateTaskExecuter] Determining if task ':maven2Gradle' is up-to-date
  39. 15:24:52.722 [INFO] [org.gradle.api.internal.changedetection.ShortCircuitTaskArtifactStateRepository] Task ':maven2Gradle' has not declared any outputs, assuming that it is out-of-date.
  40. 15:24:52.724 [DEBUG] [org.gradle.api.internal.tasks.execution.SkipUpToDateTaskExecuter] task ':maven2Gradle' is not up-to-date
  41. 15:24:52.725 [DEBUG] [org.gradle.api.internal.changedetection.DefaultFileCacheListener] Invalidate all cached files
  42. 15:24:52.726 [DEBUG] [org.gradle.cache.internal.DefaultFileLockManager] Releasing lock on task artifact state cache (/Users/myuser/Projects/mycompany/com.mycompany.myproject.web/.gradle/1.4/taskArtifacts).
  43. 15:24:52.726 [DEBUG] [org.gradle.api.internal.tasks.execution.ExecuteActionsTaskExecuter] Executing actions for task ':maven2Gradle'.
  44. 15:24:52.735 [LIFECYCLE] [org.gradle.api.plugins.maven.ConvertMaven2Gradle]
  45. ---------------
  46. Maven to Gradle conversion is an "incubating" feature, which means it is still in development.
  47. See /Users/myuser/Dev/gradle-1.4/docs/userguide/feature_lifecycle.html for more on "incubating" features.
  48. Please use it, report any problems and share your feedback with us.
  49. ---------------
  50.  
  51. 15:24:53.665 [DEBUG] [org.gradle.logging.internal.DefaultLoggingConfigurer] Finished configuring with level: DEBUG, configurers: [org.gradle.logging.internal.OutputEventRenderer@2ce1899b, org.gradle.logging.internal.logback.LogbackLoggingConfigurer@b113622, org.gradle.logging.internal.JavaUtilLoggingConfigurer@16f8f7db]
  52. 15:24:53.666 [DEBUG] [org.gradle.cache.internal.DefaultFileLockManager] Waiting to acquire exclusive lock on task artifact state cache (/Users/myuser/Projects/mycompany/com.mycompany.myproject.web/.gradle/1.4/taskArtifacts).
  53. 15:24:53.667 [DEBUG] [org.gradle.cache.internal.DefaultFileLockManager] Lock acquired.
  54. 15:24:53.667 [DEBUG] [org.gradle.api.internal.tasks.execution.ExecuteAtMostOnceTaskExecuter] Finished executing task ':maven2Gradle'
  55. 15:24:53.668 [LIFECYCLE] [org.gradle.TaskExecutionLogger] :maven2Gradle FAILED
  56. 15:24:53.673 [ERROR] [org.gradle.BuildExceptionReporter]
  57. 15:24:53.674 [ERROR] [org.gradle.BuildExceptionReporter] FAILURE: Build failed with an exception.
  58. 15:24:53.675 [ERROR] [org.gradle.BuildExceptionReporter]
  59. 15:24:53.676 [ERROR] [org.gradle.BuildExceptionReporter] * What went wrong:
  60. 15:24:53.676 [ERROR] [org.gradle.BuildExceptionReporter] Execution failed for task ':maven2Gradle'.
  61. 15:24:53.677 [ERROR] [org.gradle.BuildExceptionReporter] > Unable to create maven project model using pom file: /Users/myuser/Projects/mycompany/com.mycompany.myproject.web/pom.xml
  62. 15:24:53.679 [ERROR] [org.gradle.BuildExceptionReporter]
  63. 15:24:53.680 [ERROR] [org.gradle.BuildExceptionReporter] * Exception is:
  64. 15:24:53.681 [ERROR] [org.gradle.BuildExceptionReporter] org.gradle.api.tasks.TaskExecutionException: Execution failed for task ':maven2Gradle'.
  65. 15:24:53.681 [ERROR] [org.gradle.BuildExceptionReporter]    at org.gradle.api.internal.tasks.execution.ExecuteActionsTaskExecuter.executeActions(ExecuteActionsTaskExecuter.java:72)
  66. 15:24:53.682 [ERROR] [org.gradle.BuildExceptionReporter]    at org.gradle.api.internal.tasks.execution.ExecuteActionsTaskExecuter.execute(ExecuteActionsTaskExecuter.java:49)
  67. 15:24:53.683 [ERROR] [org.gradle.BuildExceptionReporter]    at org.gradle.api.internal.tasks.execution.PostExecutionAnalysisTaskExecuter.execute(PostExecutionAnalysisTaskExecuter.java:34)
  68. 15:24:53.683 [ERROR] [org.gradle.BuildExceptionReporter]    at org.gradle.api.internal.changedetection.CacheLockHandlingTaskExecuter$1.run(CacheLockHandlingTaskExecuter.java:34)
  69. 15:24:53.684 [ERROR] [org.gradle.BuildExceptionReporter]    at org.gradle.internal.Factories$1.create(Factories.java:22)
  70. 15:24:53.684 [ERROR] [org.gradle.BuildExceptionReporter]    at org.gradle.cache.internal.DefaultCacheAccess.longRunningOperation(DefaultCacheAccess.java:179)
  71. 15:24:53.685 [ERROR] [org.gradle.BuildExceptionReporter]    at org.gradle.cache.internal.DefaultCacheAccess.longRunningOperation(DefaultCacheAccess.java:232)
  72. 15:24:53.686 [ERROR] [org.gradle.BuildExceptionReporter]    at org.gradle.cache.internal.DefaultPersistentDirectoryStore.longRunningOperation(DefaultPersistentDirectoryStore.java:142)
  73. 15:24:53.686 [ERROR] [org.gradle.BuildExceptionReporter]    at org.gradle.api.internal.changedetection.DefaultTaskArtifactStateCacheAccess.longRunningOperation(DefaultTaskArtifactStateCacheAccess.java:83)
  74. 15:24:53.687 [ERROR] [org.gradle.BuildExceptionReporter]    at org.gradle.api.internal.changedetection.CacheLockHandlingTaskExecuter.execute(CacheLockHandlingTaskExecuter.java:32)
  75. 15:24:53.688 [ERROR] [org.gradle.BuildExceptionReporter]    at org.gradle.api.internal.tasks.execution.SkipUpToDateTaskExecuter.execute(SkipUpToDateTaskExecuter.java:55)
  76. 15:24:53.688 [ERROR] [org.gradle.BuildExceptionReporter]    at org.gradle.api.internal.tasks.execution.ValidatingTaskExecuter.execute(ValidatingTaskExecuter.java:57)
  77. 15:24:53.689 [ERROR] [org.gradle.BuildExceptionReporter]    at org.gradle.api.internal.tasks.execution.SkipEmptySourceFilesTaskExecuter.execute(SkipEmptySourceFilesTaskExecuter.java:41)
  78. 15:24:53.689 [ERROR] [org.gradle.BuildExceptionReporter]    at org.gradle.api.internal.tasks.execution.SkipTaskWithNoActionsExecuter.execute(SkipTaskWithNoActionsExecuter.java:51)
  79. 15:24:53.690 [ERROR] [org.gradle.BuildExceptionReporter]    at org.gradle.api.internal.tasks.execution.SkipOnlyIfTaskExecuter.execute(SkipOnlyIfTaskExecuter.java:52)
  80. 15:24:53.691 [ERROR] [org.gradle.BuildExceptionReporter]    at org.gradle.api.internal.tasks.execution.ExecuteAtMostOnceTaskExecuter.execute(ExecuteAtMostOnceTaskExecuter.java:42)
  81. 15:24:53.691 [ERROR] [org.gradle.BuildExceptionReporter]    at org.gradle.api.internal.AbstractTask.executeWithoutThrowingTaskFailure(AbstractTask.java:275)
  82. 15:24:53.692 [ERROR] [org.gradle.BuildExceptionReporter]    at org.gradle.execution.taskgraph.DefaultTaskPlanExecutor.executeTask(DefaultTaskPlanExecutor.java:52)
  83. 15:24:53.693 [ERROR] [org.gradle.BuildExceptionReporter]    at org.gradle.execution.taskgraph.DefaultTaskPlanExecutor.processTask(DefaultTaskPlanExecutor.java:38)
  84. 15:24:53.693 [ERROR] [org.gradle.BuildExceptionReporter]    at org.gradle.execution.taskgraph.DefaultTaskPlanExecutor.process(DefaultTaskPlanExecutor.java:30)
  85. 15:24:53.694 [ERROR] [org.gradle.BuildExceptionReporter]    at org.gradle.execution.taskgraph.DefaultTaskGraphExecuter.execute(DefaultTaskGraphExecuter.java:84)
  86. 15:24:53.694 [ERROR] [org.gradle.BuildExceptionReporter]    at org.gradle.execution.SelectedTaskExecutionAction.execute(SelectedTaskExecutionAction.java:29)
  87. 15:24:53.695 [ERROR] [org.gradle.BuildExceptionReporter]    at org.gradle.execution.DefaultBuildExecuter.execute(DefaultBuildExecuter.java:61)
  88. 15:24:53.695 [ERROR] [org.gradle.BuildExceptionReporter]    at org.gradle.execution.DefaultBuildExecuter.access$200(DefaultBuildExecuter.java:23)
  89. 15:24:53.696 [ERROR] [org.gradle.BuildExceptionReporter]    at org.gradle.execution.DefaultBuildExecuter$2.proceed(DefaultBuildExecuter.java:67)
  90. 15:24:53.697 [ERROR] [org.gradle.BuildExceptionReporter]    at org.gradle.api.internal.changedetection.TaskCacheLockHandlingBuildExecuter$1.run(TaskCacheLockHandlingBuildExecuter.java:31)
  91. 15:24:53.697 [ERROR] [org.gradle.BuildExceptionReporter]    at org.gradle.internal.Factories$1.create(Factories.java:22)
  92. 15:24:53.698 [ERROR] [org.gradle.BuildExceptionReporter]    at org.gradle.cache.internal.DefaultCacheAccess.useCache(DefaultCacheAccess.java:124)
  93. 15:24:53.698 [ERROR] [org.gradle.BuildExceptionReporter]    at org.gradle.cache.internal.DefaultCacheAccess.useCache(DefaultCacheAccess.java:112)
  94. 15:24:53.699 [ERROR] [org.gradle.BuildExceptionReporter]    at org.gradle.cache.internal.DefaultPersistentDirectoryStore.useCache(DefaultPersistentDirectoryStore.java:134)
  95. 15:24:53.699 [ERROR] [org.gradle.BuildExceptionReporter]    at org.gradle.api.internal.changedetection.DefaultTaskArtifactStateCacheAccess.useCache(DefaultTaskArtifactStateCacheAccess.java:79)
  96. 15:24:53.700 [ERROR] [org.gradle.BuildExceptionReporter]    at org.gradle.api.internal.changedetection.TaskCacheLockHandlingBuildExecuter.execute(TaskCacheLockHandlingBuildExecuter.java:29)
  97. 15:24:53.700 [ERROR] [org.gradle.BuildExceptionReporter]    at org.gradle.execution.DefaultBuildExecuter.execute(DefaultBuildExecuter.java:61)
  98. 15:24:53.701 [ERROR] [org.gradle.BuildExceptionReporter]    at org.gradle.execution.DefaultBuildExecuter.access$200(DefaultBuildExecuter.java:23)
  99. 15:24:53.701 [ERROR] [org.gradle.BuildExceptionReporter]    at org.gradle.execution.DefaultBuildExecuter$2.proceed(DefaultBuildExecuter.java:67)
  100. 15:24:53.702 [ERROR] [org.gradle.BuildExceptionReporter]    at org.gradle.execution.DryRunBuildExecutionAction.execute(DryRunBuildExecutionAction.java:32)
  101. 15:24:53.702 [ERROR] [org.gradle.BuildExceptionReporter]    at org.gradle.execution.DefaultBuildExecuter.execute(DefaultBuildExecuter.java:61)
  102. 15:24:53.703 [ERROR] [org.gradle.BuildExceptionReporter]    at org.gradle.execution.DefaultBuildExecuter.execute(DefaultBuildExecuter.java:54)
  103. 15:24:53.703 [ERROR] [org.gradle.BuildExceptionReporter]    at org.gradle.initialization.DefaultGradleLauncher.doBuildStages(DefaultGradleLauncher.java:165)
  104. 15:24:53.704 [ERROR] [org.gradle.BuildExceptionReporter]    at org.gradle.initialization.DefaultGradleLauncher.doBuild(DefaultGradleLauncher.java:113)
  105. 15:24:53.705 [ERROR] [org.gradle.BuildExceptionReporter]    at org.gradle.initialization.DefaultGradleLauncher.run(DefaultGradleLauncher.java:81)
  106. 15:24:53.705 [ERROR] [org.gradle.BuildExceptionReporter]    at org.gradle.launcher.cli.ExecuteBuildAction.run(ExecuteBuildAction.java:38)
  107. 15:24:53.706 [ERROR] [org.gradle.BuildExceptionReporter]    at org.gradle.launcher.exec.InProcessGradleLauncherActionExecuter.execute(InProcessGradleLauncherActionExecuter.java:39)
  108. 15:24:53.706 [ERROR] [org.gradle.BuildExceptionReporter]    at org.gradle.launcher.exec.InProcessGradleLauncherActionExecuter.execute(InProcessGradleLauncherActionExecuter.java:25)
  109. 15:24:53.707 [ERROR] [org.gradle.BuildExceptionReporter]    at org.gradle.launcher.cli.RunBuildAction.run(RunBuildAction.java:50)
  110. 15:24:53.707 [ERROR] [org.gradle.BuildExceptionReporter]    at org.gradle.api.internal.Actions$RunnableActionAdapter.execute(Actions.java:171)
  111. 15:24:53.708 [ERROR] [org.gradle.BuildExceptionReporter]    at org.gradle.launcher.cli.CommandLineActionFactory$ParseAndBuildAction.execute(CommandLineActionFactory.java:201)
  112. 15:24:53.708 [ERROR] [org.gradle.BuildExceptionReporter]    at org.gradle.launcher.cli.CommandLineActionFactory$ParseAndBuildAction.execute(CommandLineActionFactory.java:174)
  113. 15:24:53.709 [ERROR] [org.gradle.BuildExceptionReporter]    at org.gradle.launcher.cli.CommandLineActionFactory$WithLogging.execute(CommandLineActionFactory.java:170)
  114. 15:24:53.709 [ERROR] [org.gradle.BuildExceptionReporter]    at org.gradle.launcher.cli.CommandLineActionFactory$WithLogging.execute(CommandLineActionFactory.java:139)
  115. 15:24:53.710 [ERROR] [org.gradle.BuildExceptionReporter]    at org.gradle.launcher.cli.ExceptionReportingAction.execute(ExceptionReportingAction.java:33)
  116. 15:24:53.710 [ERROR] [org.gradle.BuildExceptionReporter]    at org.gradle.launcher.cli.ExceptionReportingAction.execute(ExceptionReportingAction.java:22)
  117. 15:24:53.711 [ERROR] [org.gradle.BuildExceptionReporter]    at org.gradle.launcher.Main.doAction(Main.java:48)
  118. 15:24:53.711 [ERROR] [org.gradle.BuildExceptionReporter]    at org.gradle.launcher.bootstrap.EntryPoint.run(EntryPoint.java:45)
  119. 15:24:53.712 [ERROR] [org.gradle.BuildExceptionReporter]    at org.gradle.launcher.Main.main(Main.java:39)
  120. 15:24:53.712 [ERROR] [org.gradle.BuildExceptionReporter]    at org.gradle.launcher.bootstrap.ProcessBootstrap.runNoExit(ProcessBootstrap.java:50)
  121. 15:24:53.713 [ERROR] [org.gradle.BuildExceptionReporter]    at org.gradle.launcher.bootstrap.ProcessBootstrap.run(ProcessBootstrap.java:32)
  122. 15:24:53.713 [ERROR] [org.gradle.BuildExceptionReporter]    at org.gradle.launcher.GradleMain.main(GradleMain.java:26)
  123. 15:24:53.714 [ERROR] [org.gradle.BuildExceptionReporter] Caused by: org.gradle.api.GradleException: Unable to create maven project model using pom file: /Users/myuser/Projects/mycompany/com.mycompany.myproject.web/pom.xml
  124. 15:24:53.715 [ERROR] [org.gradle.BuildExceptionReporter]    at org.gradle.api.plugins.maven.internal.MavenProjectsCreator.create(MavenProjectsCreator.java:54)
  125. 15:24:53.715 [ERROR] [org.gradle.BuildExceptionReporter]    at org.gradle.api.plugins.maven.internal.MavenProjectsCreator$create.call(Unknown Source)
  126. 15:24:53.716 [ERROR] [org.gradle.BuildExceptionReporter]    at org.gradle.api.plugins.maven.ConvertMaven2Gradle.convertNow(ConvertMaven2Gradle.groovy:63)
  127. 15:24:53.716 [ERROR] [org.gradle.BuildExceptionReporter]    at org.gradle.api.internal.BeanDynamicObject$MetaClassAdapter.invokeMethod(BeanDynamicObject.java:216)
  128. 15:24:53.717 [ERROR] [org.gradle.BuildExceptionReporter]    at org.gradle.api.internal.BeanDynamicObject.invokeMethod(BeanDynamicObject.java:122)
  129. 15:24:53.717 [ERROR] [org.gradle.BuildExceptionReporter]    at org.gradle.api.internal.CompositeDynamicObject.invokeMethod(CompositeDynamicObject.java:147)
  130. 15:24:53.718 [ERROR] [org.gradle.BuildExceptionReporter]    at org.gradle.api.plugins.maven.ConvertMaven2Gradle_Decorated.invokeMethod(Unknown Source)
  131. 15:24:53.718 [ERROR] [org.gradle.BuildExceptionReporter]    at org.gradle.util.ReflectionUtil.invoke(ReflectionUtil.groovy:23)
  132. 15:24:53.719 [ERROR] [org.gradle.BuildExceptionReporter]    at org.gradle.api.internal.project.taskfactory.AnnotationProcessingTaskFactory$4.execute(AnnotationProcessingTaskFactory.java:161)
  133. 15:24:53.719 [ERROR] [org.gradle.BuildExceptionReporter]    at org.gradle.api.internal.project.taskfactory.AnnotationProcessingTaskFactory$4.execute(AnnotationProcessingTaskFactory.java:156)
  134. 15:24:53.720 [ERROR] [org.gradle.BuildExceptionReporter]    at org.gradle.api.internal.AbstractTask$TaskActionWrapper.execute(AbstractTask.java:510)
  135. 15:24:53.720 [ERROR] [org.gradle.BuildExceptionReporter]    at org.gradle.api.internal.AbstractTask$TaskActionWrapper.execute(AbstractTask.java:499)
  136. 15:24:53.721 [ERROR] [org.gradle.BuildExceptionReporter]    at org.gradle.api.internal.tasks.execution.ExecuteActionsTaskExecuter.executeActions(ExecuteActionsTaskExecuter.java:64)
  137. 15:24:53.721 [ERROR] [org.gradle.BuildExceptionReporter]    ... 57 more
  138. 15:24:53.722 [ERROR] [org.gradle.BuildExceptionReporter] Caused by: java.lang.NullPointerException
  139. 15:24:53.722 [ERROR] [org.gradle.BuildExceptionReporter]    at org.gradle.mvn3.org.apache.maven.plugin.CacheUtils.getWorkspace(CacheUtils.java:207)
  140. 15:24:53.723 [ERROR] [org.gradle.BuildExceptionReporter]    at org.gradle.mvn3.org.apache.maven.plugin.DefaultPluginArtifactsCache$CacheKey.<init>(DefaultPluginArtifactsCache.java:67)
  141. 15:24:53.723 [ERROR] [org.gradle.BuildExceptionReporter]    at org.gradle.mvn3.org.apache.maven.plugin.DefaultPluginArtifactsCache.createKey(DefaultPluginArtifactsCache.java:141)
  142. 15:24:53.724 [ERROR] [org.gradle.BuildExceptionReporter]    at org.gradle.mvn3.org.apache.maven.project.DefaultProjectBuildingHelper.createProjectRealm(DefaultProjectBuildingHelper.java:223)
  143. 15:24:53.724 [ERROR] [org.gradle.BuildExceptionReporter]    at org.gradle.mvn3.org.apache.maven.project.DefaultModelBuildingListener.buildExtensionsAssembled(DefaultModelBuildingListener.java:106)
  144. 15:24:53.725 [ERROR] [org.gradle.BuildExceptionReporter]    at org.gradle.mvn3.org.apache.maven.model.building.ModelBuildingEventCatapult$1.fire(ModelBuildingEventCatapult.java:43)
  145. 15:24:53.726 [ERROR] [org.gradle.BuildExceptionReporter]    at org.gradle.mvn3.org.apache.maven.model.building.DefaultModelBuilder.fireEvent(DefaultModelBuilder.java:1053)
  146. 15:24:53.726 [ERROR] [org.gradle.BuildExceptionReporter]    at org.gradle.mvn3.org.apache.maven.model.building.DefaultModelBuilder.build(DefaultModelBuilder.java:388)
  147. 15:24:53.727 [ERROR] [org.gradle.BuildExceptionReporter]    at org.gradle.mvn3.org.apache.maven.model.building.DefaultModelBuilder.build(DefaultModelBuilder.java:371)
  148. 15:24:53.727 [ERROR] [org.gradle.BuildExceptionReporter]    at org.gradle.mvn3.org.apache.maven.model.building.DefaultModelBuilder.build(DefaultModelBuilder.java:362)
  149. 15:24:53.727 [ERROR] [org.gradle.BuildExceptionReporter]    at org.gradle.mvn3.org.apache.maven.model.building.DefaultModelBuilder.build(DefaultModelBuilder.java:232)
  150. 15:24:53.728 [ERROR] [org.gradle.BuildExceptionReporter]    at org.gradle.mvn3.org.apache.maven.project.DefaultProjectBuilder.build(DefaultProjectBuilder.java:142)
  151. 15:24:53.728 [ERROR] [org.gradle.BuildExceptionReporter]    at org.gradle.mvn3.org.apache.maven.project.DefaultProjectBuilder.build(DefaultProjectBuilder.java:102)
  152. 15:24:53.729 [ERROR] [org.gradle.BuildExceptionReporter]    at org.gradle.api.plugins.maven.internal.MavenProjectsCreator.createNow(MavenProjectsCreator.java:74)
  153. 15:24:53.729 [ERROR] [org.gradle.BuildExceptionReporter]    at org.gradle.api.plugins.maven.internal.MavenProjectsCreator.create(MavenProjectsCreator.java:52)
  154. 15:24:53.730 [ERROR] [org.gradle.BuildExceptionReporter]    ... 69 more
  155. 15:24:53.730 [ERROR] [org.gradle.BuildExceptionReporter]
  156. 15:24:53.731 [LIFECYCLE] [org.gradle.BuildResultLogger]
  157. 15:24:53.731 [LIFECYCLE] [org.gradle.BuildResultLogger] BUILD FAILED
  158. 15:24:53.732 [LIFECYCLE] [org.gradle.BuildResultLogger]
  159. 15:24:53.732 [LIFECYCLE] [org.gradle.BuildResultLogger] Total time: 2.646 secs
  160. 15:24:53.734 [DEBUG] [org.gradle.cache.internal.DefaultFileLockManager] Releasing lock on task artifact state cache (/Users/myuser/Projects/mycompany/com.mycompany.myproject.web/.gradle/1.4/taskArtifacts).
  161. 15:24:53.735 [DEBUG] [org.gradle.cache.internal.DefaultFileLockManager] Releasing lock on no_buildscript class cache for build file '/Users/myuser/Projects/mycompany/com.mycompany.myproject.web/build.gradle' (/Users/myuser/.gradle/caches/1.4/scripts/build_719at15er344nsfrnbutboovf9/ProjectScript/no_buildscript).
  162. 15:24:53.735 [DEBUG] [org.gradle.cache.internal.DefaultFileLockManager] Releasing lock on buildscript class cache for build file '/Users/myuser/Projects/mycompany/com.mycompany.myproject.web/build.gradle' (/Users/myuser/.gradle/caches/1.4/scripts/build_719at15er344nsfrnbutboovf9/ProjectScript/buildscript).
  163. 15:24:53.748 [DEBUG] [org.gradle.logging.internal.DefaultLoggingConfigurer] Finished configuring with level: DEBUG, configurers: [org.gradle.logging.internal.OutputEventRenderer@2ce1899b, org.gradle.logging.internal.logback.LogbackLoggingConfigurer@b113622, org.gradle.logging.internal.JavaUtilLoggingConfigurer@16f8f7db]
  164. gcintranet:com.mycompany.myproject.web myuser$ clear
  165.  
  166. gcintranet:com.mycompany.myproject.web myuser$ gradle maven2Gradle --stacktrace --info --debug
  167. 15:25:47.601 [DEBUG] [org.gradle.logging.internal.DefaultLoggingConfigurer] Finished configuring with level: DEBUG, configurers: [org.gradle.logging.internal.OutputEventRenderer@2ce1899b, org.gradle.logging.internal.logback.LogbackLoggingConfigurer@b113622, org.gradle.logging.internal.JavaUtilLoggingConfigurer@16f8f7db]
  168. 15:25:48.157 [DEBUG] [org.gradle.logging.internal.DefaultLoggingConfigurer] Finished configuring with level: DEBUG, configurers: [org.gradle.logging.internal.OutputEventRenderer@2ce1899b, org.gradle.logging.internal.logback.LogbackLoggingConfigurer@b113622, org.gradle.logging.internal.JavaUtilLoggingConfigurer@16f8f7db]
  169. 15:25:48.161 [INFO] [org.gradle.BuildLogger] Starting Build
  170. 15:25:48.161 [DEBUG] [org.gradle.BuildLogger] Gradle user home: /Users/myuser/.gradle
  171. 15:25:48.162 [DEBUG] [org.gradle.BuildLogger] Current dir: /Users/myuser/Projects/mycompany/com.mycompany.myproject.web
  172. 15:25:48.163 [DEBUG] [org.gradle.BuildLogger] Settings file: null
  173. 15:25:48.164 [DEBUG] [org.gradle.BuildLogger] Build file: null
  174. 15:25:48.183 [DEBUG] [org.gradle.initialization.BuildSourceBuilder] Starting to build the build sources.
  175. 15:25:48.185 [DEBUG] [org.gradle.initialization.BuildSourceBuilder] Gradle source dir does not exist. We leave.
  176. 15:25:48.185 [DEBUG] [org.gradle.initialization.DefaultGradlePropertiesLoader] Found env project properties: []
  177. 15:25:48.186 [DEBUG] [org.gradle.initialization.DefaultGradlePropertiesLoader] Found system project properties: []
  178. 15:25:48.294 [DEBUG] [org.gradle.api.internal.artifacts.mvnsettings.DefaultLocalMavenRepositoryLocator] No local repository in Settings file defined. Using default path: /Users/myuser/.m2/repository
  179. 15:25:48.540 [DEBUG] [org.gradle.logging.internal.DefaultLoggingConfigurer] Finished configuring with level: DEBUG, configurers: [org.gradle.logging.internal.OutputEventRenderer@2ce1899b, org.gradle.logging.internal.logback.LogbackLoggingConfigurer@b113622, org.gradle.logging.internal.JavaUtilLoggingConfigurer@16f8f7db]
  180. 15:25:48.550 [DEBUG] [org.gradle.logging.internal.DefaultLoggingConfigurer] Finished configuring with level: DEBUG, configurers: [org.gradle.logging.internal.OutputEventRenderer@2ce1899b, org.gradle.logging.internal.logback.LogbackLoggingConfigurer@b113622, org.gradle.logging.internal.JavaUtilLoggingConfigurer@16f8f7db]
  181. 15:25:48.551 [DEBUG] [org.gradle.initialization.ScriptEvaluatingSettingsProcessor] Timing: Processing settings took: 0.364 secs
  182. 15:25:48.552 [INFO] [org.gradle.BuildLogger] Settings evaluated using empty settings script.
  183. 15:25:48.618 [DEBUG] [org.gradle.initialization.ProjectPropertySettingBuildLoader] Looking for project properties from: /Users/myuser/Projects/mycompany/com.mycompany.myproject.web/gradle.properties
  184. 15:25:48.620 [DEBUG] [org.gradle.initialization.ProjectPropertySettingBuildLoader] project property file does not exists. We continue!
  185. 15:25:48.621 [INFO] [org.gradle.BuildLogger] Projects loaded. Root project using build file '/Users/myuser/Projects/mycompany/com.mycompany.myproject.web/build.gradle'.
  186. 15:25:48.623 [INFO] [org.gradle.BuildLogger] Included projects: [root project 'com.mycompany.myproject.web']
  187. 15:25:48.625 [INFO] [org.gradle.configuration.BuildScriptProcessor] Evaluating root project 'com.mycompany.myproject.web' using build file '/Users/myuser/Projects/mycompany/com.mycompany.myproject.web/build.gradle'.
  188. 15:25:48.633 [DEBUG] [org.gradle.cache.internal.DefaultFileLockManager] Waiting to acquire shared lock on buildscript class cache for build file '/Users/myuser/Projects/mycompany/com.mycompany.myproject.web/build.gradle' (/Users/myuser/.gradle/caches/1.4/scripts/build_719at15er344nsfrnbutboovf9/ProjectScript/buildscript).
  189. 15:25:48.634 [DEBUG] [org.gradle.cache.internal.DefaultFileLockManager] Lock acquired.
  190. 15:25:48.650 [DEBUG] [org.gradle.logging.internal.DefaultLoggingConfigurer] Finished configuring with level: DEBUG, configurers: [org.gradle.logging.internal.OutputEventRenderer@2ce1899b, org.gradle.logging.internal.logback.LogbackLoggingConfigurer@b113622, org.gradle.logging.internal.JavaUtilLoggingConfigurer@16f8f7db]
  191. 15:25:48.653 [DEBUG] [org.gradle.cache.internal.DefaultFileLockManager] Waiting to acquire shared lock on no_buildscript class cache for build file '/Users/myuser/Projects/mycompany/com.mycompany.myproject.web/build.gradle' (/Users/myuser/.gradle/caches/1.4/scripts/build_719at15er344nsfrnbutboovf9/ProjectScript/no_buildscript).
  192. 15:25:48.654 [DEBUG] [org.gradle.cache.internal.DefaultFileLockManager] Lock acquired.
  193. 15:25:48.786 [DEBUG] [org.gradle.logging.internal.DefaultLoggingConfigurer] Finished configuring with level: DEBUG, configurers: [org.gradle.logging.internal.OutputEventRenderer@2ce1899b, org.gradle.logging.internal.logback.LogbackLoggingConfigurer@b113622, org.gradle.logging.internal.JavaUtilLoggingConfigurer@16f8f7db]
  194. 15:25:48.787 [DEBUG] [org.gradle.configuration.BuildScriptProcessor] Timing: Running the build script took 0.161 secs
  195. 15:25:48.941 [INFO] [org.gradle.BuildLogger] All projects evaluated.
  196. 15:25:48.952 [DEBUG] [org.gradle.execution.taskgraph.DefaultTaskGraphExecuter] Timing: Creating the DAG took 0.0050 secs
  197. 15:25:48.953 [INFO] [org.gradle.execution.TaskNameResolvingBuildConfigurationAction] Selected primary task 'maven2Gradle'
  198. 15:25:48.954 [DEBUG] [org.gradle.cache.internal.DefaultFileLockManager] Waiting to acquire exclusive lock on task artifact state cache (/Users/myuser/Projects/mycompany/com.mycompany.myproject.web/.gradle/1.4/taskArtifacts).
  199. 15:25:48.956 [DEBUG] [org.gradle.cache.internal.DefaultFileLockManager] Lock acquired.
  200. 15:25:48.958 [INFO] [org.gradle.BuildLogger] Tasks to be executed: [task ':maven2Gradle']
  201. 15:25:48.959 [LIFECYCLE] [org.gradle.TaskExecutionLogger] :maven2Gradle
  202. 15:25:48.960 [DEBUG] [org.gradle.api.internal.tasks.execution.ExecuteAtMostOnceTaskExecuter] Starting to execute task ':maven2Gradle'
  203. 15:25:48.962 [DEBUG] [org.gradle.api.internal.tasks.execution.SkipUpToDateTaskExecuter] Determining if task ':maven2Gradle' is up-to-date
  204. 15:25:48.963 [INFO] [org.gradle.api.internal.changedetection.ShortCircuitTaskArtifactStateRepository] Task ':maven2Gradle' has not declared any outputs, assuming that it is out-of-date.
  205. 15:25:48.965 [DEBUG] [org.gradle.api.internal.tasks.execution.SkipUpToDateTaskExecuter] task ':maven2Gradle' is not up-to-date
  206. 15:25:48.966 [DEBUG] [org.gradle.api.internal.changedetection.DefaultFileCacheListener] Invalidate all cached files
  207. 15:25:48.967 [DEBUG] [org.gradle.cache.internal.DefaultFileLockManager] Releasing lock on task artifact state cache (/Users/myuser/Projects/mycompany/com.mycompany.myproject.web/.gradle/1.4/taskArtifacts).
  208. 15:25:48.968 [DEBUG] [org.gradle.api.internal.tasks.execution.ExecuteActionsTaskExecuter] Executing actions for task ':maven2Gradle'.
  209. 15:25:48.977 [LIFECYCLE] [org.gradle.api.plugins.maven.ConvertMaven2Gradle]
  210. ---------------
  211. Maven to Gradle conversion is an "incubating" feature, which means it is still in development.
  212. See /Users/myuser/Dev/gradle-1.4/docs/userguide/feature_lifecycle.html for more on "incubating" features.
  213. Please use it, report any problems and share your feedback with us.
  214. ---------------
  215.  
  216. 15:25:49.922 [DEBUG] [org.gradle.logging.internal.DefaultLoggingConfigurer] Finished configuring with level: DEBUG, configurers: [org.gradle.logging.internal.OutputEventRenderer@2ce1899b, org.gradle.logging.internal.logback.LogbackLoggingConfigurer@b113622, org.gradle.logging.internal.JavaUtilLoggingConfigurer@16f8f7db]
  217. 15:25:49.923 [DEBUG] [org.gradle.cache.internal.DefaultFileLockManager] Waiting to acquire exclusive lock on task artifact state cache (/Users/myuser/Projects/mycompany/com.mycompany.myproject.web/.gradle/1.4/taskArtifacts).
  218. 15:25:49.924 [DEBUG] [org.gradle.cache.internal.DefaultFileLockManager] Lock acquired.
  219. 15:25:49.924 [DEBUG] [org.gradle.api.internal.tasks.execution.ExecuteAtMostOnceTaskExecuter] Finished executing task ':maven2Gradle'
  220. 15:25:49.925 [LIFECYCLE] [org.gradle.TaskExecutionLogger] :maven2Gradle FAILED
  221. 15:25:49.930 [ERROR] [org.gradle.BuildExceptionReporter]
  222. 15:25:49.931 [ERROR] [org.gradle.BuildExceptionReporter] FAILURE: Build failed with an exception.
  223. 15:25:49.932 [ERROR] [org.gradle.BuildExceptionReporter]
  224. 15:25:49.933 [ERROR] [org.gradle.BuildExceptionReporter] * What went wrong:
  225. 15:25:49.933 [ERROR] [org.gradle.BuildExceptionReporter] Execution failed for task ':maven2Gradle'.
  226. 15:25:49.934 [ERROR] [org.gradle.BuildExceptionReporter] > Unable to create maven project model using pom file: /Users/myuser/Projects/mycompany/com.mycompany.myproject.web/pom.xml
  227. 15:25:49.936 [ERROR] [org.gradle.BuildExceptionReporter]
  228. 15:25:49.937 [ERROR] [org.gradle.BuildExceptionReporter] * Exception is:
  229. 15:25:49.938 [ERROR] [org.gradle.BuildExceptionReporter] org.gradle.api.tasks.TaskExecutionException: Execution failed for task ':maven2Gradle'.
  230. 15:25:49.938 [ERROR] [org.gradle.BuildExceptionReporter]    at org.gradle.api.internal.tasks.execution.ExecuteActionsTaskExecuter.executeActions(ExecuteActionsTaskExecuter.java:72)
  231. 15:25:49.939 [ERROR] [org.gradle.BuildExceptionReporter]    at org.gradle.api.internal.tasks.execution.ExecuteActionsTaskExecuter.execute(ExecuteActionsTaskExecuter.java:49)
  232. 15:25:49.939 [ERROR] [org.gradle.BuildExceptionReporter]    at org.gradle.api.internal.tasks.execution.PostExecutionAnalysisTaskExecuter.execute(PostExecutionAnalysisTaskExecuter.java:34)
  233. 15:25:49.940 [ERROR] [org.gradle.BuildExceptionReporter]    at org.gradle.api.internal.changedetection.CacheLockHandlingTaskExecuter$1.run(CacheLockHandlingTaskExecuter.java:34)
  234. 15:25:49.941 [ERROR] [org.gradle.BuildExceptionReporter]    at org.gradle.internal.Factories$1.create(Factories.java:22)
  235. 15:25:49.941 [ERROR] [org.gradle.BuildExceptionReporter]    at org.gradle.cache.internal.DefaultCacheAccess.longRunningOperation(DefaultCacheAccess.java:179)
  236. 15:25:49.942 [ERROR] [org.gradle.BuildExceptionReporter]    at org.gradle.cache.internal.DefaultCacheAccess.longRunningOperation(DefaultCacheAccess.java:232)
  237. 15:25:49.942 [ERROR] [org.gradle.BuildExceptionReporter]    at org.gradle.cache.internal.DefaultPersistentDirectoryStore.longRunningOperation(DefaultPersistentDirectoryStore.java:142)
  238. 15:25:49.943 [ERROR] [org.gradle.BuildExceptionReporter]    at org.gradle.api.internal.changedetection.DefaultTaskArtifactStateCacheAccess.longRunningOperation(DefaultTaskArtifactStateCacheAccess.java:83)
  239. 15:25:49.944 [ERROR] [org.gradle.BuildExceptionReporter]    at org.gradle.api.internal.changedetection.CacheLockHandlingTaskExecuter.execute(CacheLockHandlingTaskExecuter.java:32)
  240. 15:25:49.944 [ERROR] [org.gradle.BuildExceptionReporter]    at org.gradle.api.internal.tasks.execution.SkipUpToDateTaskExecuter.execute(SkipUpToDateTaskExecuter.java:55)
  241. 15:25:49.945 [ERROR] [org.gradle.BuildExceptionReporter]    at org.gradle.api.internal.tasks.execution.ValidatingTaskExecuter.execute(ValidatingTaskExecuter.java:57)
  242. 15:25:49.945 [ERROR] [org.gradle.BuildExceptionReporter]    at org.gradle.api.internal.tasks.execution.SkipEmptySourceFilesTaskExecuter.execute(SkipEmptySourceFilesTaskExecuter.java:41)
  243. 15:25:49.946 [ERROR] [org.gradle.BuildExceptionReporter]    at org.gradle.api.internal.tasks.execution.SkipTaskWithNoActionsExecuter.execute(SkipTaskWithNoActionsExecuter.java:51)
  244. 15:25:49.947 [ERROR] [org.gradle.BuildExceptionReporter]    at org.gradle.api.internal.tasks.execution.SkipOnlyIfTaskExecuter.execute(SkipOnlyIfTaskExecuter.java:52)
  245. 15:25:49.947 [ERROR] [org.gradle.BuildExceptionReporter]    at org.gradle.api.internal.tasks.execution.ExecuteAtMostOnceTaskExecuter.execute(ExecuteAtMostOnceTaskExecuter.java:42)
  246. 15:25:49.948 [ERROR] [org.gradle.BuildExceptionReporter]    at org.gradle.api.internal.AbstractTask.executeWithoutThrowingTaskFailure(AbstractTask.java:275)
  247. 15:25:49.949 [ERROR] [org.gradle.BuildExceptionReporter]    at org.gradle.execution.taskgraph.DefaultTaskPlanExecutor.executeTask(DefaultTaskPlanExecutor.java:52)
  248. 15:25:49.949 [ERROR] [org.gradle.BuildExceptionReporter]    at org.gradle.execution.taskgraph.DefaultTaskPlanExecutor.processTask(DefaultTaskPlanExecutor.java:38)
  249. 15:25:49.950 [ERROR] [org.gradle.BuildExceptionReporter]    at org.gradle.execution.taskgraph.DefaultTaskPlanExecutor.process(DefaultTaskPlanExecutor.java:30)
  250. 15:25:49.951 [ERROR] [org.gradle.BuildExceptionReporter]    at org.gradle.execution.taskgraph.DefaultTaskGraphExecuter.execute(DefaultTaskGraphExecuter.java:84)
  251. 15:25:49.951 [ERROR] [org.gradle.BuildExceptionReporter]    at org.gradle.execution.SelectedTaskExecutionAction.execute(SelectedTaskExecutionAction.java:29)
  252. 15:25:49.952 [ERROR] [org.gradle.BuildExceptionReporter]    at org.gradle.execution.DefaultBuildExecuter.execute(DefaultBuildExecuter.java:61)
  253. 15:25:49.952 [ERROR] [org.gradle.BuildExceptionReporter]    at org.gradle.execution.DefaultBuildExecuter.access$200(DefaultBuildExecuter.java:23)
  254. 15:25:49.953 [ERROR] [org.gradle.BuildExceptionReporter]    at org.gradle.execution.DefaultBuildExecuter$2.proceed(DefaultBuildExecuter.java:67)
  255. 15:25:49.953 [ERROR] [org.gradle.BuildExceptionReporter]    at org.gradle.api.internal.changedetection.TaskCacheLockHandlingBuildExecuter$1.run(TaskCacheLockHandlingBuildExecuter.java:31)
  256. 15:25:49.954 [ERROR] [org.gradle.BuildExceptionReporter]    at org.gradle.internal.Factories$1.create(Factories.java:22)
  257. 15:25:49.954 [ERROR] [org.gradle.BuildExceptionReporter]    at org.gradle.cache.internal.DefaultCacheAccess.useCache(DefaultCacheAccess.java:124)
  258. 15:25:49.955 [ERROR] [org.gradle.BuildExceptionReporter]    at org.gradle.cache.internal.DefaultCacheAccess.useCache(DefaultCacheAccess.java:112)
  259. 15:25:49.956 [ERROR] [org.gradle.BuildExceptionReporter]    at org.gradle.cache.internal.DefaultPersistentDirectoryStore.useCache(DefaultPersistentDirectoryStore.java:134)
  260. 15:25:49.956 [ERROR] [org.gradle.BuildExceptionReporter]    at org.gradle.api.internal.changedetection.DefaultTaskArtifactStateCacheAccess.useCache(DefaultTaskArtifactStateCacheAccess.java:79)
  261. 15:25:49.957 [ERROR] [org.gradle.BuildExceptionReporter]    at org.gradle.api.internal.changedetection.TaskCacheLockHandlingBuildExecuter.execute(TaskCacheLockHandlingBuildExecuter.java:29)
  262. 15:25:49.957 [ERROR] [org.gradle.BuildExceptionReporter]    at org.gradle.execution.DefaultBuildExecuter.execute(DefaultBuildExecuter.java:61)
  263. 15:25:49.958 [ERROR] [org.gradle.BuildExceptionReporter]    at org.gradle.execution.DefaultBuildExecuter.access$200(DefaultBuildExecuter.java:23)
  264. 15:25:49.958 [ERROR] [org.gradle.BuildExceptionReporter]    at org.gradle.execution.DefaultBuildExecuter$2.proceed(DefaultBuildExecuter.java:67)
  265. 15:25:49.959 [ERROR] [org.gradle.BuildExceptionReporter]    at org.gradle.execution.DryRunBuildExecutionAction.execute(DryRunBuildExecutionAction.java:32)
  266. 15:25:49.959 [ERROR] [org.gradle.BuildExceptionReporter]    at org.gradle.execution.DefaultBuildExecuter.execute(DefaultBuildExecuter.java:61)
  267. 15:25:49.960 [ERROR] [org.gradle.BuildExceptionReporter]    at org.gradle.execution.DefaultBuildExecuter.execute(DefaultBuildExecuter.java:54)
  268. 15:25:49.961 [ERROR] [org.gradle.BuildExceptionReporter]    at org.gradle.initialization.DefaultGradleLauncher.doBuildStages(DefaultGradleLauncher.java:165)
  269. 15:25:49.962 [ERROR] [org.gradle.BuildExceptionReporter]    at org.gradle.initialization.DefaultGradleLauncher.doBuild(DefaultGradleLauncher.java:113)
  270. 15:25:49.963 [ERROR] [org.gradle.BuildExceptionReporter]    at org.gradle.initialization.DefaultGradleLauncher.run(DefaultGradleLauncher.java:81)
  271. 15:25:49.963 [ERROR] [org.gradle.BuildExceptionReporter]    at org.gradle.launcher.cli.ExecuteBuildAction.run(ExecuteBuildAction.java:38)
  272. 15:25:49.964 [ERROR] [org.gradle.BuildExceptionReporter]    at org.gradle.launcher.exec.InProcessGradleLauncherActionExecuter.execute(InProcessGradleLauncherActionExecuter.java:39)
  273. 15:25:49.965 [ERROR] [org.gradle.BuildExceptionReporter]    at org.gradle.launcher.exec.InProcessGradleLauncherActionExecuter.execute(InProcessGradleLauncherActionExecuter.java:25)
  274. 15:25:49.965 [ERROR] [org.gradle.BuildExceptionReporter]    at org.gradle.launcher.cli.RunBuildAction.run(RunBuildAction.java:50)
  275. 15:25:49.966 [ERROR] [org.gradle.BuildExceptionReporter]    at org.gradle.api.internal.Actions$RunnableActionAdapter.execute(Actions.java:171)
  276. 15:25:49.966 [ERROR] [org.gradle.BuildExceptionReporter]    at org.gradle.launcher.cli.CommandLineActionFactory$ParseAndBuildAction.execute(CommandLineActionFactory.java:201)
  277. 15:25:49.967 [ERROR] [org.gradle.BuildExceptionReporter]    at org.gradle.launcher.cli.CommandLineActionFactory$ParseAndBuildAction.execute(CommandLineActionFactory.java:174)
  278. 15:25:49.967 [ERROR] [org.gradle.BuildExceptionReporter]    at org.gradle.launcher.cli.CommandLineActionFactory$WithLogging.execute(CommandLineActionFactory.java:170)
  279. 15:25:49.968 [ERROR] [org.gradle.BuildExceptionReporter]    at org.gradle.launcher.cli.CommandLineActionFactory$WithLogging.execute(CommandLineActionFactory.java:139)
  280. 15:25:49.969 [ERROR] [org.gradle.BuildExceptionReporter]    at org.gradle.launcher.cli.ExceptionReportingAction.execute(ExceptionReportingAction.java:33)
  281. 15:25:49.970 [ERROR] [org.gradle.BuildExceptionReporter]    at org.gradle.launcher.cli.ExceptionReportingAction.execute(ExceptionReportingAction.java:22)
  282. 15:25:49.970 [ERROR] [org.gradle.BuildExceptionReporter]    at org.gradle.launcher.Main.doAction(Main.java:48)
  283. 15:25:49.971 [ERROR] [org.gradle.BuildExceptionReporter]    at org.gradle.launcher.bootstrap.EntryPoint.run(EntryPoint.java:45)
  284. 15:25:49.971 [ERROR] [org.gradle.BuildExceptionReporter]    at org.gradle.launcher.Main.main(Main.java:39)
  285. 15:25:49.972 [ERROR] [org.gradle.BuildExceptionReporter]    at org.gradle.launcher.bootstrap.ProcessBootstrap.runNoExit(ProcessBootstrap.java:50)
  286. 15:25:49.972 [ERROR] [org.gradle.BuildExceptionReporter]    at org.gradle.launcher.bootstrap.ProcessBootstrap.run(ProcessBootstrap.java:32)
  287. 15:25:49.973 [ERROR] [org.gradle.BuildExceptionReporter]    at org.gradle.launcher.GradleMain.main(GradleMain.java:26)
  288. 15:25:49.973 [ERROR] [org.gradle.BuildExceptionReporter] Caused by: org.gradle.api.GradleException: Unable to create maven project model using pom file: /Users/myuser/Projects/mycompany/com.mycompany.myproject.web/pom.xml
  289. 15:25:49.974 [ERROR] [org.gradle.BuildExceptionReporter]    at org.gradle.api.plugins.maven.internal.MavenProjectsCreator.create(MavenProjectsCreator.java:54)
  290. 15:25:49.974 [ERROR] [org.gradle.BuildExceptionReporter]    at org.gradle.api.plugins.maven.internal.MavenProjectsCreator$create.call(Unknown Source)
  291. 15:25:49.975 [ERROR] [org.gradle.BuildExceptionReporter]    at org.gradle.api.plugins.maven.ConvertMaven2Gradle.convertNow(ConvertMaven2Gradle.groovy:63)
  292. 15:25:49.975 [ERROR] [org.gradle.BuildExceptionReporter]    at org.gradle.api.internal.BeanDynamicObject$MetaClassAdapter.invokeMethod(BeanDynamicObject.java:216)
  293. 15:25:49.976 [ERROR] [org.gradle.BuildExceptionReporter]    at org.gradle.api.internal.BeanDynamicObject.invokeMethod(BeanDynamicObject.java:122)
  294. 15:25:49.976 [ERROR] [org.gradle.BuildExceptionReporter]    at org.gradle.api.internal.CompositeDynamicObject.invokeMethod(CompositeDynamicObject.java:147)
  295. 15:25:49.977 [ERROR] [org.gradle.BuildExceptionReporter]    at org.gradle.api.plugins.maven.ConvertMaven2Gradle_Decorated.invokeMethod(Unknown Source)
  296. 15:25:49.977 [ERROR] [org.gradle.BuildExceptionReporter]    at org.gradle.util.ReflectionUtil.invoke(ReflectionUtil.groovy:23)
  297. 15:25:49.978 [ERROR] [org.gradle.BuildExceptionReporter]    at org.gradle.api.internal.project.taskfactory.AnnotationProcessingTaskFactory$4.execute(AnnotationProcessingTaskFactory.java:161)
  298. 15:25:49.979 [ERROR] [org.gradle.BuildExceptionReporter]    at org.gradle.api.internal.project.taskfactory.AnnotationProcessingTaskFactory$4.execute(AnnotationProcessingTaskFactory.java:156)
  299. 15:25:49.979 [ERROR] [org.gradle.BuildExceptionReporter]    at org.gradle.api.internal.AbstractTask$TaskActionWrapper.execute(AbstractTask.java:510)
  300. 15:25:49.980 [ERROR] [org.gradle.BuildExceptionReporter]    at org.gradle.api.internal.AbstractTask$TaskActionWrapper.execute(AbstractTask.java:499)
  301. 15:25:49.980 [ERROR] [org.gradle.BuildExceptionReporter]    at org.gradle.api.internal.tasks.execution.ExecuteActionsTaskExecuter.executeActions(ExecuteActionsTaskExecuter.java:64)
  302. 15:25:49.981 [ERROR] [org.gradle.BuildExceptionReporter]    ... 57 more
  303. 15:25:49.981 [ERROR] [org.gradle.BuildExceptionReporter] Caused by: java.lang.NullPointerException
  304. 15:25:49.982 [ERROR] [org.gradle.BuildExceptionReporter]    at org.gradle.mvn3.org.apache.maven.plugin.CacheUtils.getWorkspace(CacheUtils.java:207)
  305. 15:25:49.982 [ERROR] [org.gradle.BuildExceptionReporter]    at org.gradle.mvn3.org.apache.maven.plugin.DefaultPluginArtifactsCache$CacheKey.<init>(DefaultPluginArtifactsCache.java:67)
  306. 15:25:49.983 [ERROR] [org.gradle.BuildExceptionReporter]    at org.gradle.mvn3.org.apache.maven.plugin.DefaultPluginArtifactsCache.createKey(DefaultPluginArtifactsCache.java:141)
  307. 15:25:49.983 [ERROR] [org.gradle.BuildExceptionReporter]    at org.gradle.mvn3.org.apache.maven.project.DefaultProjectBuildingHelper.createProjectRealm(DefaultProjectBuildingHelper.java:223)
  308. 15:25:49.984 [ERROR] [org.gradle.BuildExceptionReporter]    at org.gradle.mvn3.org.apache.maven.project.DefaultModelBuildingListener.buildExtensionsAssembled(DefaultModelBuildingListener.java:106)
  309. 15:25:49.984 [ERROR] [org.gradle.BuildExceptionReporter]    at org.gradle.mvn3.org.apache.maven.model.building.ModelBuildingEventCatapult$1.fire(ModelBuildingEventCatapult.java:43)
  310. 15:25:49.985 [ERROR] [org.gradle.BuildExceptionReporter]    at org.gradle.mvn3.org.apache.maven.model.building.DefaultModelBuilder.fireEvent(DefaultModelBuilder.java:1053)
  311. 15:25:49.985 [ERROR] [org.gradle.BuildExceptionReporter]    at org.gradle.mvn3.org.apache.maven.model.building.DefaultModelBuilder.build(DefaultModelBuilder.java:388)
  312. 15:25:49.986 [ERROR] [org.gradle.BuildExceptionReporter]    at org.gradle.mvn3.org.apache.maven.model.building.DefaultModelBuilder.build(DefaultModelBuilder.java:371)
  313. 15:25:49.986 [ERROR] [org.gradle.BuildExceptionReporter]    at org.gradle.mvn3.org.apache.maven.model.building.DefaultModelBuilder.build(DefaultModelBuilder.java:362)
  314. 15:25:49.987 [ERROR] [org.gradle.BuildExceptionReporter]    at org.gradle.mvn3.org.apache.maven.model.building.DefaultModelBuilder.build(DefaultModelBuilder.java:232)
  315. 15:25:49.987 [ERROR] [org.gradle.BuildExceptionReporter]    at org.gradle.mvn3.org.apache.maven.project.DefaultProjectBuilder.build(DefaultProjectBuilder.java:142)
  316. 15:25:49.988 [ERROR] [org.gradle.BuildExceptionReporter]    at org.gradle.mvn3.org.apache.maven.project.DefaultProjectBuilder.build(DefaultProjectBuilder.java:102)
  317. 15:25:49.988 [ERROR] [org.gradle.BuildExceptionReporter]    at org.gradle.api.plugins.maven.internal.MavenProjectsCreator.createNow(MavenProjectsCreator.java:74)
  318. 15:25:49.989 [ERROR] [org.gradle.BuildExceptionReporter]    at org.gradle.api.plugins.maven.internal.MavenProjectsCreator.create(MavenProjectsCreator.java:52)
  319. 15:25:49.989 [ERROR] [org.gradle.BuildExceptionReporter]    ... 69 more
  320. 15:25:49.990 [ERROR] [org.gradle.BuildExceptionReporter]
  321. 15:25:49.990 [LIFECYCLE] [org.gradle.BuildResultLogger]
  322. 15:25:49.991 [LIFECYCLE] [org.gradle.BuildResultLogger] BUILD FAILED
  323. 15:25:49.991 [LIFECYCLE] [org.gradle.BuildResultLogger]
  324. 15:25:49.992 [LIFECYCLE] [org.gradle.BuildResultLogger] Total time: 2.675 secs
  325. 15:25:49.994 [DEBUG] [org.gradle.cache.internal.DefaultFileLockManager] Releasing lock on task artifact state cache (/Users/myuser/Projects/mycompany/com.mycompany.myproject.web/.gradle/1.4/taskArtifacts).
  326. 15:25:49.994 [DEBUG] [org.gradle.cache.internal.DefaultFileLockManager] Releasing lock on no_buildscript class cache for build file '/Users/myuser/Projects/mycompany/com.mycompany.myproject.web/build.gradle' (/Users/myuser/.gradle/caches/1.4/scripts/build_719at15er344nsfrnbutboovf9/ProjectScript/no_buildscript).
  327. 15:25:49.995 [DEBUG] [org.gradle.cache.internal.DefaultFileLockManager] Releasing lock on buildscript class cache for build file '/Users/myuser/Projects/mycompany/com.mycompany.myproject.web/build.gradle' (/Users/myuser/.gradle/caches/1.4/scripts/build_719at15er344nsfrnbutboovf9/ProjectScript/buildscript).
  328. 15:25:50.008 [DEBUG] [org.gradle.logging.internal.DefaultLoggingConfigurer] Finished configuring with level: DEBUG, configurers: [org.gradle.logging.internal.OutputEventRenderer@2ce1899b, org.gradle.logging.internal.logback.LogbackLoggingConfigurer@b113622, org.gradle.logging.internal.JavaUtilLoggingConfigurer@16f8f7db]
Advertisement
Add Comment
Please, Sign In to add comment