SHARE
TWEET

Untitled

a guest Aug 12th, 2010 42 Never
  1. [ 64%] Building CXX object src/CMakeFiles/amarok.dir/main.o
  2. Linking CXX executable amarok
  3. /usr/lib/libknewstuff3.so.4: undefined reference to `Attica::Provider::hasContentService() const'
  4. collect2: ld врати излазни статус 1
  5. make[2]: *** [src/amarok] Error 1
  6. make[1]: *** [src/CMakeFiles/amarok.dir/all] Error 2
  7. make: *** [all] Error 2
  8.     Aborting...
RAW Paste Data
Top