SHARE
TWEET

Untitled

a guest Aug 5th, 2012 62 Never
  1. /var/tmp/portage/media-sound/lmms-0.4.13-r1/work/lmms-0.4.13/plugins/zynaddsubfx/LocalZynAddSubFx.cpp: In member function ‘void LocalZynAddSubFx::loadXML(const string&)’:
  2. /var/tmp/portage/media-sound/lmms-0.4.13-r1/work/lmms-0.4.13/plugins/zynaddsubfx/LocalZynAddSubFx.cpp:132:12: error: ‘unlink’ was not declared in this scope
  3. make[2]: *** [plugins/zynaddsubfx/CMakeFiles/ZynAddSubFxCore.dir/LocalZynAddSubFx.o] Error 1
  4. make[2]: Leaving directory `/var/tmp/portage/media-sound/lmms-0.4.13-r1/work/lmms-0.4.13_build'
  5. make[1]: *** [plugins/zynaddsubfx/CMakeFiles/ZynAddSubFxCore.dir/all] Error 2
  6. make[1]: *** Waiting for unfinished jobs....
RAW Paste Data
Top