Guest User

make error

a guest
Jun 5th, 2014
241
0
Never
Not a member of Pastebin yet? Sign Up, it unlocks many cool features!
text 5.01 KB | None | 0 0
  1. alex@Dell-Ubuntu:~/fprint_vfs5011-master$ make
  2. (CDPATH="${ZSH_VERSION+.}:" && cd . && /bin/bash /home/alex/fprint_vfs5011-master/missing autoheader)
  3. configure.ac:269: warning: AC_LANG_CONFTEST: no AC_LANG_SOURCE call detected in body
  4. ../../lib/autoconf/lang.m4:193: AC_LANG_CONFTEST is expanded from...
  5. ../../lib/autoconf/general.m4:2590: _AC_COMPILE_IFELSE is expanded from...
  6. ../../lib/autoconf/general.m4:2606: AC_COMPILE_IFELSE is expanded from...
  7. configure.ac:269: the top level
  8. rm -f stamp-h1
  9. touch config.h.in
  10. cd . && /bin/bash ./config.status config.h
  11. config.status: creating config.h
  12. config.status: config.h is unchanged
  13. make all-recursive
  14. make[1]: Betrete Verzeichnis '/home/alex/fprint_vfs5011-master'
  15. Making all in libfprint
  16. make[2]: Betrete Verzeichnis '/home/alex/fprint_vfs5011-master/libfprint'
  17. CC libfprint_la-async.lo
  18. CC libfprint_la-core.lo
  19. core.c: In function 'fpi_log':
  20. core.c:327:3: warning: format '%d' expects argument of type 'int', but argument 3 has type '__time_t' [-Wformat=]
  21. function);
  22. ^
  23. core.c:327:3: warning: format '%d' expects argument of type 'int', but argument 4 has type '__suseconds_t' [-Wformat=]
  24. CC libfprint_la-data.lo
  25. CC libfprint_la-drv.lo
  26. CC libfprint_la-img.lo
  27. CC libfprint_la-imgdev.lo
  28. CC libfprint_la-poll.lo
  29. CC libfprint_la-sync.lo
  30. CC libfprint_la-upeke2.lo
  31. CC libfprint_la-upekts.lo
  32. CC libfprint_la-upeksonly.lo
  33. CC libfprint_la-upektc.lo
  34. CC libfprint_la-uru4000.lo
  35. CC libfprint_la-vcom5s.lo
  36. CC libfprint_la-aes1610.lo
  37. CC libfprint_la-aes1660.lo
  38. CC libfprint_la-aes2501.lo
  39. CC libfprint_la-aes2550.lo
  40. CC libfprint_la-aes2660.lo
  41. CC libfprint_la-aes4000.lo
  42. CC libfprint_la-vfs101.lo
  43. CC libfprint_la-vfs301.lo
  44. CC libfprint_la-vfs301_proto.lo
  45. CC libfprint_la-vfs5011.lo
  46. drivers/vfs5011.c:21:14: warning: function declaration isn't a prototype [-Wstrict-prototypes]
  47. static char *get_debugfiles_path()
  48. ^
  49. drivers/vfs5011.c: In function 'debugprint':
  50. drivers/vfs5011.c:43:3: warning: format '%d' expects argument of type 'int', but argument 3 has type '__time_t' [-Wformat=]
  51. fprintf(debuglogfile, "%d.%.3d\t", t.tv_sec, t.tv_usec/1000);
  52. ^
  53. drivers/vfs5011.c:43:3: warning: format '%d' expects argument of type 'int', but argument 4 has type '__suseconds_t' [-Wformat=]
  54. drivers/vfs5011.c: In function 'vfs5011_rescale_image':
  55. drivers/vfs5011.c:467:6: warning: unused variable 'on_good_offsets' [-Wunused-variable]
  56. int on_good_offsets = 0;
  57. ^
  58. drivers/vfs5011.c: In function 'process_chunk':
  59. drivers/vfs5011.c:605:6: warning: unused variable 'remainder' [-Wunused-variable]
  60. int remainder = transferred % VFS5011_LINE_SIZE;
  61. ^
  62. drivers/vfs5011.c: In function 'submit_image':
  63. drivers/vfs5011.c:676:8: warning: unused variable 'debugfile' [-Wunused-variable]
  64. FILE *debugfile = NULL;
  65. ^
  66. drivers/vfs5011.c: At top level:
  67. drivers/vfs5011.c:363:12: warning: 'get_deviation_int' defined but not used [-Wunused-function]
  68. static int get_deviation_int(int *buf, int size)
  69. ^
  70. CC libfprint_la-gdkpixbuf.lo
  71. gdkpixbuf.c: In function 'fpi_im_resize':
  72. gdkpixbuf.c:35:2: warning: 'g_type_init' is deprecated (declared at /usr/include/glib-2.0/gobject/gtype.h:667) [-Wdeprecated-declarations]
  73. g_type_init ();
  74. ^
  75. CC libfprint_la-aeslib.lo
  76. CC libfprint_la-aesx660.lo
  77. CC libfprint_la-bozorth3.lo
  78. CC libfprint_la-bz_alloc.lo
  79. CC libfprint_la-bz_drvrs.lo
  80. CC libfprint_la-bz_gbls.lo
  81. CC libfprint_la-bz_io.lo
  82. CC libfprint_la-bz_sort.lo
  83. CC libfprint_la-binar.lo
  84. CC libfprint_la-block.lo
  85. CC libfprint_la-contour.lo
  86. CC libfprint_la-detect.lo
  87. CC libfprint_la-dft.lo
  88. CC libfprint_la-free.lo
  89. CC libfprint_la-globals.lo
  90. CC libfprint_la-imgutil.lo
  91. CC libfprint_la-init.lo
  92. CC libfprint_la-line.lo
  93. CC libfprint_la-log.lo
  94. CC libfprint_la-loop.lo
  95. CC libfprint_la-maps.lo
  96. CC libfprint_la-matchpat.lo
  97. CC libfprint_la-minutia.lo
  98. CC libfprint_la-morph.lo
  99. CC libfprint_la-quality.lo
  100. CC libfprint_la-remove.lo
  101. CC libfprint_la-ridges.lo
  102. CC libfprint_la-shape.lo
  103. CC libfprint_la-sort.lo
  104. CC libfprint_la-util.lo
  105. CCLD libfprint.la
  106. CC fprint_list_udev_rules-fprint-list-udev-rules.o
  107. CCLD fprint-list-udev-rules
  108. /usr/bin/ld: fprint_list_udev_rules-fprint-list-udev-rules.o: undefined reference to symbol 'g_str_equal'
  109. //lib/x86_64-linux-gnu/libglib-2.0.so.0: error adding symbols: DSO missing from command line
  110. collect2: error: ld returned 1 exit status
  111. make[2]: *** [fprint-list-udev-rules] Fehler 1
  112. make[2]: Verlasse Verzeichnis '/home/alex/fprint_vfs5011-master/libfprint'
  113. make[1]: *** [all-recursive] Fehler 1
  114. make[1]: Verlasse Verzeichnis '/home/alex/fprint_vfs5011-master'
  115. make: *** [all] Fehler 2
Advertisement
Add Comment
Please, Sign In to add comment