Pastebin launched a little side project called VERYVIRAL.com, check it out ;-) Want more features on Pastebin? Sign Up, it's FREE!
Guest

e4rat-lite-git build log

By: a guest on Jul 30th, 2012  |  syntax: CMake  |  size: 12.96 KB  |  views: 47  |  expires: Never
download  |  raw  |  embed  |  report abuse  |  print
Text below is selected. Please press Ctrl+C to copy to your clipboard. (⌘+C on Mac)
  1. -- The C compiler identification is GNU 4.7.1
  2. -- The CXX compiler identification is GNU 4.7.1
  3. -- Check for working C compiler: /usr/bin/gcc
  4. -- Check for working C compiler: /usr/bin/gcc -- works
  5. -- Detecting C compiler ABI info
  6. -- Detecting C compiler ABI info - done
  7. -- Check for working CXX compiler: /usr/bin/c++
  8. -- Check for working CXX compiler: /usr/bin/c++ -- works
  9. -- Detecting CXX compiler ABI info
  10. -- Detecting CXX compiler ABI info - done
  11. -- Boost version: 1.50.0
  12. -- Found the following Boost libraries:
  13. --   system
  14. --   filesystem
  15. --   regex
  16. -- Found ext2fs: /usr/lib/libext2fs.so
  17. -- Found audit: /usr/lib/libaudit.a
  18. -- Found auparse: /usr/lib/libauparse.a
  19. -- Looking for include file pthread.h
  20. -- Looking for include file pthread.h - found
  21. -- Looking for pthread_create
  22. -- Looking for pthread_create - not found.
  23. -- Looking for pthread_create in pthreads
  24. -- Looking for pthread_create in pthreads - not found
  25. -- Looking for pthread_create in pthread
  26. -- Looking for pthread_create in pthread - found
  27. -- Found Threads: TRUE
  28. -- Found Gettext: /usr/bin/msgmerge (found version "0.18.1")
  29. -- CPACK: Can not find dpkg in your path, default to i386.
  30. -- Configuring done
  31. -- Generating done
  32. -- Build files have been written to: /home/lahwaacz/stuff/e4rat-lite-git/src/e4rat-lite-git-build
  33. ==> Starting make...
  34. Scanning dependencies of target e4rat-lite-core
  35. Scanning dependencies of target ManPages
  36. [  4%] [  9%] Generating /home/lahwaacz/stuff/e4rat-lite-git/src/e4rat-lite-git/doc/pt_BR/e4rat-lite-collect.8
  37. Building C object src/CMakeFiles/e4rat-lite-core.dir/config.c.o
  38. [ 13%] Building CXX object src/CMakeFiles/e4rat-lite-core.dir/logging.cc.o
  39. [ 18%] Generating /home/lahwaacz/stuff/e4rat-lite-git/src/e4rat-lite-git/doc/pt_BR/e4rat-lite-realloc.8
  40. In file included from /usr/include/boost/filesystem.hpp:15:0,
  41.                  from /home/lahwaacz/stuff/e4rat-lite-git/src/e4rat-lite-git/src/common.hh:24,
  42.                  from /home/lahwaacz/stuff/e4rat-lite-git/src/e4rat-lite-git/src/logging.cc:31:
  43. /usr/include/boost/filesystem/config.hpp:16:5: error: #error Compiling Filesystem version 3 file with BOOST_FILESYSTEM_VERSION defined != 3
  44. [ 22%] Generating /home/lahwaacz/stuff/e4rat-lite-git/src/e4rat-lite-git/doc/pt_BR/e4rat-lite-preload.8
  45. [ 27%] Generating /home/lahwaacz/stuff/e4rat-lite-git/src/e4rat-lite-git/doc/pt_BR/e4rat-lite.conf.5
  46. [ 31%] Generating /home/lahwaacz/stuff/e4rat-lite-git/src/e4rat-lite-git/doc/en_US/e4rat-lite-collect.8
  47. [ 36%] Generating /home/lahwaacz/stuff/e4rat-lite-git/src/e4rat-lite-git/doc/en_US/e4rat-lite-realloc.8
  48. [ 40%] Generating /home/lahwaacz/stuff/e4rat-lite-git/src/e4rat-lite-git/doc/en_US/e4rat-lite-preload.8
  49. [ 45%] Generating /home/lahwaacz/stuff/e4rat-lite-git/src/e4rat-lite-git/doc/en_US/e4rat-lite.conf.5
  50. [ 45%] Built target ManPages
  51. Scanning dependencies of target pofiles
  52. [ 50%] Generating pt_BR.gmo
  53. [ 50%] Built target pofiles
  54. [ 54%] Building CXX object src/CMakeFiles/e4rat-lite-core.dir/common.cc.o
  55. In file included from /usr/include/boost/filesystem.hpp:15:0,
  56.                  from /home/lahwaacz/stuff/e4rat-lite-git/src/e4rat-lite-git/src/common.hh:24,
  57.                  from /home/lahwaacz/stuff/e4rat-lite-git/src/e4rat-lite-git/src/common.cc:20:
  58. /usr/include/boost/filesystem/config.hpp:16:5: error: #error Compiling Filesystem version 3 file with BOOST_FILESYSTEM_VERSION defined != 3
  59. make[2]: *** [src/CMakeFiles/e4rat-lite-core.dir/logging.cc.o] Error 1
  60. make[2]: *** Waiting for unfinished jobs....
  61. /home/lahwaacz/stuff/e4rat-lite-git/src/e4rat-lite-git/src/common.cc: In function ‘std::vector<std::basic_string<char> > matchPath(const string&)’:
  62. /home/lahwaacz/stuff/e4rat-lite-git/src/e4rat-lite-git/src/common.cc:163:57: error: no matching function for call to ‘std::basic_string<char>::basic_string(boost::filesystem::path)
  63. /home/lahwaacz/stuff/e4rat-lite-git/src/e4rat-lite-git/src/common.cc:163:57: note: candidates are:
  64. In file included from /usr/lib/gcc/x86_64-unknown-linux-gnu/4.7.1/../../../../include/c++/4.7.1/string:54:0,
  65.                  from /usr/lib/gcc/x86_64-unknown-linux-gnu/4.7.1/../../../../include/c++/4.7.1/bits/locale_classes.h:42,
  66.                  from /usr/lib/gcc/x86_64-unknown-linux-gnu/4.7.1/../../../../include/c++/4.7.1/bits/ios_base.h:43,
  67.                  from /usr/lib/gcc/x86_64-unknown-linux-gnu/4.7.1/../../../../include/c++/4.7.1/ios:43,
  68.                  from /usr/lib/gcc/x86_64-unknown-linux-gnu/4.7.1/../../../../include/c++/4.7.1/ostream:40,
  69.                  from /usr/lib/gcc/x86_64-unknown-linux-gnu/4.7.1/../../../../include/c++/4.7.1/iterator:64,
  70.                  from /usr/include/boost/iterator.hpp:17,
  71.                  from /usr/include/boost/operators.hpp:86,
  72.                  from /usr/include/boost/system/error_code.hpp:17,
  73.                  from /usr/include/boost/filesystem/path_traits.hpp:23,
  74.                  from /usr/include/boost/filesystem/path.hpp:25,
  75.                  from /usr/include/boost/filesystem.hpp:16,
  76.                  from /home/lahwaacz/stuff/e4rat-lite-git/src/e4rat-lite-git/src/common.hh:24,
  77.                  from /home/lahwaacz/stuff/e4rat-lite-git/src/e4rat-lite-git/src/common.cc:20:
  78. /usr/lib/gcc/x86_64-unknown-linux-gnu/4.7.1/../../../../include/c++/4.7.1/bits/basic_string.h:529:9: note: template<class _InputIterator> std::basic_string::basic_string(_InputIterator, _InputIterator, const _Alloc&)
  79. /usr/lib/gcc/x86_64-unknown-linux-gnu/4.7.1/../../../../include/c++/4.7.1/bits/basic_string.h:529:9: note:   template argument deduction/substitution failed:
  80. /home/lahwaacz/stuff/e4rat-lite-git/src/e4rat-lite-git/src/common.cc:163:57: note:   candidate expects 3 arguments, 1 provided
  81. In file included from /usr/lib/gcc/x86_64-unknown-linux-gnu/4.7.1/../../../../include/c++/4.7.1/string:55:0,
  82.                  from /usr/lib/gcc/x86_64-unknown-linux-gnu/4.7.1/../../../../include/c++/4.7.1/bits/locale_classes.h:42,
  83.                  from /usr/lib/gcc/x86_64-unknown-linux-gnu/4.7.1/../../../../include/c++/4.7.1/bits/ios_base.h:43,
  84.                  from /usr/lib/gcc/x86_64-unknown-linux-gnu/4.7.1/../../../../include/c++/4.7.1/ios:43,
  85.                  from /usr/lib/gcc/x86_64-unknown-linux-gnu/4.7.1/../../../../include/c++/4.7.1/ostream:40,
  86.                  from /usr/lib/gcc/x86_64-unknown-linux-gnu/4.7.1/../../../../include/c++/4.7.1/iterator:64,
  87.                  from /usr/include/boost/iterator.hpp:17,
  88.                  from /usr/include/boost/operators.hpp:86,
  89.                  from /usr/include/boost/system/error_code.hpp:17,
  90.                  from /usr/include/boost/filesystem/path_traits.hpp:23,
  91.                  from /usr/include/boost/filesystem/path.hpp:25,
  92.                  from /usr/include/boost/filesystem.hpp:16,
  93.                  from /home/lahwaacz/stuff/e4rat-lite-git/src/e4rat-lite-git/src/common.hh:24,
  94.                  from /home/lahwaacz/stuff/e4rat-lite-git/src/e4rat-lite-git/src/common.cc:20:
  95. /usr/lib/gcc/x86_64-unknown-linux-gnu/4.7.1/../../../../include/c++/4.7.1/bits/basic_string.tcc:221:5: note: std::basic_string<_CharT, _Traits, _Alloc>::basic_string(std::basic_string<_CharT, _Traits, _Alloc>::size_type, _CharT, const _Alloc&) [with _CharT = char; _Traits = std::char_traits<char>; _Alloc = std::allocator<char>; std::basic_string<_CharT, _Traits, _Alloc>::size_type = long unsigned int]
  96. /usr/lib/gcc/x86_64-unknown-linux-gnu/4.7.1/../../../../include/c++/4.7.1/bits/basic_string.tcc:221:5: note:   candidate expects 3 arguments, 1 provided
  97. /usr/lib/gcc/x86_64-unknown-linux-gnu/4.7.1/../../../../include/c++/4.7.1/bits/basic_string.tcc:214:5: note: std::basic_string<_CharT, _Traits, _Alloc>::basic_string(const _CharT*, const _Alloc&) [with _CharT = char; _Traits = std::char_traits<char>; _Alloc = std::allocator<char>]
  98. /usr/lib/gcc/x86_64-unknown-linux-gnu/4.7.1/../../../../include/c++/4.7.1/bits/basic_string.tcc:214:5: note:   no known conversion for argument 1 from ‘boost::filesystem::path’ to ‘const char*’
  99. /usr/lib/gcc/x86_64-unknown-linux-gnu/4.7.1/../../../../include/c++/4.7.1/bits/basic_string.tcc:207:5: note: std::basic_string<_CharT, _Traits, _Alloc>::basic_string(const _CharT*, std::basic_string<_CharT, _Traits, _Alloc>::size_type, const _Alloc&) [with _CharT = char; _Traits = std::char_traits<char>; _Alloc = std::allocator<char>; std::basic_string<_CharT, _Traits, _Alloc>::size_type = long unsigned int]
  100. /usr/lib/gcc/x86_64-unknown-linux-gnu/4.7.1/../../../../include/c++/4.7.1/bits/basic_string.tcc:207:5: note:   candidate expects 3 arguments, 1 provided
  101. /usr/lib/gcc/x86_64-unknown-linux-gnu/4.7.1/../../../../include/c++/4.7.1/bits/basic_string.tcc:195:5: note: std::basic_string<_CharT, _Traits, _Alloc>::basic_string(const std::basic_string<_CharT, _Traits, _Alloc>&, std::basic_string<_CharT, _Traits, _Alloc>::size_type, std::basic_string<_CharT, _Traits, _Alloc>::size_type, const _Alloc&) [with _CharT = char; _Traits = std::char_traits<char>; _Alloc = std::allocator<char>; std::basic_string<_CharT, _Traits, _Alloc> = std::basic_string<char>; std::basic_string<_CharT, _Traits, _Alloc>::size_type = long unsigned int]
  102. /usr/lib/gcc/x86_64-unknown-linux-gnu/4.7.1/../../../../include/c++/4.7.1/bits/basic_string.tcc:195:5: note:   candidate expects 4 arguments, 1 provided
  103. /usr/lib/gcc/x86_64-unknown-linux-gnu/4.7.1/../../../../include/c++/4.7.1/bits/basic_string.tcc:185:5: note: std::basic_string<_CharT, _Traits, _Alloc>::basic_string(const std::basic_string<_CharT, _Traits, _Alloc>&, std::basic_string<_CharT, _Traits, _Alloc>::size_type, std::basic_string<_CharT, _Traits, _Alloc>::size_type) [with _CharT = char; _Traits = std::char_traits<char>; _Alloc = std::allocator<char>; std::basic_string<_CharT, _Traits, _Alloc> = std::basic_string<char>; std::basic_string<_CharT, _Traits, _Alloc>::size_type = long unsigned int]
  104. /usr/lib/gcc/x86_64-unknown-linux-gnu/4.7.1/../../../../include/c++/4.7.1/bits/basic_string.tcc:185:5: note:   candidate expects 3 arguments, 1 provided
  105. /usr/lib/gcc/x86_64-unknown-linux-gnu/4.7.1/../../../../include/c++/4.7.1/bits/basic_string.tcc:171:5: note: std::basic_string<_CharT, _Traits, _Alloc>::basic_string(const std::basic_string<_CharT, _Traits, _Alloc>&) [with _CharT = char; _Traits = std::char_traits<char>; _Alloc = std::allocator<char>; std::basic_string<_CharT, _Traits, _Alloc> = std::basic_string<char>]
  106. /usr/lib/gcc/x86_64-unknown-linux-gnu/4.7.1/../../../../include/c++/4.7.1/bits/basic_string.tcc:171:5: note:   no known conversion for argument 1 from ‘boost::filesystem::path’ to ‘const std::basic_string<char>&’
  107. /usr/lib/gcc/x86_64-unknown-linux-gnu/4.7.1/../../../../include/c++/4.7.1/bits/basic_string.tcc:179:5: note: std::basic_string<_CharT, _Traits, _Alloc>::basic_string(const _Alloc&) [with _CharT = char; _Traits = std::char_traits<char>; _Alloc = std::allocator<char>]
  108. /usr/lib/gcc/x86_64-unknown-linux-gnu/4.7.1/../../../../include/c++/4.7.1/bits/basic_string.tcc:179:5: note:   no known conversion for argument 1 from ‘boost::filesystem::path’ to ‘const std::allocator<char>&’
  109. In file included from /usr/lib/gcc/x86_64-unknown-linux-gnu/4.7.1/../../../../include/c++/4.7.1/string:54:0,
  110.                  from /usr/lib/gcc/x86_64-unknown-linux-gnu/4.7.1/../../../../include/c++/4.7.1/bits/locale_classes.h:42,
  111.                  from /usr/lib/gcc/x86_64-unknown-linux-gnu/4.7.1/../../../../include/c++/4.7.1/bits/ios_base.h:43,
  112.                  from /usr/lib/gcc/x86_64-unknown-linux-gnu/4.7.1/../../../../include/c++/4.7.1/ios:43,
  113.                  from /usr/lib/gcc/x86_64-unknown-linux-gnu/4.7.1/../../../../include/c++/4.7.1/ostream:40,
  114.                  from /usr/lib/gcc/x86_64-unknown-linux-gnu/4.7.1/../../../../include/c++/4.7.1/iterator:64,
  115.                  from /usr/include/boost/iterator.hpp:17,
  116.                  from /usr/include/boost/operators.hpp:86,
  117.                  from /usr/include/boost/system/error_code.hpp:17,
  118.                  from /usr/include/boost/filesystem/path_traits.hpp:23,
  119.                  from /usr/include/boost/filesystem/path.hpp:25,
  120.                  from /usr/include/boost/filesystem.hpp:16,
  121.                  from /home/lahwaacz/stuff/e4rat-lite-git/src/e4rat-lite-git/src/common.hh:24,
  122.                  from /home/lahwaacz/stuff/e4rat-lite-git/src/e4rat-lite-git/src/common.cc:20:
  123. /usr/lib/gcc/x86_64-unknown-linux-gnu/4.7.1/../../../../include/c++/4.7.1/bits/basic_string.h:434:7: note: std::basic_string<_CharT, _Traits, _Alloc>::basic_string() [with _CharT = char; _Traits = std::char_traits<char>; _Alloc = std::allocator<char>]
  124. /usr/lib/gcc/x86_64-unknown-linux-gnu/4.7.1/../../../../include/c++/4.7.1/bits/basic_string.h:434:7: note:   candidate expects 0 arguments, 1 provided
  125. /home/lahwaacz/stuff/e4rat-lite-git/src/e4rat-lite-git/src/common.cc:172:41: error: ‘class boost::filesystem::directory_entry’ has no member named ‘leaf’
  126. /home/lahwaacz/stuff/e4rat-lite-git/src/e4rat-lite-git/src/common.cc:173:39: error: ‘class boost::filesystem::directory_entry’ has no member named ‘string’
  127. make[2]: *** [src/CMakeFiles/e4rat-lite-core.dir/common.cc.o] Error 1
  128. make[1]: *** [src/CMakeFiles/e4rat-lite-core.dir/all] Error 2
  129. make: *** [all] Error 2