Guest User

Untitled

a guest
Jan 28th, 2017
14
0
Never
Not a member of Pastebin yet? Sign Up, it unlocks many cool features!
Make 14.70 KB | None | 0 0
  1.                                           ^
  2. /usr/local/include/boost/network/protocol/http/impl/request.hpp:198:56: warning: declaration shadows a field of
  3.       'boost::network::http::impl::body_wrapper<basic_request<tags::http_server> >' [-Wshadow]
  4.   body_wrapper(basic_request<tags::http_server> const& request_)
  5.                                                        ^
  6. /usr/local/include/boost/network/protocol/http/impl/request.hpp:197:43: note: previous declaration is here
  7.   basic_request<tags::http_server> const& request_;
  8.                                           ^
  9. /usr/local/include/boost/network/protocol/http/impl/request.hpp:207:53: warning: declaration shadows a field of
  10.       'boost::network::http::impl::request_headers_wrapper<tags::http_async_server>' [-Wshadow]
  11.       basic_request<tags::http_async_server> const& request_)
  12.                                                     ^
  13. /usr/local/include/boost/network/protocol/http/impl/request.hpp:205:49: note: previous declaration is here
  14.   basic_request<tags::http_async_server> const& request_;
  15.                                                 ^
  16. /usr/local/include/boost/network/protocol/http/impl/request.hpp:218:62: warning: declaration shadows a field of
  17.       'boost::network::http::impl::body_wrapper<basic_request<tags::http_async_server> >' [-Wshadow]
  18.   body_wrapper(basic_request<tags::http_async_server> const& request_)
  19.                                                              ^
  20. /usr/local/include/boost/network/protocol/http/impl/request.hpp:217:49: note: previous declaration is here
  21.   basic_request<tags::http_async_server> const& request_;
  22.                                                 ^
  23. In file included from /wrkdirs/usr/ports/sysutils/osquery/work/osquery-2.2.3/osquery/config/plugins/tls.cpp:26:
  24. In file included from /wrkdirs/usr/ports/sysutils/osquery/work/osquery-2.2.3/osquery/remote/utility.h:17:
  25. In file included from /wrkdirs/usr/ports/sysutils/osquery/work/osquery-2.2.3/osquery/remote/transports/tls.h:44:
  26. In file included from /usr/local/include/boost/network/protocol/http/client.hpp:26:
  27. In file included from /usr/local/include/boost/network/protocol/http/client/facade.hpp:12:
  28. In file included from /usr/local/include/boost/network/protocol/http/client/pimpl.hpp:16:
  29. In file included from /usr/local/include/boost/network/protocol/http/traits/connection_policy.hpp:13:
  30. In file included from /usr/local/include/boost/network/protocol/http/policies/async_connection.hpp:17:
  31. In file included from /usr/local/include/boost/network/protocol/http/client/connection/async_base.hpp:14:
  32. /usr/local/include/boost/network/protocol/http/client/connection/async_normal.hpp:87:69: warning: declaration shadows a field of
  33.       'http_async_connection<Tag, version_major, version_minor>' [-Wshadow]
  34.   virtual response start(request const& request, string_type const& method,
  35.                                                                     ^
  36. /usr/local/include/boost/network/protocol/http/client/connection/async_normal.hpp:501:15: note: previous declaration is here
  37.   string_type method;
  38.               ^
  39. In file included from /wrkdirs/usr/ports/sysutils/osquery/work/osquery-2.2.3/osquery/config/plugins/tls.cpp:26:
  40. In file included from /wrkdirs/usr/ports/sysutils/osquery/work/osquery-2.2.3/osquery/remote/utility.h:17:
  41. In file included from /wrkdirs/usr/ports/sysutils/osquery/work/osquery-2.2.3/osquery/remote/transports/tls.h:44:
  42. In file included from /usr/local/include/boost/network/protocol/http/client.hpp:13:
  43. In file included from /usr/local/include/boost/network/protocol/http/request.hpp:18:
  44. In file included from /usr/local/include/boost/network/protocol/http/message/wrappers/uri.hpp:10:
  45. In file included from /usr/local/include/boost/network/uri/uri.hpp:13:
  46. /usr/local/include/boost/network/uri/detail/uri_parts.hpp:72:13: error: use of overloaded operator '=' is ambiguous (with operand types
  47.       'optional<iterator_range<std::__1::__wrap_iter<const char *> > >' and 'iterator_range<std::__1::__wrap_iter<const char *> >')
  48.       query = iterator_range<FwdIter>(boost::end(hier_part.path.get()),
  49.       ~~~~~ ^ ~~~~~~~~~~~~~~~~~~~~~~~~~~~~~~~~~~~~~~~~~~~~~~~~~~~~~~~~~
  50. /usr/local/include/boost/network/uri/uri.hpp:184:16: note: in instantiation of member function 'boost::network::uri::detail::uri_parts<std::__1::__wrap_iter<const char *>
  51.      >::update' requested here
  52.     uri_parts_.update();
  53.                ^
  54. /usr/local/include/boost/optional/optional.hpp:902:5: note: candidate function [with Expr = boost::iterator_range<std::__1::__wrap_iter<const char *> >]
  55.     operator= ( Expr&& expr )
  56.     ^
  57. /usr/local/include/boost/optional/optional.hpp:964:5: note: candidate function [with T_ = boost::iterator_range<std::__1::__wrap_iter<const char *> >]
  58.     operator= ( T_&& val )
  59.     ^
  60. /usr/local/include/boost/optional/optional.hpp:951:15: note: candidate function
  61.     optional& operator= ( optional && rhs )
  62.               ^
  63. /usr/local/include/boost/optional/optional.hpp:943:15: note: candidate function
  64.     optional& operator= ( optional const& rhs )
  65.               ^
  66. In file included from /wrkdirs/usr/ports/sysutils/osquery/work/osquery-2.2.3/osquery/config/plugins/tls.cpp:26:
  67. In file included from /wrkdirs/usr/ports/sysutils/osquery/work/osquery-2.2.3/osquery/remote/utility.h:17:
  68. In file included from /wrkdirs/usr/ports/sysutils/osquery/work/osquery-2.2.3/osquery/remote/transports/tls.h:44:
  69. In file included from /usr/local/include/boost/network/protocol/http/client.hpp:13:
  70. In file included from /usr/local/include/boost/network/protocol/http/request.hpp:18:
  71. In file included from /usr/local/include/boost/network/protocol/http/message/wrappers/uri.hpp:10:
  72. In file included from /usr/local/include/boost/network/uri/uri.hpp:13:
  73. /usr/local/include/boost/network/uri/detail/uri_parts.hpp:77:16: error: use of overloaded operator '=' is ambiguous (with operand types
  74.       'optional<iterator_range<std::__1::__wrap_iter<const char *> > >' and 'iterator_range<std::__1::__wrap_iter<const char *> >')
  75.       fragment = iterator_range<FwdIter>(boost::end(query.get()),
  76.       ~~~~~~~~ ^ ~~~~~~~~~~~~~~~~~~~~~~~~~~~~~~~~~~~~~~~~~~~~~~~~
  77. /usr/local/include/boost/optional/optional.hpp:902:5: note: candidate function [with Expr = boost::iterator_range<std::__1::__wrap_iter<const char *> >]
  78.     operator= ( Expr&& expr )
  79.     ^
  80. /usr/local/include/boost/optional/optional.hpp:964:5: note: candidate function [with T_ = boost::iterator_range<std::__1::__wrap_iter<const char *> >]
  81.     operator= ( T_&& val )
  82.     ^
  83. /usr/local/include/boost/optional/optional.hpp:951:15: note: candidate function
  84.     optional& operator= ( optional && rhs )
  85.               ^
  86. /usr/local/include/boost/optional/optional.hpp:943:15: note: candidate function
  87.     optional& operator= ( optional const& rhs )
  88.               ^
  89. In file included from /wrkdirs/usr/ports/sysutils/osquery/work/osquery-2.2.3/osquery/config/plugins/tls.cpp:26:
  90. In file included from /wrkdirs/usr/ports/sysutils/osquery/work/osquery-2.2.3/osquery/remote/utility.h:17:
  91. In file included from /wrkdirs/usr/ports/sysutils/osquery/work/osquery-2.2.3/osquery/remote/transports/tls.h:44:
  92. In file included from /usr/local/include/boost/network/protocol/http/client.hpp:13:
  93. In file included from /usr/local/include/boost/network/protocol/http/request.hpp:18:
  94. In file included from /usr/local/include/boost/network/protocol/http/message/wrappers/uri.hpp:10:
  95. In file included from /usr/local/include/boost/network/uri/uri.hpp:13:
  96. /usr/local/include/boost/network/uri/detail/uri_parts.hpp:31:19: error: use of overloaded operator '=' is ambiguous (with operand types
  97.       'optional<iterator_range<std::__1::__wrap_iter<const char *> > >' and 'iterator_range<std::__1::__wrap_iter<const char *> >')
  98.         user_info = iterator_range<FwdIter>(boost::begin(host.get()),
  99.         ~~~~~~~~~ ^ ~~~~~~~~~~~~~~~~~~~~~~~~~~~~~~~~~~~~~~~~~~~~~~~~~
  100. /usr/local/include/boost/network/uri/detail/uri_parts.hpp:69:15: note: in instantiation of member function
  101.       'boost::network::uri::detail::hierarchical_part<std::__1::__wrap_iter<const char *> >::update' requested here
  102.     hier_part.update();
  103.               ^
  104. /usr/local/include/boost/network/uri/uri.hpp:184:16: note: in instantiation of member function 'boost::network::uri::detail::uri_parts<std::__1::__wrap_iter<const char *>
  105.      >::update' requested here
  106.     uri_parts_.update();
  107.                ^
  108. /usr/local/include/boost/optional/optional.hpp:902:5: note: candidate function [with Expr = boost::iterator_range<std::__1::__wrap_iter<const char *> >]
  109.     operator= ( Expr&& expr )
  110.     ^
  111. /usr/local/include/boost/optional/optional.hpp:964:5: note: candidate function [with T_ = boost::iterator_range<std::__1::__wrap_iter<const char *> >]
  112.     operator= ( T_&& val )
  113.     ^
  114. /usr/local/include/boost/optional/optional.hpp:951:15: note: candidate function
  115.     optional& operator= ( optional && rhs )
  116.               ^
  117. /usr/local/include/boost/optional/optional.hpp:943:15: note: candidate function
  118.     optional& operator= ( optional const& rhs )
  119.               ^
  120. In file included from /wrkdirs/usr/ports/sysutils/osquery/work/osquery-2.2.3/osquery/config/plugins/tls.cpp:26:
  121. In file included from /wrkdirs/usr/ports/sysutils/osquery/work/osquery-2.2.3/osquery/remote/utility.h:17:
  122. In file included from /wrkdirs/usr/ports/sysutils/osquery/work/osquery-2.2.3/osquery/remote/transports/tls.h:44:
  123. In file included from /usr/local/include/boost/network/protocol/http/client.hpp:13:
  124. In file included from /usr/local/include/boost/network/protocol/http/request.hpp:18:
  125. In file included from /usr/local/include/boost/network/protocol/http/message/wrappers/uri.hpp:10:
  126. In file included from /usr/local/include/boost/network/uri/uri.hpp:13:
  127. /usr/local/include/boost/network/uri/detail/uri_parts.hpp:40:12: error: use of overloaded operator '=' is ambiguous (with operand types
  128.       'optional<iterator_range<std::__1::__wrap_iter<const char *> > >' and 'iterator_range<std::__1::__wrap_iter<const char *> >')
  129.       host = iterator_range<FwdIter>(boost::begin(path.get()),
  130.       ~~~~ ^ ~~~~~~~~~~~~~~~~~~~~~~~~~~~~~~~~~~~~~~~~~~~~~~~~~
  131. /usr/local/include/boost/optional/optional.hpp:902:5: note: candidate function [with Expr = boost::iterator_range<std::__1::__wrap_iter<const char *> >]
  132.     operator= ( Expr&& expr )
  133.     ^
  134. /usr/local/include/boost/optional/optional.hpp:964:5: note: candidate function [with T_ = boost::iterator_range<std::__1::__wrap_iter<const char *> >]
  135.     operator= ( T_&& val )
  136.     ^
  137. /usr/local/include/boost/optional/optional.hpp:951:15: note: candidate function
  138.     optional& operator= ( optional && rhs )
  139.               ^
  140. /usr/local/include/boost/optional/optional.hpp:943:15: note: candidate function
  141.     optional& operator= ( optional const& rhs )
  142.               ^
  143. In file included from /wrkdirs/usr/ports/sysutils/osquery/work/osquery-2.2.3/osquery/config/plugins/tls.cpp:26:
  144. In file included from /wrkdirs/usr/ports/sysutils/osquery/work/osquery-2.2.3/osquery/remote/utility.h:17:
  145. In file included from /wrkdirs/usr/ports/sysutils/osquery/work/osquery-2.2.3/osquery/remote/transports/tls.h:44:
  146. In file included from /usr/local/include/boost/network/protocol/http/client.hpp:13:
  147. In file included from /usr/local/include/boost/network/protocol/http/request.hpp:18:
  148. In file included from /usr/local/include/boost/network/protocol/http/message/wrappers/uri.hpp:10:
  149. In file included from /usr/local/include/boost/network/uri/uri.hpp:13:
  150. /usr/local/include/boost/network/uri/detail/uri_parts.hpp:45:12: error: use of overloaded operator '=' is ambiguous (with operand types
  151.       'optional<iterator_range<std::__1::__wrap_iter<const char *> > >' and 'iterator_range<std::__1::__wrap_iter<const char *> >')
  152.       port = iterator_range<FwdIter>(boost::end(host.get()),
  153.       ~~~~ ^ ~~~~~~~~~~~~~~~~~~~~~~~~~~~~~~~~~~~~~~~~~~~~~~~
  154. /usr/local/include/boost/optional/optional.hpp:902:5: note: candidate function [with Expr = boost::iterator_range<std::__1::__wrap_iter<const char *> >]
  155.     operator= ( Expr&& expr )
  156.     ^
  157. /usr/local/include/boost/optional/optional.hpp:964:5: note: candidate function [with T_ = boost::iterator_range<std::__1::__wrap_iter<const char *> >]
  158.     operator= ( T_&& val )
  159.     ^
  160. /usr/local/include/boost/optional/optional.hpp:951:15: note: candidate function
  161.     optional& operator= ( optional && rhs )
  162.               ^
  163. /usr/local/include/boost/optional/optional.hpp:943:15: note: candidate function
  164.     optional& operator= ( optional const& rhs )
  165.               ^
  166. In file included from /wrkdirs/usr/ports/sysutils/osquery/work/osquery-2.2.3/osquery/config/plugins/tls.cpp:26:
  167. In file included from /wrkdirs/usr/ports/sysutils/osquery/work/osquery-2.2.3/osquery/remote/utility.h:17:
  168. In file included from /wrkdirs/usr/ports/sysutils/osquery/work/osquery-2.2.3/osquery/remote/transports/tls.h:44:
  169. In file included from /usr/local/include/boost/network/protocol/http/client.hpp:13:
  170. In file included from /usr/local/include/boost/network/protocol/http/request.hpp:18:
  171. In file included from /usr/local/include/boost/network/protocol/http/message/wrappers/uri.hpp:10:
  172. In file included from /usr/local/include/boost/network/uri/uri.hpp:13:
  173. /usr/local/include/boost/network/uri/detail/uri_parts.hpp:50:12: error: use of overloaded operator '=' is ambiguous (with operand types
  174.       'optional<iterator_range<std::__1::__wrap_iter<const char *> > >' and 'iterator_range<std::__1::__wrap_iter<const char *> >')
  175.       path = iterator_range<FwdIter>(boost::end(port.get()),
  176.       ~~~~ ^ ~~~~~~~~~~~~~~~~~~~~~~~~~~~~~~~~~~~~~~~~~~~~~~~
  177. /usr/local/include/boost/optional/optional.hpp:902:5: note: candidate function [with Expr = boost::iterator_range<std::__1::__wrap_iter<const char *> >]
  178.     operator= ( Expr&& expr )
  179.     ^
  180. /usr/local/include/boost/optional/optional.hpp:964:5: note: candidate function [with T_ = boost::iterator_range<std::__1::__wrap_iter<const char *> >]
  181.     operator= ( T_&& val )
  182.     ^
  183. /usr/local/include/boost/optional/optional.hpp:951:15: note: candidate function
  184.     optional& operator= ( optional && rhs )
  185.               ^
  186. /usr/local/include/boost/optional/optional.hpp:943:15: note: candidate function
  187.     optional& operator= ( optional const& rhs )
  188.               ^
  189. 45 warnings and 6 errors generated.
  190. gmake[3]: *** [osquery/config/CMakeFiles/osquery_config_plugins.dir/build.make:90: osquery/config/CMakeFiles/osquery_config_plugins.dir/plugins/tls.cpp.o] Error 1
  191. gmake[3]: Leaving directory '/wrkdirs/usr/ports/sysutils/osquery/work/.build'
  192. gmake[2]: *** [CMakeFiles/Makefile2:939: osquery/config/CMakeFiles/osquery_config_plugins.dir/all] Error 2
  193. gmake[2]: Leaving directory '/wrkdirs/usr/ports/sysutils/osquery/work/.build'
  194. gmake[1]: *** [Makefile:142: all] Error 2
  195. gmake[1]: Leaving directory '/wrkdirs/usr/ports/sysutils/osquery/work/.build'
  196. *** Error code 1
  197.  
  198. Stop.
  199. make: stopped in /usr/ports/sysutils/osquery
Advertisement
Add Comment
Please, Sign In to add comment